{"text_format":"2","workbook":"xlsx","n_sheets":6,"sheets":["Price Schedule LOT 2","1. SMK Pemenang","2. SMK Tanjung","3. SMK Gangga","4. SMK Kayangan ","Rab"],"not_rendered":{"charts":0,"images":0,"macros":0,"external_links":1,"defined_names":14,"comments":0,"pivot_tables":0},"unopened":[],"bounds":{"document_bytes":16777216,"sheet_cells":100000,"run_cost":"one","rows_first":2000,"rows_last":500,"rows_between":2000,"halvings":0,"cell_chars":16384,"cell_head_chars":4096},"cells_cut":0,"cells_raw":0,"read":"whole","date_system":"1900"}

{"sheet":"Price Schedule LOT 2","index":0,"n_rows":39,"n_cols":4,"rows_kept":39,"cut":false,"hidden":false,"merged":[[23,0,23,1],[3,1,3,3],[6,0,6,3],[8,0,8,3],[13,0,14,0],[13,2,14,3],[27,1,27,3],[28,1,28,3],[29,1,29,3],[30,1,30,3],[31,1,31,3]]}
["FORM F: Price Schedule Form",null,null,"LOT 2"]
[]
["Name of Bidder:","[Insert Name of Bidder]","Date:","Select date"]
["ITB reference:","[Insert ITB Reference Number]"]
[]
[]
["The Bidder is required to prepare the Price Schedule following the below format. The Price Schedule must include a detailed cost breakdown of all goods and related services to be provided. Separate figures must be provided for each functional grouping or category, if any."]
[]
["Any estimates for cost-reimbursable items, such as travel of experts and out-of-pocket expenses, should be listed separately."]
[]
[null,null,null,"Currency of the Bid: [Insert Currency]"]
["Price Schedule - Bill of Quantities"]
[]
["NO","SUB PROJECT","AMOUNT PRICE"]
[]
[]
[1,"SMK NEGERI 1 PEMENANG"]
[2,"SMK NEGERI 1 TANJUNG"]
[3,"SMK NEGERI 1 GANGGA"]
[4,"SMK NEGERI 1 KAYANGAN"]
[]
[null,"DISCOUNT…...% (Note No. 5)"]
[]
["TOTAL AMOUNT "]
[]
["Note:"]
[]
["1.","UNDP, during evaluation stage, shall ensure that the content of said bills of quantities is unaltered and that it remains identical to that of the original bills of quantities.  In case of any discrepancy between the priced BoQ submitted by the bidder and the original bills of quantities, as posted by UNDP, the UNDP version shall prevail.  "]
["2.","In case of any alteration (change, addition, modification or deletion) in the original BoQ, then this may cause rejection of the bid.  "]
["3.","Bidders shall quote reasonable bid prices with an acceptable margin of deviation in comparison to the real local market prices at the time of bids preparation. "]
["4.","In case of unbalanced pricing (i.e. despite an acceptable total evaluated price, the price of one or more BoQ line items is significantly over or understated). UNDP may have the right to reject the unbalanced bid if it determines that the lack of balance does pose an unacceptable Risk to UNDP. "]
["5. ","If a single bidder is the winner for more than one lot, a discount will be requested given the  efficiency in the operational and overhead costs"]
[]
["Name of Bidder: ",null,"________________________________________________"]
["Authorised signature: ",null,"________________________________________________"]
["Name of authorised signatory:",null,"________________________________________________"]
["Functional Title:",null,"________________________________________________"]
[]
["NOTE: All bids must be exclusive of VAT and other applicable indirect taxes"]

{"sheet":"1. SMK Pemenang","index":1,"n_rows":1552,"n_cols":16,"rows_kept":1552,"cut":false,"hidden":false,"merged":[[11,1,12,1],[11,2,12,11],[11,12,12,13],[11,14,12,14],[11,15,12,15],[2,1,2,15],[4,1,4,15],[5,1,5,15],[7,1,7,15],[9,1,9,15]]}
[]
[]
[null,"BILL OF QUANTITY"]
[]
[null,"Consulting Service for the Design and Construction Supervision for School and Medical Buildings in Lombok "]
[null,"Programme for Earthquake and Tsunami Infrastructure"]
[]
[null,"LOT 2 : SCHOOL FACILITIES"]
[]
[null,"SMK NEGERI 1 PEMENANG, DISTRICT OF NORTH LOMBOK"]
[]
[null,"NO","WORK ITEM",{"$nulls":9},"VOLUME",null,"UNIT PRICE","TOTAL AMOUNT"]
[]
[]
[null,"A","PREPARATION WORK"]
[null,1,"Name Board Of Project Size 1,2 x 0.8 M",{"$nulls":9},1,"Pcs"]
[null,2,"Project Office",{"$nulls":9},12,"M2"]
[null,3,"Material and Equipment Warehouse",{"$nulls":9},12,"M2"]
[null,4,"Documentation (Drone)",{"$nulls":9},1,"Ls"]
[null,5,"Reporting (Shop Drawing, Asbuilt Drawing)",{"$nulls":9},1,"Ls"]
[null,6,"Electricity and water  For project",{"$nulls":9},9,"month"]
[null,7,"HSE ( Health, Safety, and Environment )"]
[null,null,"a. OHS (Occupational Health and Safety)",{"$nulls":9},1,"Ls"]
[null,null,"b. Level of  Air Pollution",{"$nulls":9},2,"Point"]
[null,null,"c. Level of  Vibration During the Project",{"$nulls":9},2,"Point"]
[null,null,"d. Level of  Ground Water Pollution",{"$nulls":9},2,"Point"]
[null,null,"e. Level of  Surface Water Polution",{"$nulls":9},2,"Point"]
[null,null,"f. Reporting Documents ",{"$nulls":9},1,"Ls"]
[]
[null,"V.","CLASS D BUILDING "]
[]
[null,"B","STRUCTURAL WORKS"]
[null,"B.1","SOIL AND FOUNDATION WORKS"]
[null,1,"cleaning Field",{"$nulls":9},400,"M2"]
[null,2,"Safety Fence, t = 2 m",{"$nulls":9},58,"M"]
[null,3,"Bouwplank/ Marking Board",{"$nulls":9},108,"M"]
[null,4,"Termite",{"$nulls":9},400,"M2"]
[null,5,"Soil Excavation Work",{"$nulls":9},432.45600000000002,"M3"]
[null,6,"Soil back Filling",{"$nulls":9},144.15200000000002,"M3"]
[null,7,"Soil Filling on building",{"$nulls":9},12.202999999999999,"M3"]
[null,8,"Lean Concrete Under Fondation",{"$nulls":9},12.202999999999999,"M3"]
[null,9,"Stone foundation (Aastamping)",{"$nulls":9},32.25,"M3"]
[null,10,"Stone Masonry ",{"$nulls":9},92.71875,"M3"]
[]
[null,11," Foot Plate"]
[null,null,"-","Concrete",{"$nulls":8},15.876000000000001,"M3"]
[null,null,"-","Deformed Bar",{"$nulls":8},3746.7360000000003,"Kg"]
[null,null,"-","formwork Foundations",{"$nulls":8},52.914708000000005,"M2"]
[]
[null,12," column Pedestal"]
[null,null,"-","Concrete",{"$nulls":8},3.5831249999999999,"M3"]
[null,null,"-","Deformed Bar",{"$nulls":8},820.53562499999998,"Kg"]
[null,null,"-","formwork column",{"$nulls":8},38.036249999999995,"M2"]
[]
[null,"B.2","CONCRETE WORKS"]
[null,1," Tie Beam SL-01"]
[null,null,"-","Concrete",{"$nulls":8},15.387749999999999,"M3"]
[null,null,"-","Deformed Bar",{"$nulls":8},3277.5907499999998,"Kg"]
[null,null,"-","Formwork Tie Beam",{"$nulls":8},205.16487074999998,"M2"]
[]
{"$rows_left_out":1493}
{"sheet":"2. SMK Tanjung","index":2,"n_rows":1690,"n_cols":11,"rows_kept":1690,"cut":false,"hidden":false,"merged":[[9,1,9,10],[10,1,11,1],[10,2,11,6],[10,7,11,8],[10,9,11,9],[10,10,11,10]]}
[]
[null,"BILL OF QUANTITY"]
[]
[null,"Consulting Service for the Design and Construction Supervision for School and Medical Buildings in Lombok "]
[null,"Programme for Earthquake and Tsunami Infrastructure"]
[]
[null,"LOT 2 : SCHOOL FACILITIES"]
[]
[null,"SMK NEGERI 1 TANJUNG, DISTRICT OF NORTH LOMBOK"]
[]
[null,"No","WORK ITEM",{"$nulls":4},"VOLUME",null,"UNIT PRICE","TOTAL AMOUNT"]
[]
[]
[null,"I","PREPARATION WORK"]
[null,1,"Name Board Of Project Size 1,2 x 0.8 M",{"$nulls":4},1,"Pcs"]
[null,2,"Direction Keet (Project Office)",{"$nulls":4},12,"M²"]
[null,3,"Warehouse of Materials and Tools",{"$nulls":4},12,"M²"]
[null,4,"Documentation (Drone)",{"$nulls":4},1,"Ls"]
[null,5,"Reporting (Shop Drawing, Asbuilt Drawing)",{"$nulls":4},1,"Ls"]
[null,6,"Electricity and water  For project",{"$nulls":4},9,"month"]
[null,7,"HSE ( Health, Safety, and Environment )"]
[null,null,"a. OHS (Occupational Health and Safety)",{"$nulls":4},1,"Ls"]
[null,null,"b. Level of  Air Pollution",{"$nulls":4},2,"Point"]
[null,null,"c. Level of  Vibration During the Project",{"$nulls":4},2,"Point"]
[null,null,"d. Level of  Ground Water Pollution",{"$nulls":4},2,"Point"]
[null,null,"e. Level of  Surface Water Polution",{"$nulls":4},2,"Point"]
[null,null,"f. Reporting Documents ",{"$nulls":4},1,"Ls"]
[]
[null,"II","TEACHER ROOM BUILDING"]
[]
[null,"B","STRUCTURAL WORKS"]
[null,"B.1","SOIL AND FOUNDATION WORKS"]
[null,1,"Field Cleaning",{"$nulls":4},407,"M²"]
[null,2,"Safety Fence t. 2m",{"$nulls":4},54,"M¹"]
[null,3,"Bowplang / Marking",{"$nulls":4},104,"M¹"]
[null,4,"Anti Termite",{"$nulls":4},407,"M²"]
[null,5,"Soil Excavation Work",{"$nulls":4},396.44575000000003,"M³"]
[null,6,"Soil back Filling",{"$nulls":4},132.14858333333333,"M³"]
[null,7,"Soil Filling on building",{"$nulls":4},11.721500000000002,"M³"]
[null,8,"Lean Concrete Under Fondation",{"$nulls":4},11.721500000000002,"M³"]
[null,9,"Stone Foundation (Aastamping)",{"$nulls":4},31.000000000000004,"M³"]
[null,10,"Stone Masonry",{"$nulls":4},89.125,"M³"]
[]
[null,11,"Footplate Foundation FP1"]
[null,null,"concrete",{"$nulls":4},16.919999999999998,"M³"]
[null,null,"deformed bar",{"$nulls":4},3993.1199999999994,"Kg"]
[null,null,"Formwork",{"$nulls":4},56.394359999999999,"M²"]
[]
[null,12,"Pedestal Column FP1 "]
[null,null,"Concrete",{"$nulls":4},7.0852499999999994,"M³"]
[null,null,"deformed bar",{"$nulls":4},1211.5777499999999,"Kg"]
[null,null,"formwork",{"$nulls":4},47.237361749999998,"M²"]
[]
[null,"B.2","CONCRETE WORKS"]
[null,1,"Tie Beam SL-01"]
[null,null,"Concrete",{"$nulls":4},14.759999999999998,"M³"]
[null,null,"deformed bar",{"$nulls":4},3143.8799999999997,"Kg"]
[null,null,"Formwork Tie Beam",{"$nulls":4},196.79507999999998,"M²"]
[]
[null,2,"Column K-01"]
{"$rows_left_out":1631}
{"sheet":"3. SMK Gangga","index":3,"n_rows":933,"n_cols":13,"rows_kept":933,"cut":false,"hidden":false,"merged":[[2,1,2,12],[5,1,5,12],[11,1,12,1],[11,2,12,8],[11,9,12,10],[11,11,12,11],[11,12,12,12]]}
[]
[]
[null,"BILL OF QUANTITY"]
[]
[null,"Consulting Service for the Design and Construction Supervision for School and Medical Buildings in Lombok "]
[null,"Programme for Earthquake and Tsunami Infrastructure"]
[]
[null,"LOT 2 : SCHOOL FACILITIES"]
[]
[null,"SMK NEGERI 1 GANGGA, DISTRICT OF NORTH LOMBOK"]
[]
[null,"NO","WORK ITEM",{"$nulls":6},"VOLUME",null,"UNIT PRICE","TOTAL AMOUNT"]
[]
[]
[null,"I","PREPARATION WORKS"]
[null,1,"Nameboard Of Project",{"$nulls":6},1,"Pcs"]
[null,2,"Direction Keet/Project Office",{"$nulls":6},12,"M₂"]
[null,3,"Warehouse of Material and Tools",{"$nulls":6},12,"M₂"]
[null,4,"Documentation (Drone)",{"$nulls":6},1,"Ls"]
[null,5,"Reporting (Shop Drawing, Asbuilt Drawing)",{"$nulls":6},1,"Ls"]
[null,6,"Electricity and water  For project",{"$nulls":6},9,"month"]
[null,7,"HSE ( Health, Safety, and Environment )"]
[null,null,"a. OHS (Occupational Health and Safety)",{"$nulls":6},1,"Ls"]
[null,null,"b. Level of  Air Pollution",{"$nulls":6},2,"Point"]
[null,null,"c. Level of  Vibration During the Project",{"$nulls":6},2,"Point"]
[null,null,"d. Level of  Ground Water Pollution",{"$nulls":6},2,"Point"]
[null,null,"e. Level of  Surface Water Polution",{"$nulls":6},2,"Point"]
[null,null,"f. Reporting Documents ",{"$nulls":6},1,"Ls"]
[]
[null,"II","ADMINISTRATION BUILDING"]
[null,"B","STRUCTURAL  WORKS"]
[null,"B.1","SOIL & FOUNDATION WORKS"]
[null,1,"Field cleaning ",{"$nulls":6},1098,"M2"]
[null,2,"Safety Fencet. 2m",{"$nulls":6},95.25,"M¹"]
[null,3,"Bowplank/ Marking Board",{"$nulls":6},182.5,"M¹"]
[null,4," Termite",{"$nulls":6},792,"M2"]
[null,5,"Soil Excavation Work",{"$nulls":6},680.84500000000014,"M3"]
[null,6,"Soil Back Filling",{"$nulls":6},226.94833333333338,"M3"]
[null,7,"Soil Filling on Building",{"$nulls":6},20.038000000000004,"M3"]
[null,8," Lean Concrete under Foundation",{"$nulls":6},83.92,"M3"]
[null,9,"Stone Foundation (Aastamping)",{"$nulls":6},51.760000000000005,"M3"]
[null,10,"Stone Masonry",{"$nulls":6},144.72750000000002,"M3"]
[]
[null,11,"Foot Plate FP1"]
[null,null,"Concrete",{"$nulls":6},28.08,"M3"]
[null,null,"Deformed Bar",{"$nulls":6},6626.8799999999992,"Kg"]
[null,null,"Formwork",{"$nulls":6},93.590639999999993,"M2"]
[]
[null,12,"Foot Plate FP2"]
[null,null,"Concrete",{"$nulls":6},0.72,"M3"]
[null,null,"Deformed Bar",{"$nulls":6},169.92,"Kg"]
[null,null,"Formwork",{"$nulls":6},2.3997600000000001,"M2"]
[]
[null,13,"Foot Plate FP3"]
[null,null,"Concrete",{"$nulls":6},2.1120000000000001,"M3"]
[null,null,"Deformed Bar",{"$nulls":6},498.43200000000002,"Kg"]
[null,null,"Formwork",{"$nulls":6},7.0392960000000011,"M2"]
[]
[null,14," Column Pedestal FP1"]
[null,null,"Concrete",{"$nulls":6},11.7585,"M3"]
{"$rows_left_out":874}
{"sheet":"4. SMK Kayangan ","index":4,"n_rows":954,"n_cols":9,"rows_kept":954,"cut":false,"hidden":false,"merged":[[12,0,13,0],[12,1,13,4],[12,5,13,6],[12,7,13,7],[12,8,13,8]]}
[]
[]
["BILL OF QUANTITY"]
[]
["Consulting Service for the Design and Construction Supervision for School and Medical Buildings in Lombok "]
["Programme for Earthquake and Tsunami Infrastructure"]
[]
["LOT 2 : SCHOOL FACILITIES"]
["(STRUCTURE AND ARCHITECTURE WORKS)"]
[]
["SMK NEGERI 1 KAYANGAN, DISTRICT OF NORTH LOMBOK"]
[]
["No","WORK ITEM",null,null,null,"VOLUME",null,"UNIT PRICE","TOTAL AMOUNT"]
[]
["I","PREPARATION WORK"]
[1,"Name Board Of Project Size 1,2 x 0.8 M",null,null,null,1,"Pcs"]
[2,"Direction Keet (Project Office)",null,null,null,12,"M²"]
[3,"Warehouse of Materials and Tools",null,null,null,12,"M²"]
[4,"Documentation (Drone)",null,null,null,1,"Ls"]
[5,"Reporting (Shop Drawing, Asbuilt Drawing)",null,null,null,1,"Ls"]
[7,"Electricity and water  For project",null,null,null,9,"month"]
[8,"HSE ( Health, Safety, and Environment )"]
[null,"a. OHS (Occupational Health and Safety)",null,null,null,1,"Ls"]
[null,"b. Level of  Air Pollution",null,null,null,2,"Point"]
[null,"c. Level of  Vibration During the Project",null,null,null,2,"Point"]
[null,"d. Level of  Ground Water Pollution",null,null,null,2,"Point"]
[null,"e. Level of  Surface Water Polution",null,null,null,2,"Point"]
[null,"f. Reporting Documents ",null,null,null,1,"Ls"]
[]
["II","CLASS A BUILDING"]
[]
["B","STRUCTURAL WORKS"]
["B.1","SOIL AND FOUNDATION WORKS"]
[1,"Field Cleaning",null,null,null,270,"M²"]
[2,"Safety Fence, t = 2m",null,null,null,45,"M¹"]
[3," Bouwplank/ Marking Board",null,null,null,82,"M¹"]
[4," Termite",null,null,null,270,"M²"]
[5,"Soil Excavation Work",null,null,null,188.18110000000001,"M³"]
[6,"Soil back Filling",null,null,null,62.727033333333338,"M³"]
[7,"Soil Filling on building",null,null,null,4.0860000000000003,"M³"]
[8,"Lean Concrete Under Fondation",null,null,null,0.875,"M³"]
[9," Stone Foundation (Aastamping)",null,null,null,24.92,"M³"]
[10,"Stone Masonry",null,null,null,71.644999999999996,"M³"]
[]
[11,"Foot Plate Foundation"]
["a","Concrete K250",null,null,null,12.312000000000001,"M³"]
["b","Deformed Bar",null,null,null,2905.6320000000001,"Kg"]
["c","formwork Foundations",null,null,null,41.035896000000008,"M²"]
[]
[12,"Column Pedestal"]
["a","Concrete K250",null,null,null,2.5460000000000007,"M³"]
["b","Deformed Bar",null,null,null,435.3660000000001,"Kg"]
["c","formwork column",null,null,null,16.974182000000003,"M²"]
[]
["B.2","CONCRETE WORKS"]
[1,"Tie Beam SL-01"]
["a","Concrete K250",null,null,null,9.5343749999999989,"M³"]
["b","Deformed Bar",null,null,null,2030.8218749999999,"Kg"]
["c","Formwork Tie Beam",null,null,null,127.12182187499998,"M²"]
[]
{"$rows_left_out":895}
{"sheet":"Rab","index":5,"n_rows":1846,"n_cols":18,"rows_kept":1846,"cut":false,"hidden":true,"merged":[[6,1,7,1],[6,17,7,17],[6,15,7,15],[6,12,7,13],[6,2,7,11],[6,16,7,16]]}
[]
[null,{"$f":"#REF!","v":{"$error":"#REF!"}},null,null,{"$f":"#REF!","v":{"$error":"#REF!"}},{"$f":"#REF!","v":{"$error":"#REF!"}}]
[null,{"$f":"#REF!","v":{"$error":"#REF!"}},null,null,{"$f":"#REF!","v":{"$error":"#REF!"}},{"$f":"#REF!","v":{"$error":"#REF!"}}]
[null,{"$f":"#REF!","v":{"$error":"#REF!"}},null,null,{"$f":"#REF!","v":{"$error":"#REF!"}},{"$f":"#REF!","v":{"$error":"#REF!"}}]
[null,{"$f":"#REF!","v":{"$error":"#REF!"}},null,null,{"$f":"#REF!","v":{"$error":"#REF!"}}]
[]
[null,{"$f":"#REF!","v":{"$error":"#REF!"}},{"$f":"#REF!","v":{"$error":"#REF!"}},{"$nulls":9},"VOLUME",null,null,"HARGA SATUAN","JUMLAH","JUMLAH T0TAL"]
[]
[]
[null,"I.","PEKERJAAN PERSIAPAN",{"$nulls":14},{"$f":"SUM(Q11:Q17)","v":{"$error":"#REF!"}}]
[null,1,"Papan Nama Proyek",{"$nulls":9},{"$f":"#REF!","v":{"$error":"#REF!"}},{"$f":"#REF!","v":{"$error":"#REF!"}},"A.4.4.0",{"$f":"VLOOKUP(O11,#REF!:#REF!,3,)","v":{"$error":"#REF!"}},{"$f":"M11*P11","v":{"$error":"#REF!"}}]
[null,2,"Kantor Direksi Keet & gudang",{"$nulls":9},{"$f":"#REF!","v":{"$error":"#REF!"}},{"$f":"#REF!","v":{"$error":"#REF!"}},"A.1.3.0",{"$f":"VLOOKUP(O12,#REF!:#REF!,3,)","v":{"$error":"#REF!"}},{"$f":"M12*P12","v":{"$error":"#REF!"}}]
[null,3,"Gudang Bahan dan Peralatan",{"$nulls":9},{"$f":"#REF!","v":{"$error":"#REF!"}},{"$f":"#REF!","v":{"$error":"#REF!"}},"A.1.3.0",{"$f":"VLOOKUP(O13,#REF!:#REF!,3,)","v":{"$error":"#REF!"}},{"$error":"#REF!"}]
[null,4,"Dokumentasi (Drone)",{"$nulls":9},{"$f":"#REF!","v":{"$error":"#REF!"}},{"$f":"#REF!","v":{"$error":"#REF!"}},null,9000000,{"$f":"M14*P14","v":{"$error":"#REF!"}}]
[null,5,"Pelaporan ( Shop Drawing, As Built Drawing )",{"$nulls":9},{"$f":"#REF!","v":{"$error":"#REF!"}},{"$f":"#REF!","v":{"$error":"#REF!"}},null,10000000,{"$error":"#REF!"}]
[null,6,"Pengadaan K3",{"$nulls":9},{"$f":"#REF!","v":{"$error":"#REF!"}},{"$f":"#REF!","v":{"$error":"#REF!"}},null,10000000,{"$f":"P16","v":10000000}]
[null,7,"Listrik dan Air Kerja",{"$nulls":9},{"$f":"#REF!","v":{"$error":"#REF!"}},{"$f":"#REF!","v":{"$error":"#REF!"}},null,2000000,{"$error":"#REF!"}]
[]
[null,"II.","PEMBANGUNAN GEDUNG KELAS A",{"$nulls":14},{"$f":"SUM(Q21:Q84)","v":{"$error":"#REF!"}}]
[null,"A","Pekerjaan Tanah dan Pondasi"]
[null,1,"Pembersihan Lapangan",{"$nulls":9},0,{"$f":"#REF!","v":{"$error":"#REF!"}},"A.1.2.1",{"$f":"VLOOKUP(O21,#REF!:#REF!,3,)","v":{"$error":"#REF!"}},{"$error":"#REF!"}]
[null,2,"Pagar Pengaman Proyek, t = 2m",{"$nulls":9},0,{"$f":"#REF!","v":{"$error":"#REF!"}},"A.1.1.0",{"$f":"VLOOKUP(O22,#REF!:#REF!,3,)","v":{"$error":"#REF!"}},{"$error":"#REF!"}]
[null,3,"Pas. Bouwplank",{"$nulls":9},0,{"$f":"#REF!","v":{"$error":"#REF!"}},"A.1.2.0",{"$f":"VLOOKUP(O23,#REF!:#REF!,3,)","v":{"$error":"#REF!"}},{"$error":"#REF!"}]
[null,4,"Pek. Anti Rayap",{"$nulls":9},0,{"$f":"#REF!","v":{"$error":"#REF!"}},null,20000,0]
[null,5,"Pek. Galian Tanah ",{"$nulls":9},0,{"$f":"#REF!","v":{"$error":"#REF!"}},"A.1.5.0",{"$f":"VLOOKUP(O25,#REF!:#REF!,3,)","v":{"$error":"#REF!"}},{"$error":"#REF!"}]
[null,6,"Urug Tanah Kembali",{"$nulls":9},0,{"$f":"#REF!","v":{"$error":"#REF!"}},"A.1.7.0",{"$f":"VLOOKUP(O26,#REF!:#REF!,3,)","v":{"$error":"#REF!"}},{"$error":"#REF!"}]
[null,7,"Pas. Pasir Urug",{"$nulls":9},0,{"$f":"#REF!","v":{"$error":"#REF!"}},"A.1.9.0",{"$f":"VLOOKUP(O27,#REF!:#REF!,3,)","v":{"$error":"#REF!"}},{"$error":"#REF!"}]
[null,8,"Pas. Lantai Kerja",{"$nulls":9},0,{"$f":"#REF!","v":{"$error":"#REF!"}},"A.3.0.0",{"$f":"VLOOKUP(O28,#REF!:#REF!,3,)","v":{"$error":"#REF!"}},{"$error":"#REF!"}]
[null,9,"Pas. Pondasi Batu Kosong (Aastamping)",{"$nulls":9},0,{"$f":"#REF!","v":{"$error":"#REF!"}},"A.2.2.0",{"$f":"VLOOKUP(O29,#REF!:#REF!,3,)","v":{"$error":"#REF!"}},{"$error":"#REF!"}]
[null,10,"Pas. Pondasi Batu Kali",{"$nulls":9},0,{"$f":"#REF!","v":{"$error":"#REF!"}},"A.2.3.0",{"$f":"VLOOKUP(O30,#REF!:#REF!,3,)","v":{"$error":"#REF!"}},{"$error":"#REF!"}]
[null,11,"Pas. Pondasi Tapak"]
[null,null,"-","Beton",{"$nulls":8},0,{"$f":"#REF!","v":{"$error":"#REF!"}},"A.3.3.0",{"$f":"VLOOKUP(O32,#REF!:#REF!,3,)","v":{"$error":"#REF!"}},{"$error":"#REF!"}]
[null,null,"-","Pembesian",{"$nulls":8},0,{"$f":"#REF!","v":{"$error":"#REF!"}},"A.3.2.0",{"$f":"VLOOKUP(O33,#REF!:#REF!,3,)","v":{"$error":"#REF!"}},{"$error":"#REF!"}]
[null,null,"-","Bekisting Pondasi",{"$nulls":8},0,{"$f":"#REF!","v":{"$error":"#REF!"}},"A.3.4.0",{"$f":"VLOOKUP(O34,#REF!:#REF!,3,)","v":{"$error":"#REF!"}},{"$error":"#REF!"}]
[null,"B","Pekerjaan Struktur"]
[null,1,"Pas. Kolom Pedestal FP 2"]
[null,null,"-","Beton",{"$nulls":8},0,{"$f":"#REF!","v":{"$error":"#REF!"}},"A.3.3.0",{"$f":"VLOOKUP(O37,#REF!:#REF!,3,)","v":{"$error":"#REF!"}},{"$error":"#REF!"}]
[null,null,"-","Pembesian",{"$nulls":8},0,{"$f":"#REF!","v":{"$error":"#REF!"}},"A.3.2.0",{"$f":"VLOOKUP(O38,#REF!:#REF!,3,)","v":{"$error":"#REF!"}},{"$error":"#REF!"}]
[null,null,"-","Bekisting Plat",{"$nulls":8},0,{"$f":"#REF!","v":{"$error":"#REF!"}},"A.3.4.0",{"$f":"VLOOKUP(O39,#REF!:#REF!,3,)","v":{"$error":"#REF!"}},{"$error":"#REF!"}]
[null,2,"Pek. Tie Beam SL-01"]
[null,null,"-","Beton",{"$nulls":8},0,{"$f":"#REF!","v":{"$error":"#REF!"}},"A.3.3.0",{"$f":"VLOOKUP(O41,#REF!:#REF!,3,)","v":{"$error":"#REF!"}},{"$error":"#REF!"}]
[null,null,"-","Pembesian",{"$nulls":8},0,{"$f":"#REF!","v":{"$error":"#REF!"}},"A.3.2.0",{"$f":"VLOOKUP(O42,#REF!:#REF!,3,)","v":{"$error":"#REF!"}},{"$error":"#REF!"}]
[null,null,"-","Bekisting Tie Beam",{"$nulls":8},0,{"$f":"#REF!","v":{"$error":"#REF!"}},"A.3.5.0",{"$f":"VLOOKUP(O43,#REF!:#REF!,3,)","v":{"$error":"#REF!"}},{"$error":"#REF!"}]
[null,3,"Pek. Kolom K-01"]
[null,null,"-","Beton",{"$nulls":8},0,{"$f":"#REF!","v":{"$error":"#REF!"}},"A.3.3.0",{"$f":"VLOOKUP(O45,#REF!:#REF!,3,)","v":{"$error":"#REF!"}},{"$error":"#REF!"}]
[null,null,"-","Pembesian",{"$nulls":8},0,{"$f":"#REF!","v":{"$error":"#REF!"}},"A.3.2.0",{"$f":"VLOOKUP(O46,#REF!:#REF!,3,)","v":{"$error":"#REF!"}},{"$error":"#REF!"}]
[null,null,"-","Bekisting Kolom",{"$nulls":8},0,{"$f":"#REF!","v":{"$error":"#REF!"}},"A.3.6.0",{"$f":"VLOOKUP(O47,#REF!:#REF!,3,)","v":{"$error":"#REF!"}},{"$error":"#REF!"}]
[null,4,"Pek. Ring Balok RB-01"]
[null,null,"-","Beton",{"$nulls":8},0,{"$f":"#REF!","v":{"$error":"#REF!"}},"A.3.3.0",{"$f":"VLOOKUP(O49,#REF!:#REF!,3,)","v":{"$error":"#REF!"}},{"$error":"#REF!"}]
[null,null,"-","Pembesian",{"$nulls":8},0,{"$f":"#REF!","v":{"$error":"#REF!"}},"A.3.2.0",{"$f":"VLOOKUP(O50,#REF!:#REF!,3,)","v":{"$error":"#REF!"}},{"$error":"#REF!"}]
[null,null,"-","Bekisting Balok",{"$nulls":8},0,{"$f":"#REF!","v":{"$error":"#REF!"}},"A.3.7.0",{"$f":"VLOOKUP(O51,#REF!:#REF!,3,)","v":{"$error":"#REF!"}},{"$error":"#REF!"}]
[null,5,"Pekerjaan Atap"]
[null,null,"-","Pas. Kuda-kuda Baja Ringan",{"$nulls":8},0,{"$f":"#REF!","v":{"$error":"#REF!"}},"A.4.3.0",{"$f":"VLOOKUP(O53,#REF!:#REF!,3,)","v":{"$error":"#REF!"}},{"$error":"#REF!"}]
[null,null,"-","Pas. Penutup Atap",{"$nulls":8},0,{"$f":"#REF!","v":{"$error":"#REF!"}},"A.4.8.0",{"$f":"VLOOKUP(O54,#REF!:#REF!,3,)","v":{"$error":"#REF!"}},{"$error":"#REF!"}]
[null,null,"-","Pas. Nok Atap",{"$nulls":8},0,{"$f":"#REF!","v":{"$error":"#REF!"}},"A.4.9.0",{"$f":"VLOOKUP(O55,#REF!:#REF!,3,)","v":{"$error":"#REF!"}},{"$error":"#REF!"}]
[null,null,"-","Pas. Listplank",{"$nulls":8},0,{"$f":"#REF!","v":{"$error":"#REF!"}},"A.4.7.0",{"$f":"VLOOKUP(O56,#REF!:#REF!,3,)","v":{"$error":"#REF!"}},{"$error":"#REF!"}]
[null,null,"-","Pas. Talang",{"$nulls":8},0,{"$f":"#REF!","v":{"$error":"#REF!"}},"A.5.7.0",{"$f":"VLOOKUP(O57,#REF!:#REF!,3,)","v":{"$error":"#REF!"}},{"$error":"#REF!"}]
[null,6,"Pek. Plat Lantai"]
[null,null,"-","Beton",{"$nulls":8},0,{"$f":"#REF!","v":{"$error":"#REF!"}},"A.3.1.0",{"$f":"VLOOKUP(O59,#REF!:#REF!,3,)","v":{"$error":"#REF!"}},{"$error":"#REF!"}]
[null,null,"-","Pasir Urug",{"$nulls":8},0,{"$f":"#REF!","v":{"$error":"#REF!"}},"A.1.9.0",{"$f":"VLOOKUP(O60,#REF!:#REF!,3,)","v":{"$error":"#REF!"}},{"$error":"#REF!"}]
{"$rows_left_out":1786}