{"text_format":"2","workbook":"xlsx","n_sheets":13,"sheets":["INSTITUTIONAL","INSTITUTIONAL VENDOR","Log_file","DD","Zip Postal Code","Region","Tax_Number","Bank_key","IBAN_requirments","e.g. different language","Validation","DD_SD","PAyment terms"],"not_rendered":{"charts":0,"images":0,"macros":0,"external_links":0,"defined_names":260,"comments":2,"pivot_tables":0},"unopened":[],"bounds":{"document_bytes":16777216,"sheet_cells":100000,"run_cost":"one","rows_first":2000,"rows_last":500,"rows_between":2000,"halvings":0,"cell_chars":16384,"cell_head_chars":4096},"cells_cut":0,"cells_raw":0,"read":"whole","date_system":"1900"}

{"sheet":"INSTITUTIONAL","index":0,"n_rows":60,"n_cols":9,"rows_kept":60,"cut":false,"hidden":false,"merged":[[2,2,2,3],[1,1,1,4],[3,0,3,4],[22,0,22,4],[23,1,24,4],[11,2,12,2],[50,1,50,4],[45,1,45,4],[11,1,12,1],[55,1,55,4],[60,1,60,4],[53,2,53,4],[52,2,52,4],[36,1,36,4],[48,2,49,4],[48,1,49,1],[47,1,47,4]]}
[]
[null,"MDM VENDOR MASTER REGISTRATION TEMPLATE FOR INSTITUTIONAL VENDORS\n(last updated on 2020.02.25)"]
[null,null,{"$f":"VLOOKUP(C7,Request_Type,2,0)","v":"There are mandatory fields missing for the creation request.\nComplete the fields in red background before submission!"}]
["VENDOR INFORMATION"]
[null,"1. Request information",null,"3. Name/Address"]
[null,"Business Area of LFP","4410 - Ukraine","Company Name","AKSIUTA TETIANA Individual Entepreneur"]
[null,"Request type ","Create ","Search Term"]
[null,"Vendor Number (mandatory for Update/Block/Unblock)",null,"House number",103]
[null,"Vendor Account Group","ZFV Field Office Vendors","Street","Pereyaslavskaya"]
[null,"Prepayment enabled","… Select","Zip / Postal code"]
[null,"UNGM Number",null,"City","Dnipro"]
[null,"Purpose of vendor","Corporate Contract","Country","441 Ukraine",null,{"$f":"IF(E12=\"… Select\",\"…_Select\",SUBSTITUTE(RIGHT(E12,LEN(E12)-4),\" \",\"_\")&\"_Regions\")","v":"Ukraine_Regions"}]
[null,null,null,"Region","… Select",null,{"$f":"IFERROR(AND(VLOOKUP(E12,Region_Required_Table,2,0)=\"Yes\",C7=\"Create \",OR(E13=\"\",E13=\"… Select\")),FALSE)","v":false}]
[null,"2. Contact"]
[null,"Telephone","380961478054"]
[null,"Mobile Telephone","380961478054"]
[null,"Fax"]
[null,"Name of Contact","AKSIUTA TETIANA"]
[null,"Contact person's E-mail Address  ","oplata.anuka@gmail.com"]
[null,"E-mail Address (Payment advice)  ","oplata.anuka@gmail.com"]
[null,"WEB Site",null,"TAX ID #","2506100308",null,{"$f":"AND(C7=\"Create \",E21=\"\",NOT(ISERROR(VLOOKUP(C35,Mandatory_Tax_countries,1,0)=\"Yes\")))","v":false}]
[]
["Banking Information"]
[null,"Please provide proof of Bank Account - copy of cancelled check or bank statement or bank letter"]
[]
[null,"4. Bank Account Information"]
[null,"Account Type","01 - Current/Checking account"]
[null,"Vendor's Bank Account Number","UA483052990000026008050274847"]
[null,"Account holder's name","AKSIUTA TETIANA"]
[null,"IBAN","UA483052990000026008050274847",{"$nulls":5},{"$f":"IF(AND(C7=\"Create \",C30=\"\",VLOOKUP(C35,IBAN_requirments!A2:B236,2,0)=\"YES*\"),TRUE,FALSE)","v":false}]
[null,"Bank Account Currency ","UAH Ukrainian Hryvnia"]
[null,"5. Bank Information"]
[null,"Name of Bank","JOINT-STOCK COMPANYCOMMERCIAL BANK \"PRIVATBANK\""]
[null,{"$f":"\nIF(OR(ISERROR(VLOOKUP($C$6,Business_Area,1,0)),ISERROR(VLOOKUP($C$31,Currency,1,0)),,ISERROR(VLOOKUP($C$35,Bank_Country_Code,1,0))),\"Bank key\",\n\nIF(OR($C$6=\"\",$C$6=\"… Select\",$C$35=\"\",$C$35=\"… Select\",$C$31=\"\",$C$31=\"… Select\"),\"Bank key\",\n\nIF(AND(LEFT($C$6,3)=LEFT($C$35,3),OR(VLOOKUP($C$35,List_Local_Currencies,2,0)=INSTITUTIONAL!$C$31,VLOOKUP($C$35,List_Local_Currencies,3,0)=INSTITUTIONAL!$C$31)),\n\nVLOOKUP($C$35,List_Bank_Key_Types,2,0),VLOOKUP($C$35,List_Bank_Key_Types,3,0))))","v":"SWIFT Code"},"305299"]
[null,"Bank Country","441 Ukraine"]
[null,"Account is Add or Replacement","Add Additional Account"]
[null,"Only visible for Implementing Partners - Vendor Account Group PRG2"]
[null,"Partner Type","… Select","Date of Assessment (as per HACT procedure)\n(Date Format: DD.MM.YYYY)",null,null,null,{"$f":"AND(C7=\"Create \",C9=\"PRG2 Implementing Partners\",OR(C38=\"\",C38=\"… Select\"))","v":false},{"$f":"IF(AND(C7=\"Create \",C9=\"PRG2 Implementing Partners\",OR(C38=\"CSO - Civil Society Organisations\",C38=\"GOVT - Government\"),E38=\"\"),TRUE,FALSE)","v":false}]
[null,"Civil Society Organization Type (if it is CSO)","… Select","Date of Positive Assessment against core values [mandatory for National CSO, Community Based Organisation and Academic Institution]\n(Date Format: DD.MM.YYYY)",null,null,null,{"$f":"AND(C7=\"Create \",C9=\"PRG2 Implementing Partners\",C38=\"CSO - Civil Society Organisations\",OR(C39=\"\",C39=\"… Select\"))","v":false},{"$f":"IF(AND(C7=\"Create \",C9=\"PRG2 Implementing Partners\",C38=\"CSO - Civil Society Organisations\",E39=\"\",C39<>\"Intenational NGO\"),TRUE,FALSE)","v":false}]
[null,null,null,"Type of Assessment as per HACT Procedure","… Select",null,null,null,{"$f":"IF(AND(C7=\"Create \",C9=\"PRG2 Implementing Partners\",OR(C38=\"CSO - Civil Society Organisations\",C38=\"GOVT - Government\"),OR(E40=\"\",E40=\"… Select\")),TRUE,FALSE)","v":false}]
[null,"INGO Parent List [Click this link and write name of parent org below]",null,"Risk Rating (in case the Type of Assessment is Others, risk rating cannot be Not Required)","… Select",null,null,null,{"$f":"IF(AND(C7=\"Create \",C9=\"PRG2 Implementing Partners\",OR(C38=\"CSO - Civil Society Organisations\",C38=\"GOVT - Government\"),OR(E41=\"\",E41=\"… Select\")),TRUE,FALSE)","v":false}]
[null,"UN & Bi-Multilateral Org [Click this link and write name of parent org below]",null,"Permitted Payee Vendor Number (if applicable) ",{"$nulls":4},{"$f":"AND(C7=\"Create \",E6<>\"\",E9<>\"\",E11<>\"\",C15<>\"\",C20<>\"\",AND(C9<>\"… Select\",C9<>\"\"),AND(C6<>\"… Select\",C6<>\"\"),AND(E12<>\"… Select\",E12<>\"\"),C28<>\"\",C29<>\"\",I30=FALSE,AND(C31<>\"… Select\",C31<>\"\"),C34<>\"\",AND(C35<>\"… Select\",C35<>\"\"),AND(C9=\"PRG2 Implementing Partners\",AND(C38<>\"… Select\",C38<>\"\")),AND(C9=\"PRG2 Implementing Partners\",C38<>\"CSO - Civil Society Organisations\",OR(C39<>\"\",C39<>\"… Select\")),I38=FALSE,I39=FALSE,I40=FALSE,I41=FALSE,H43=FALSE,H44=FALSE,H45=FALSE)","v":false}]
[null,"Name of Parent Organisation [mandatory for Bilateral/Multilateral, UN Agency and International CSO]",null,"House Bank",null,null,null,{"$f":"IF(AND(C7=\"Create \",C9=\"PRG2 Implementing Partners\",OR(AND(C38=\"CSO - Civil Society Organisations\",C39=\"Intenational NGO\"),C38=\"UN - UN Agency\",C38=\"Bilateral/Multilateral\"),C43=\"\"),TRUE,FALSE)","v":false}]
[null,"Date of Protection from Sexual Exploitation and Abuse (PSEA) Assessment\n[mandatory for National CSO, Community Based Organisation and Academic Institution]\n(Date Format: DD.MM.YYYY)",null,"Payment method","… Select",null,null,{"$f":"IF(AND(C7=\"Create \",C9=\"PRG2 Implementing Partners\",C38=\"CSO - Civil Society Organisations\",C44=\"\"),TRUE,FALSE)","v":false}]
[null,"Risk Rating of Protection from Sexual Exploitation and Abuse (PSEA) Assessment","… Select",{"$nulls":4},{"$f":"IF(AND(C7=\"Create \",C9=\"PRG2 Implementing Partners\",C38=\"CSO - Civil Society Organisations\",OR(C45=\"\",C45=\"… Select\")),TRUE,FALSE)","v":false}]
[null,"Only visible for Block Request Type"]
[null,"Action",{"$f":"C7","v":"Create "},"Please provide the reason","… Select"]
[]
[null,"Additional Instructions or Remarks ",{"$nulls":5},{"$f":"AND(C7=\"Block\",C49=\"\",AND(E47<>\"\",E47<>\"Inactive, vendor won't be used anymore.\",E47<>\"… Select\"))","v":false}]
[]
[]
[]
[null,"Prepared by (Name/Section) :       ","Maryna Kazachynska, Supply & Logistics Associate"]
[null,"Approved by (Name/Section):  "]
[]
[null,"GSSC Agent Use Only"]
[null,"Agent"]
[null,"Case Number"]
[null,"Payment method ","BCLNTU"]
[null,"Payment Terms","Z120 Within 30 days Due net","Effective start date",{"$f":"TODAY()","v":"2021-02-03"}]

{"sheet":"INSTITUTIONAL VENDOR","index":1,"n_rows":60,"n_cols":11,"rows_kept":60,"cut":false,"hidden":true,"merged":[[52,2,52,4],[53,2,53,4],[55,1,55,4],[60,1,60,4],[36,1,36,4],[45,1,45,4],[47,1,47,4],[48,1,49,1],[48,2,49,4],[50,1,50,4],[23,1,24,4],[1,1,1,4],[3,0,3,4],[11,1,12,1],[11,2,12,2],[22,0,22,4]]}
[]
[null,"MDM VENDOR MASTER REGISTRATION TEMPLATE FOR INSTITUTIONAL VENDORS"]
[]
["VENDOR INFORMATION"]
[null,"1. Request information",null,"3. Name/Address"]
[null,"Business Area of LFP",{"$f":"IF(INSTITUTIONAL!C6<>\"\",INSTITUTIONAL!C6,\"\")","v":"4410 - Ukraine"},"Company Name",{"$f":"TRIM(SUBSTITUTE(SUBSTITUTE(SUBSTITUTE(SUBSTITUTE(SUBSTITUTE(SUBSTITUTE(SUBSTITUTE(SUBSTITUTE(SUBSTITUTE(SUBSTITUTE(SUBSTITUTE(SUBSTITUTE(SUBSTITUTE(SUBSTITUTE(SUBSTITUTE(SUBSTITUTE(SUBSTITUTE(SUBSTITUTE(SUBSTITUTE(SUBSTITUTE(SUBSTITUTE(SUBSTITUTE(SUBSTITUTE(SUBSTITUTE(SUBSTITUTE(SUBSTITUTE(SUBSTITUTE(SUBSTITUTE(SUBSTITUTE(SUBSTITUTE(SUBSTITUTE(SUBSTITUTE(SUBSTITUTE(SUBSTITUTE(SUBSTITUTE(SUBSTITUTE(SUBSTITUTE(SUBSTITUTE(SUBSTITUTE(SUBSTITUTE(SUBSTITUTE(SUBSTITUTE(SUBSTITUTE(SUBSTITUTE(SUBSTITUTE(SUBSTITUTE(SUBSTITUTE(SUBSTITUTE(SUBSTITUTE(SUBSTITUTE(SUBSTITUTE(SUBSTITUTE(SUBSTITUTE(SUBSTITUTE(SUBSTITUTE(SUBSTITUTE(SUBSTITUTE(SUBSTITUTE(SUBSTITUTE(SUBSTITUTE(SUBSTITUTE(SUBSTITUTE(LEFT(INSTITUTIONAL!E6,40),\"-\",\" \"),\"/\",\"\"),\",\",\"\"),\"á\",\"a\"),\"č\",\"c\"),\"ñ\",\"n\"),\"ë\",\"e\"),\"(\",\"\"),\")\",\"\"),CHAR(224),\"a\"),CHAR(225),\"a\"),CHAR(226),\"a\"),CHAR(228),\"a\"),CHAR(230),\"ae\"),CHAR(231),\"c\"),CHAR(232),\"e\"),CHAR(233),\"e\"),CHAR(234),\"e\"),CHAR(235),\"e\"),CHAR(236),\"i\"),CHAR(237),\"i\"),CHAR(238),\"i\"),CHAR(239),\"i\"),CHAR(241),\"n\"),CHAR(242),\"o\"),CHAR(243),\"o\"),CHAR(246),\"o\"),CHAR(250),\"u\"),CHAR(251),\"u\"),CHAR(252),\"u\"),CHAR(253),\"y\"),\"ć\",\"c\"),\"œ\",\"oe\"),\"ő\",\"o\"),\"ű\",\"u\"),\"À\",\"A\"),\"Á\",\"A\"),\"Ä\",\"A\"),\"Æ\",\"AE\"),\"Ç\",\"C\"),\"È\",\"E\"),\"É\",\"E\"),\"Ê\",\"E\"),\"Ë\",\"E\"),\"Ì\",\"I\"),\"Í\",\"I\"),\"Î\",\"I\"),\"Ï\",\"I\"),\"Ñ\",\"N\"),\"Ò\",\"O\"),\"Ó\",\"O\"),\"Ö\",\"O\"),\"Ú\",\"U\"),\"Û\",\"U\"),\"Ü\",\"U\"),\"Œ\",\"OE\"),\"Ć\",\"C\"),\"Ő\",\"O\"),\"Ű\",\"U\"),\"'\",\" \"),\"&\",\"and\"),\".\",\"\"))","v":"AKSIUTA TETIANA Individual Entepreneur"}]
[null,"Request type ",{"$f":"IF(INSTITUTIONAL!C7=\"Create \",\"Create \",\"Request type is not Create, script can’t be run!\")","v":"Create "},"Search Term",{"$f":"IF(NOT(ISBLANK(INSTITUTIONAL!E7)),LEFT(TRIM(INSTITUTIONAL!E7),20),\"\")","v":""}]
[null,"Vendor Number (mandatory for Update/Block/Unblock)",{"$f":"IF(INSTITUTIONAL!C8<>\"\",INSTITUTIONAL!C8,\"\")","v":""},"House number",{"$f":"SUBSTITUTE(SUBSTITUTE(SUBSTITUTE(SUBSTITUTE(SUBSTITUTE(SUBSTITUTE(SUBSTITUTE(SUBSTITUTE(SUBSTITUTE(SUBSTITUTE(SUBSTITUTE(SUBSTITUTE(SUBSTITUTE(SUBSTITUTE(SUBSTITUTE(SUBSTITUTE(SUBSTITUTE(SUBSTITUTE(SUBSTITUTE(SUBSTITUTE(SUBSTITUTE(SUBSTITUTE(SUBSTITUTE(SUBSTITUTE(SUBSTITUTE(SUBSTITUTE(SUBSTITUTE(SUBSTITUTE(SUBSTITUTE(SUBSTITUTE(SUBSTITUTE(SUBSTITUTE(SUBSTITUTE(SUBSTITUTE(SUBSTITUTE(SUBSTITUTE(SUBSTITUTE(SUBSTITUTE(SUBSTITUTE(SUBSTITUTE(SUBSTITUTE(SUBSTITUTE(LEFT(INSTITUTIONAL!E8,10),\"-\",\" \"),\".\",\"\"),\"/\",\"\"),\",\",\" \"),\"°\",\"\"),\"º\",\"\"),\"˚\",\"\"),CHAR(33),\"\"),CHAR(34),\"\"),CHAR(35),\"\"),CHAR(36),\"\"),CHAR(37),\"\"),CHAR(38),\"\"),CHAR(39),\"\"),CHAR(40),\"\"),CHAR(41),\"\"),CHAR(42),\"\"),CHAR(43),\"\"),CHAR(45),\"\"),CHAR(47),\"\"),CHAR(58),\"\"),CHAR(59),\"\"),CHAR(60),\"\"),CHAR(61),\"\"),CHAR(62),\"\"),CHAR(63),\"\"),CHAR(64),\"\"),CHAR(91),\"\"),CHAR(92),\"\"),CHAR(93),\"\"),CHAR(94),\"\"),CHAR(95),\"\"),CHAR(96),\"\"),CHAR(123),\"\"),CHAR(124),\"\"),CHAR(125),\"\"),CHAR(126),\"\"),CHAR(127),\"\"),CHAR(145),\"\"),CHAR(146),\"\"),CHAR(147),\"\"),CHAR(148),\"\")","v":"103"}]
[null,"Vendor Account Group",{"$f":"IF(ISERROR(VLOOKUP(INSTITUTIONAL!C9,Vendor_account_group,1,0)),\"Invalid account group!\",\n\nIF(AND(INSTITUTIONAL!C9=\"ZUN UN Agencies\",OR(NOT(LEFT(C8,1)=\"U\"),NOT(LEN(SUBSTITUTE(TRIM(C8),\" \",\"\"))=6))),\"Incorrect or Missing UN Vendor Number!\",\n\nIF(AND(INSTITUTIONAL!C9=\"ZFO UNICEF Field Offices\",OR(NOT(LEFT(C8,1)=\"F\"),NOT(LEN(SUBSTITUTE(TRIM(C8),\" \",\"\"))=6))),\"Incorrect or Missing Field Office Vendor Number!\",\n\nIF(AND(INSTITUTIONAL!C9=\"ZNC National Committees\",OR(NOT(LEFT(C8,1)=\"C\"),NOT(LEN(SUBSTITUTE(TRIM(C8),\" \",\"\"))=6))),\"Incorrect or Missing Nat Committee Vendor Number!\",\n\nIF(AND(INSTITUTIONAL!C9=\"ZTVA Travel Agency\",OR(NOT(LEFT(C8,2)=\"TV\"),NOT(LEN(SUBSTITUTE(TRIM(C8),\" \",\"\"))>=6))),\"Incorrect or Missing Travel Agency Vendor Number!\",\n\nIF(AND(OR(INSTITUTIONAL!C9=\"ZCNT Institutional Contractors\",INSTITUTIONAL!C9=\"ZFV Field Office Vendors\",INSTITUTIONAL!C9=\"PRG2 Implementing Partners\"),NOT(ISBLANK(INSTITUTIONAL!C8))),\"Vendor Number is not empty!\",\n\nIF(AND(INSTITUTIONAL!C9=\"… Select\",C7=\"Create \"),\"Missing Vendor Account Group!\",\n\nINSTITUTIONAL!C9)))))))","v":"ZFV Field Office Vendors"},"Street",{"$f":"SUBSTITUTE(SUBSTITUTE(SUBSTITUTE(SUBSTITUTE(SUBSTITUTE(SUBSTITUTE(SUBSTITUTE(SUBSTITUTE(SUBSTITUTE(SUBSTITUTE(SUBSTITUTE(SUBSTITUTE(SUBSTITUTE(SUBSTITUTE(SUBSTITUTE(SUBSTITUTE(SUBSTITUTE(SUBSTITUTE(SUBSTITUTE(SUBSTITUTE(SUBSTITUTE(SUBSTITUTE(SUBSTITUTE(SUBSTITUTE(SUBSTITUTE(SUBSTITUTE(SUBSTITUTE(SUBSTITUTE(SUBSTITUTE(SUBSTITUTE(SUBSTITUTE(SUBSTITUTE(SUBSTITUTE(SUBSTITUTE(SUBSTITUTE(SUBSTITUTE(SUBSTITUTE(SUBSTITUTE(SUBSTITUTE(SUBSTITUTE(SUBSTITUTE(SUBSTITUTE(SUBSTITUTE(SUBSTITUTE(SUBSTITUTE(SUBSTITUTE(SUBSTITUTE(LEFT(INSTITUTIONAL!E9,60),\"-\",\" \"),\".\",\"\"),\"/\",\"\"),\",\",\" \"),\"°\",\"\"),\"º\",\"\"),\"˚\",\"\"),\"á\",\"a\"),\"č\",\"c\"),\"ñ\",\"n\"),\"ë\",\"e\"),\"é\",\"e\"),CHAR(33),\"\"),CHAR(34),\"\"),CHAR(35),\"\"),CHAR(36),\"\"),CHAR(37),\"\"),CHAR(38),\"\"),CHAR(39),\"\"),CHAR(40),\"\"),CHAR(41),\"\"),CHAR(42),\"\"),CHAR(43),\"\"),CHAR(45),\"\"),CHAR(47),\"\"),CHAR(58),\"\"),CHAR(59),\"\"),CHAR(60),\"\"),CHAR(61),\"\"),CHAR(62),\"\"),CHAR(63),\"\"),CHAR(64),\"\"),CHAR(91),\"\"),CHAR(92),\"\"),CHAR(93),\"\"),CHAR(94),\"\"),CHAR(95),\"\"),CHAR(96),\"\"),CHAR(123),\"\"),CHAR(124),\"\"),CHAR(125),\"\"),CHAR(126),\"\"),CHAR(127),\"\"),CHAR(145),\"\"),CHAR(146),\"\"),CHAR(147),\"\"),CHAR(148),\"\")","v":"Pereyaslavskaya"}]
[null,"Prepayment enabled",{"$f":"IF(INSTITUTIONAL!C10=\"\",\"\",\n\nIF(OR(INSTITUTIONAL!C10=\"… Select\",INSTITUTIONAL!C10=\"Yes\",INSTITUTIONAL!C10=\"No\"),INSTITUTIONAL!C10,\"\"))","v":"… Select"},"Zip / Postal code",{"$f":"IF(INSTITUTIONAL!E12=\"345 Poland\",IF(AND(ISNUMBER(VALUE(LEFT(INSTITUTIONAL!E10,2))),ISNUMBER(SEARCH(\"-\",INSTITUTIONAL!E10,3)),ISNUMBER(VALUE(RIGHT(INSTITUTIONAL!E10,3)))),LEFT(INSTITUTIONAL!E10,6),\"\"),IF(INSTITUTIONAL!E12=\"072 Canada\",IF(AND(NOT(ISNUMBER(VALUE(LEFT(INSTITUTIONAL!E10,1)))),ISNUMBER(VALUE(MID(INSTITUTIONAL!E10,2,1))),NOT(ISNUMBER(VALUE(LEFT(INSTITUTIONAL!E10,3)))),ISNUMBER(SEARCH(\" \",INSTITUTIONAL!E10,4)),ISNUMBER(VALUE(MID(INSTITUTIONAL!E10,5,1))),NOT(ISNUMBER(VALUE(LEFT(INSTITUTIONAL!E10,6)))),ISNUMBER(VALUE(MID(INSTITUTIONAL!E10,7,1)))),LEFT(INSTITUTIONAL!E10,7),\"\"),IF(VLOOKUP(LEFT(E12,3),'Zip Postal Code'!A:D,4,FALSE)=\"4\",IF(ISNUMBER(VALUE(TRIM(SUBSTITUTE(INSTITUTIONAL!E10,\" \",\"\")))),IF(VALUE(VLOOKUP(LEFT(E12,3),'Zip Postal Code'!A:D,2,FALSE))=LEN(TRIM(SUBSTITUTE(INSTITUTIONAL!E10,\" \",\"\"))),TRIM(SUBSTITUTE(INSTITUTIONAL!E10,\" \",\"\")),\"\"),\"\"),IF(VLOOKUP(LEFT(E12,3),'Zip Postal Code'!A:D,4,FALSE)=\"3\",IF(VALUE(VLOOKUP(LEFT(E12,3),'Zip Postal Code'!A:D,2,FALSE))=LEN(TRIM(SUBSTITUTE(INSTITUTIONAL!E10,\" \",\"\"))),TRIM(SUBSTITUTE(INSTITUTIONAL!E10,\" \",\"\")),\"\"),IF(VLOOKUP(LEFT(E12,3),'Zip Postal Code'!A:D,4,FALSE)=\"2\",IF(ISNUMBER(VALUE(TRIM(SUBSTITUTE(INSTITUTIONAL!E10,\" \",\"\")))),IF(VALUE(VLOOKUP(LEFT(E12,3),'Zip Postal Code'!A:D,2,FALSE))>=LEN(TRIM(SUBSTITUTE(INSTITUTIONAL!E10,\" \",\"\"))),TRIM(SUBSTITUTE(INSTITUTIONAL!E10,\" \",\"\")),\"\"),\"\"),IF(VLOOKUP(LEFT(E12,3),'Zip Postal Code'!A:D,4,FALSE)=\"1\",IF(VALUE(VLOOKUP(LEFT(E12,3),'Zip Postal Code'!A:D,2,FALSE))>=LEN(TRIM(SUBSTITUTE(INSTITUTIONAL!E10,\" \",\"\"))),TRIM(SUBSTITUTE(INSTITUTIONAL!E10,\" \",\"\")),\"\"),IF(VLOOKUP(LEFT(E12,3),'Zip Postal Code'!A:D,4,FALSE)=\"5\",IF(VALUE(VLOOKUP(LEFT(E12,3),'Zip Postal Code'!A:D,2,FALSE))>=LEN(INSTITUTIONAL!E10),(INSTITUTIONAL!E10),LEFT(INSTITUTIONAL!E10,7)),LEFT(INSTITUTIONAL!E10,10))))))))","v":""}]
[null,"UNGM Number",{"$f":"IF(INSTITUTIONAL!C11<>\"\",\n\nIF(AND(ISNUMBER(VALUE(SUBSTITUTE(TRIM(INSTITUTIONAL!C11),\" \",\"\"))),LEN(SUBSTITUTE(TRIM(INSTITUTIONAL!C11),\" \",\"\"))=6),SUBSTITUTE(TRIM(INSTITUTIONAL!C11),\" \",\"\"),\"Invalid UNGM number, please correct!\"),\n\n\"\")","v":""},"City",{"$f":"SUBSTITUTE(SUBSTITUTE(SUBSTITUTE(SUBSTITUTE(SUBSTITUTE(SUBSTITUTE(SUBSTITUTE(SUBSTITUTE(SUBSTITUTE(SUBSTITUTE(SUBSTITUTE(SUBSTITUTE(SUBSTITUTE(SUBSTITUTE(SUBSTITUTE(SUBSTITUTE(SUBSTITUTE(SUBSTITUTE(SUBSTITUTE(SUBSTITUTE(SUBSTITUTE(SUBSTITUTE(SUBSTITUTE(SUBSTITUTE(SUBSTITUTE(SUBSTITUTE(SUBSTITUTE(SUBSTITUTE(SUBSTITUTE(SUBSTITUTE(SUBSTITUTE(SUBSTITUTE(SUBSTITUTE(SUBSTITUTE(SUBSTITUTE(SUBSTITUTE(SUBSTITUTE(SUBSTITUTE(SUBSTITUTE(SUBSTITUTE(LEFT(INSTITUTIONAL!E11,40),\"-\",\" \"),\".\",\"\"),\"/\",\"\"),\",\",\"\"),\"é\",\"e\"),CHAR(33),\"\"),CHAR(34),\"\"),CHAR(35),\"\"),CHAR(36),\"\"),CHAR(37),\"\"),CHAR(38),\"\"),CHAR(39),\"\"),CHAR(40),\"\"),CHAR(41),\"\"),CHAR(42),\"\"),CHAR(43),\"\"),CHAR(45),\"\"),CHAR(47),\"\"),CHAR(58),\"\"),CHAR(59),\"\"),CHAR(60),\"\"),CHAR(61),\"\"),CHAR(62),\"\"),CHAR(63),\"\"),CHAR(64),\"\"),CHAR(91),\"\"),CHAR(92),\"\"),CHAR(93),\"\"),CHAR(94),\"\"),CHAR(95),\"\"),CHAR(96),\"\"),CHAR(123),\"\"),CHAR(124),\"\"),CHAR(125),\"\"),CHAR(126),\"\"),CHAR(127),\"\"),CHAR(145),\"\"),CHAR(146),\"\"),CHAR(147),\"\"),CHAR(148),\"\")","v":"Dnipro"}]
[null,"Purpose of vendor",{"$f":"IF(INSTITUTIONAL!C12<>\"\",INSTITUTIONAL!C12,\"\")","v":"Corporate Contract"},"Country",{"$f":"IF(INSTITUTIONAL!E12<>\"\",INSTITUTIONAL!E12,\"Country is missing!\")","v":"441 Ukraine"}]
[null,null,null,"Region",{"$f":"IFERROR(IF(VLOOKUP(INSTITUTIONAL!$E$12,Region_Required_Table,2,0)=\"Yes\",\n\nIF(OR(ISERROR(VLOOKUP(INSTITUTIONAL!$E$12&\" \"&INSTITUTIONAL!$E$13,Region!A:A,1,0)),ISERROR(VLOOKUP(INSTITUTIONAL!$E$13,Region_Codes_List,1,0))),\"Mandatory Region code is missing or incorrect!\",VLOOKUP(INSTITUTIONAL!$E$13,Region_Codes_List,2,0)),\n\nIF(OR(ISERROR(VLOOKUP(INSTITUTIONAL!$E$12&\" \"&INSTITUTIONAL!$E$13,Region!A:A,1,0)),ISERROR(VLOOKUP(INSTITUTIONAL!$E$13,Region_Codes_List,1,0))),\"\",VLOOKUP(INSTITUTIONAL!$E$13,Region_Codes_List,2,0))),\n\n\"\")","v":""}]
[null,"2. Contact"]
[null,"Telephone",{"$f":"SUBSTITUTE(SUBSTITUTE(SUBSTITUTE(SUBSTITUTE(SUBSTITUTE(SUBSTITUTE(SUBSTITUTE(SUBSTITUTE(SUBSTITUTE(SUBSTITUTE(SUBSTITUTE(SUBSTITUTE(SUBSTITUTE(SUBSTITUTE(SUBSTITUTE(SUBSTITUTE(SUBSTITUTE(SUBSTITUTE(SUBSTITUTE(SUBSTITUTE(SUBSTITUTE(SUBSTITUTE(SUBSTITUTE(SUBSTITUTE(SUBSTITUTE(SUBSTITUTE(SUBSTITUTE(SUBSTITUTE(SUBSTITUTE(SUBSTITUTE(SUBSTITUTE(SUBSTITUTE(SUBSTITUTE(SUBSTITUTE(SUBSTITUTE(SUBSTITUTE(SUBSTITUTE(SUBSTITUTE(SUBSTITUTE(INSTITUTIONAL!C15,\"-\",\"\"),\".\",\"\"),\"/\",\"\"),\",\",\"\"),CHAR(33),\"\"),CHAR(34),\"\"),CHAR(35),\"\"),CHAR(36),\"\"),CHAR(37),\"\"),CHAR(38),\"\"),CHAR(39),\"\"),CHAR(40),\"\"),CHAR(41),\"\"),CHAR(42),\"\"),CHAR(43),\"\"),CHAR(45),\"\"),CHAR(47),\"\"),CHAR(58),\"\"),CHAR(59),\"\"),CHAR(60),\"\"),CHAR(61),\"\"),CHAR(62),\"\"),CHAR(63),\"\"),CHAR(64),\"\"),CHAR(91),\"\"),CHAR(92),\"\"),CHAR(93),\"\"),CHAR(94),\"\"),CHAR(95),\"\"),CHAR(96),\"\"),CHAR(123),\"\"),CHAR(124),\"\"),CHAR(125),\"\"),CHAR(126),\"\"),CHAR(127),\"\"),CHAR(145),\"\"),CHAR(146),\"\"),CHAR(147),\"\"),CHAR(148),\"\")","v":"380961478054"}]
[null,"Mobile Telephone",{"$f":"SUBSTITUTE(SUBSTITUTE(SUBSTITUTE(SUBSTITUTE(SUBSTITUTE(SUBSTITUTE(SUBSTITUTE(SUBSTITUTE(SUBSTITUTE(SUBSTITUTE(SUBSTITUTE(SUBSTITUTE(SUBSTITUTE(SUBSTITUTE(SUBSTITUTE(SUBSTITUTE(SUBSTITUTE(SUBSTITUTE(SUBSTITUTE(SUBSTITUTE(SUBSTITUTE(SUBSTITUTE(SUBSTITUTE(SUBSTITUTE(SUBSTITUTE(SUBSTITUTE(SUBSTITUTE(SUBSTITUTE(SUBSTITUTE(SUBSTITUTE(SUBSTITUTE(SUBSTITUTE(SUBSTITUTE(SUBSTITUTE(SUBSTITUTE(SUBSTITUTE(SUBSTITUTE(SUBSTITUTE(SUBSTITUTE(INSTITUTIONAL!C16,\"-\",\"\"),\".\",\"\"),\"/\",\"\"),\",\",\"\"),CHAR(33),\"\"),CHAR(34),\"\"),CHAR(35),\"\"),CHAR(36),\"\"),CHAR(37),\"\"),CHAR(38),\"\"),CHAR(39),\"\"),CHAR(40),\"\"),CHAR(41),\"\"),CHAR(42),\"\"),CHAR(43),\"\"),CHAR(45),\"\"),CHAR(47),\"\"),CHAR(58),\"\"),CHAR(59),\"\"),CHAR(60),\"\"),CHAR(61),\"\"),CHAR(62),\"\"),CHAR(63),\"\"),CHAR(64),\"\"),CHAR(91),\"\"),CHAR(92),\"\"),CHAR(93),\"\"),CHAR(94),\"\"),CHAR(95),\"\"),CHAR(96),\"\"),CHAR(123),\"\"),CHAR(124),\"\"),CHAR(125),\"\"),CHAR(126),\"\"),CHAR(127),\"\"),CHAR(145),\"\"),CHAR(146),\"\"),CHAR(147),\"\"),CHAR(148),\"\")","v":"380961478054"}]
[null,"Fax",{"$f":"SUBSTITUTE(SUBSTITUTE(SUBSTITUTE(SUBSTITUTE(SUBSTITUTE(SUBSTITUTE(SUBSTITUTE(SUBSTITUTE(SUBSTITUTE(SUBSTITUTE(SUBSTITUTE(SUBSTITUTE(SUBSTITUTE(SUBSTITUTE(SUBSTITUTE(SUBSTITUTE(SUBSTITUTE(SUBSTITUTE(SUBSTITUTE(SUBSTITUTE(SUBSTITUTE(SUBSTITUTE(SUBSTITUTE(SUBSTITUTE(SUBSTITUTE(SUBSTITUTE(SUBSTITUTE(SUBSTITUTE(SUBSTITUTE(SUBSTITUTE(SUBSTITUTE(SUBSTITUTE(SUBSTITUTE(SUBSTITUTE(SUBSTITUTE(SUBSTITUTE(SUBSTITUTE(SUBSTITUTE(SUBSTITUTE(INSTITUTIONAL!C17,\"-\",\"\"),\".\",\"\"),\"/\",\"\"),\",\",\"\"),CHAR(33),\"\"),CHAR(34),\"\"),CHAR(35),\"\"),CHAR(36),\"\"),CHAR(37),\"\"),CHAR(38),\"\"),CHAR(39),\"\"),CHAR(40),\"\"),CHAR(41),\"\"),CHAR(42),\"\"),CHAR(43),\"\"),CHAR(45),\"\"),CHAR(47),\"\"),CHAR(58),\"\"),CHAR(59),\"\"),CHAR(60),\"\"),CHAR(61),\"\"),CHAR(62),\"\"),CHAR(63),\"\"),CHAR(64),\"\"),CHAR(91),\"\"),CHAR(92),\"\"),CHAR(93),\"\"),CHAR(94),\"\"),CHAR(95),\"\"),CHAR(96),\"\"),CHAR(123),\"\"),CHAR(124),\"\"),CHAR(125),\"\"),CHAR(126),\"\"),CHAR(127),\"\"),CHAR(145),\"\"),CHAR(146),\"\"),CHAR(147),\"\"),CHAR(148),\"\")","v":""}]
[null,"Name of Contact",{"$f":"TRIM(PROPER(SUBSTITUTE(SUBSTITUTE(SUBSTITUTE(SUBSTITUTE(SUBSTITUTE(SUBSTITUTE(SUBSTITUTE(SUBSTITUTE(SUBSTITUTE(SUBSTITUTE(SUBSTITUTE(SUBSTITUTE(SUBSTITUTE(SUBSTITUTE(SUBSTITUTE(SUBSTITUTE(SUBSTITUTE(SUBSTITUTE(SUBSTITUTE(SUBSTITUTE(SUBSTITUTE(SUBSTITUTE(SUBSTITUTE(SUBSTITUTE(SUBSTITUTE(SUBSTITUTE(SUBSTITUTE(SUBSTITUTE(SUBSTITUTE(SUBSTITUTE(SUBSTITUTE(SUBSTITUTE(SUBSTITUTE(SUBSTITUTE(SUBSTITUTE(SUBSTITUTE(SUBSTITUTE(SUBSTITUTE(SUBSTITUTE(SUBSTITUTE(SUBSTITUTE(SUBSTITUTE(SUBSTITUTE(SUBSTITUTE(SUBSTITUTE(SUBSTITUTE(SUBSTITUTE(SUBSTITUTE(SUBSTITUTE(SUBSTITUTE(SUBSTITUTE(SUBSTITUTE(SUBSTITUTE(SUBSTITUTE(SUBSTITUTE(SUBSTITUTE(SUBSTITUTE(SUBSTITUTE(SUBSTITUTE(SUBSTITUTE(SUBSTITUTE(SUBSTITUTE(LEFT(INSTITUTIONAL!C18,35),\"-\",\" \"),\"/\",\"\"),\",\",\"\"),\"&\",\"and\"),\"ñ\",\"n\"),\"Dr.\",\"\"),\"Mr.\",\"\"),\"Ms.\",\"\"),\"Mrs.\",\"\"),CHAR(224),\"a\"),CHAR(225),\"a\"),CHAR(226),\"a\"),CHAR(228),\"a\"),CHAR(230),\"ae\"),CHAR(231),\"c\"),CHAR(232),\"e\"),CHAR(233),\"e\"),CHAR(234),\"e\"),CHAR(235),\"e\"),CHAR(236),\"i\"),CHAR(237),\"i\"),CHAR(238),\"i\"),CHAR(239),\"i\"),CHAR(241),\"n\"),CHAR(242),\"o\"),CHAR(243),\"o\"),CHAR(246),\"o\"),CHAR(250),\"u\"),CHAR(251),\"u\"),CHAR(252),\"u\"),CHAR(253),\"y\"),\"ć\",\"c\"),\"œ\",\"oe\"),\"ő\",\"o\"),\"ű\",\"u\"),\"À\",\"A\"),\"Á\",\"A\"),\"Ä\",\"A\"),\"Æ\",\"AE\"),\"Ç\",\"C\"),\"È\",\"E\"),\"É\",\"E\"),\"Ê\",\"E\"),\"Ë\",\"E\"),\"Ì\",\"I\"),\"Í\",\"I\"),\"Î\",\"I\"),\"Ï\",\"I\"),\"Ñ\",\"N\"),\"Ò\",\"O\"),\"Ó\",\"O\"),\"Ö\",\"O\"),\"Ú\",\"U\"),\"Û\",\"U\"),\"Ü\",\"U\"),\"Ý\",\"Y\"),\"Œ\",\"OE\"),\"Ć\",\"C\"),\"Ő\",\"O\"),\"Ű\",\"U\"),\"'\",\" \"),\".\",\"\")))","v":"Aksiuta Tetiana"}]
[null,"Contact person's E-mail Address  ",{"$f":"IF(INSTITUTIONAL!C19=\"\",\"\",\n\nIF(ISNUMBER(SEARCH(\"@\",INSTITUTIONAL!C19)),IF(ISNUMBER(SEARCH(\".\",INSTITUTIONAL!C19)),IF(NOT(ISNUMBER(SEARCH(\",\",INSTITUTIONAL!C19))),IF(NOT(ISNUMBER(SEARCH(\" \",TRIM(INSTITUTIONAL!C19)))),TRIM(SUBSTITUTE(SUBSTITUTE(INSTITUTIONAL!C19,\"ë\",\"e\"),\"ñ\",\"n\")),\n\n\"Incorrect domain!\"),\"Incorrect domain!\"),\"Incorrect domain!\"),\"Incorrect domain!\"))","v":"oplata.anuka@gmail.com"}]
[null,"E-mail Address (Payment advice)  ",{"$f":"IF(INSTITUTIONAL!C20=\"\",\"\",\n\nIF(ISNUMBER(SEARCH(\"@\",INSTITUTIONAL!C20)),IF(ISNUMBER(SEARCH(\".\",INSTITUTIONAL!C20)),IF(NOT(ISNUMBER(SEARCH(\",\",INSTITUTIONAL!C20))),IF(NOT(ISNUMBER(SEARCH(\"  \",TRIM(INSTITUTIONAL!C20)))),TRIM(SUBSTITUTE(SUBSTITUTE(INSTITUTIONAL!C20,\"ñ\",\"n\"),\"ë\",\"e\")),\n\n\"Incorrect domain!\"),\"Incorrect domain!\"),\"Incorrect domain!\"),\"Incorrect domain!\"))","v":"oplata.anuka@gmail.com"}]
[null,"WEB Site",{"$f":"IF(INSTITUTIONAL!C21=\"\",\"\",IF(LEN(TRIM(INSTITUTIONAL!C21))>50,LEFT(TRIM(INSTITUTIONAL!C21),50),INSTITUTIONAL!C21))","v":""},"TAX ID #",{"$f":"IF(INSTITUTIONAL!E21=0,IF(NOT(ISERROR(VLOOKUP(INSTITUTIONAL!C35,Mandatory_Tax_countries,1,0))),\"Mandatory Tax ID Missing!\",\"\"),IF(VLOOKUP(LEFT(INSTITUTIONAL!E12,3),Tax_Number!A:C,3,FALSE)=\"4\",IF(ISNUMBER(VALUE(TRIM(SUBSTITUTE(INSTITUTIONAL!E21,\" \",\"\")))),IF(VALUE(VLOOKUP(LEFT(INSTITUTIONAL!E12,3),Tax_Number!A:C,2,FALSE))=LEN(TRIM(SUBSTITUTE(INSTITUTIONAL!E21,\" \",\"\"))),TRIM(SUBSTITUTE(INSTITUTIONAL!E21,\" \",\"\")),\"\"),\"\"),IF(VLOOKUP(LEFT(INSTITUTIONAL!E12,3),Tax_Number!A:C,3,FALSE)=\"3\",IF(VALUE(VLOOKUP(LEFT(INSTITUTIONAL!E12,3),Tax_Number!A:C,2,FALSE))=LEN(TRIM(SUBSTITUTE(INSTITUTIONAL!E21,\" \",\"\"))),TRIM(SUBSTITUTE(INSTITUTIONAL!E21,\" \",\"\")),\"\"),IF(VLOOKUP(LEFT(INSTITUTIONAL!E12,3),Tax_Number!A:C,3,FALSE)=\"2\",IF(ISNUMBER(VALUE(TRIM(SUBSTITUTE(INSTITUTIONAL!E21,\" \",\"\")))),IF(VALUE(VLOOKUP(LEFT(INSTITUTIONAL!E12,3),Tax_Number!A:C,2,FALSE))>=LEN(TRIM(SUBSTITUTE(INSTITUTIONAL!E21,\" \",\"\"))),TRIM(SUBSTITUTE(INSTITUTIONAL!E21,\" \",\"\")),\"\"),\"\"),IF(VLOOKUP(LEFT(INSTITUTIONAL!E12,3),Tax_Number!A:C,3,FALSE)=\"1\",IF(VALUE(VLOOKUP(LEFT(INSTITUTIONAL!E12,3),Tax_Number!A:C,2,FALSE))>=LEN(TRIM(SUBSTITUTE(INSTITUTIONAL!E21,\" \",\"\"))),TRIM(SUBSTITUTE(INSTITUTIONAL!E21,\" \",\"\")),\"\"),IF(VLOOKUP(LEFT(INSTITUTIONAL!E12,3),Tax_Number!A:C,3,FALSE)=\"5\",IF(VALUE(VLOOKUP(LEFT(INSTITUTIONAL!E12,3),Tax_Number!A:C,2,FALSE))>=LEN(INSTITUTIONAL!E21),IF(INSTITUTIONAL!E21=\"\",\"\",(INSTITUTIONAL!E21)),LEFT(INSTITUTIONAL!E21,16)),LEFT(SUBSTITUTE(TRIM(INSTITUTIONAL!E21),\" \",\"\"),16)))))))","v":"2506100308"}]
[]
["Banking Information"]
[null,"Please provide proof of Bank Account - copy of cancelled check or bank statement or bank letter"]
[]
[null,"4. Bank Account Information",{"$f":"IF(AND(COUNTA(INSTITUTIONAL!C28:C30,INSTITUTIONAL!C34)<>0,C12=\"Bidding\"), \"Banking Information must be empty in case of Bidding!\",\"\")","v":""}]
[null,"Account Type",{"$f":"IF(OR(AND(INSTITUTIONAL!C35=\"689 Mozambique\",INSTITUTIONAL!C34<>\"SBICMZMXXXX\"),INSTITUTIONAL!C35=\"681 Angola\"),RIGHT(TRIM(INSTITUTIONAL!C28),2),\n\nIF(INSTITUTIONAL!C35=\"370 Russian Fed.\",LEFT(TRIM(SUBSTITUTE(INSTITUTIONAL!C27,\" \",\"\")),2),\n\nIF(AND(NOT(OR(INSTITUTIONAL!C27=\"01 - Current/Checking account\",INSTITUTIONAL!C27=\"02 - Saving account\")),OR(INSTITUTIONAL!C35=\"138 El Salvador\",INSTITUTIONAL!C35=\"093 Colombia\")),\"Mandatory Account type is missing!\",\n\nIF(INSTITUTIONAL!C27<>\"\",INSTITUTIONAL!C27,\"\"))))","v":"01 - Current/Checking account"}]
[null,"Vendor's Bank Account Number",{"$f":"IF(INSTITUTIONAL!$C$28=\"\",\"\",\n\nIF(INSTITUTIONAL!$C$35=\"142 Eritrea\",INSTITUTIONAL!C28,\n\nIF(INSTITUTIONAL!$C$35=\"414 Syria, Arab Rep\",INSTITUTIONAL!C28,\n\nIF(AND(INSTITUTIONAL!$C$35=\"399 Spain\",LEN(INSTITUTIONAL!C28)<>10),\"Spanish account number must be 10 digits!\",\n\nIF(AND(INSTITUTIONAL!$C$35=\"348 Portugal\",LEN(INSTITUTIONAL!C28)>11),\"Portuguese account number must be 11 digits or less!\",\n\nIF(OR(AND(INSTITUTIONAL!C35=\"689 Mozambique\",INSTITUTIONAL!C34<>\"SBICMZMXXXX\"),INSTITUTIONAL!C35=\"681 Angola\"),LEFT(SUBSTITUTE(TRIM(INSTITUTIONAL!C28),\" \",\"\"),LEN(SUBSTITUTE(TRIM(INSTITUTIONAL!C28),\" \",\"\"))-2),\n\nIF(INSTITUTIONAL!C35=\"370 Russian Fed.\",RIGHT(SUBSTITUTE(TRIM(INSTITUTIONAL!C28),\" \",\"\"),LEN(SUBSTITUTE(TRIM(INSTITUTIONAL!C28),\" \",\"\"))-2),\n\nSUBSTITUTE(SUBSTITUTE(SUBSTITUTE(SUBSTITUTE(SUBSTITUTE(SUBSTITUTE(SUBSTITUTE(SUBSTITUTE(SUBSTITUTE(SUBSTITUTE(SUBSTITUTE(SUBSTITUTE(SUBSTITUTE(SUBSTITUTE(SUBSTITUTE(SUBSTITUTE(SUBSTITUTE(SUBSTITUTE(SUBSTITUTE(SUBSTITUTE(SUBSTITUTE(SUBSTITUTE(SUBSTITUTE(SUBSTITUTE(SUBSTITUTE(SUBSTITUTE(SUBSTITUTE(SUBSTITUTE(SUBSTITUTE(SUBSTITUTE(SUBSTITUTE(SUBSTITUTE(SUBSTITUTE(SUBSTITUTE(SUBSTITUTE(SUBSTITUTE(SUBSTITUTE(SUBSTITUTE(SUBSTITUTE(INSTITUTIONAL!C28,\"-\",\"\"),\".\",\"\"),\" \",\"\"),\"/\",\"\"),CHAR(33),\"\"),CHAR(34),\"\"),CHAR(35),\"\"),CHAR(36),\"\"),CHAR(37),\"\"),CHAR(38),\"\"),CHAR(39),\"\"),CHAR(40),\"\"),CHAR(41),\"\"),CHAR(42),\"\"),CHAR(43),\"\"),CHAR(45),\"\"),CHAR(47),\"\"),CHAR(58),\"\"),CHAR(59),\"\"),CHAR(60),\"\"),CHAR(61),\"\"),CHAR(62),\"\"),CHAR(63),\"\"),CHAR(64),\"\"),CHAR(91),\"\"),CHAR(92),\"\"),CHAR(93),\"\"),CHAR(94),\"\"),CHAR(95),\"\"),CHAR(96),\"\"),CHAR(123),\"\"),CHAR(124),\"\"),CHAR(125),\"\"),CHAR(126),\"\"),CHAR(127),\"\"),CHAR(145),\"\"),CHAR(146),\"\"),CHAR(147),\"\"),CHAR(148),\"\"))))))))","v":"UA483052990000026008050274847"}]
[null,"Account holder's name",{"$f":"IF(INSTITUTIONAL!$C$35=\"207 Indonesia\",INSTITUTIONAL!C29,IF(INSTITUTIONAL!$C$35=\"520 Vietnam\",INSTITUTIONAL!C29,TRIM(SUBSTITUTE(SUBSTITUTE(SUBSTITUTE(SUBSTITUTE(SUBSTITUTE(SUBSTITUTE(SUBSTITUTE(SUBSTITUTE(SUBSTITUTE(SUBSTITUTE(SUBSTITUTE(SUBSTITUTE(SUBSTITUTE(SUBSTITUTE(SUBSTITUTE(SUBSTITUTE(SUBSTITUTE(SUBSTITUTE(SUBSTITUTE(SUBSTITUTE(SUBSTITUTE(SUBSTITUTE(SUBSTITUTE(SUBSTITUTE(SUBSTITUTE(SUBSTITUTE(SUBSTITUTE(SUBSTITUTE(SUBSTITUTE(SUBSTITUTE(SUBSTITUTE(SUBSTITUTE(SUBSTITUTE(SUBSTITUTE(SUBSTITUTE(SUBSTITUTE(SUBSTITUTE(SUBSTITUTE(SUBSTITUTE(SUBSTITUTE(SUBSTITUTE(SUBSTITUTE(SUBSTITUTE(SUBSTITUTE(SUBSTITUTE(SUBSTITUTE(SUBSTITUTE(SUBSTITUTE(SUBSTITUTE(SUBSTITUTE(SUBSTITUTE(SUBSTITUTE(SUBSTITUTE(SUBSTITUTE(SUBSTITUTE(SUBSTITUTE(SUBSTITUTE(SUBSTITUTE(SUBSTITUTE(SUBSTITUTE(SUBSTITUTE(LEFT(INSTITUTIONAL!C29,60),\"-\",\" \"),\"/\",\"\"),\",\",\"\"),\"  \",\" \"),\"&\",\"and\"),\"ñ\",\"n\"),\"č\",\"c\"),\"á\",\"a\"),CHAR(224),\"a\"),CHAR(225),\"a\"),CHAR(226),\"a\"),CHAR(228),\"a\"),CHAR(230),\"ae\"),CHAR(231),\"c\"),CHAR(232),\"e\"),CHAR(233),\"e\"),CHAR(234),\"e\"),CHAR(235),\"e\"),CHAR(236),\"i\"),CHAR(237),\"i\"),CHAR(238),\"i\"),CHAR(239),\"i\"),CHAR(241),\"n\"),CHAR(242),\"o\"),CHAR(243),\"o\"),CHAR(246),\"o\"),CHAR(250),\"u\"),CHAR(251),\"u\"),CHAR(252),\"u\"),CHAR(253),\"y\"),\"ć\",\"c\"),\"œ\",\"oe\"),\"ő\",\"o\"),\"ű\",\"u\"),\"À\",\"A\"),\"Á\",\"A\"),\"Ä\",\"A\"),\"Æ\",\"AE\"),\"Ç\",\"C\"),\"È\",\"E\"),\"É\",\"E\"),\"Ê\",\"E\"),\"Ë\",\"E\"),\"Ì\",\"I\"),\"Í\",\"I\"),\"Î\",\"I\"),\"Ï\",\"I\"),\"Ñ\",\"N\"),\"(\",\"\"),\"Ó\",\"O\"),\"Ö\",\"O\"),\"Ú\",\"U\"),\"Û\",\"U\"),\"Ü\",\"U\"),\")\",\"\"),\"Œ\",\"OE\"),\"Ć\",\"C\"),\"Ő\",\"O\"),\"Ű\",\"U\"),\"'\",\" \"),\".\",\"\"))))","v":"AKSIUTA TETIANA"},{"$nulls":4},"IBAN Accuity","SWIFT Accuity","Clearing Code Accuity","Institution Name Accuity"]
[null,"IBAN",{"$f":"IF($C$12=\"Bidding\",IF(ISBLANK(INSTITUTIONAL!$C$30),\"\",INSTITUTIONAL!$C$30),\n\nIFERROR(IF(VLOOKUP(INSTITUTIONAL!$C$35,IBAN_requirments!A2:B234,2,0)=\"NO\",IF(INSTITUTIONAL!$C$30=\"\",\"\",\"Not IBAN country!\"),\n\nIF(VLOOKUP(INSTITUTIONAL!$C$35,IBAN_requirments!A2:B234,2,0)=\"DO NOT USE\",IF(INSTITUTIONAL!$C$30=\"\",\"\",\"Do not use IBAN for this country!\"),\n\nIF(AND(VLOOKUP(INSTITUTIONAL!$C$35,IBAN_requirments!A2:B234,2,0)=\"YES\",INSTITUTIONAL!$C$30=\"\"),\"\",\n\nIF(LEN(SUBSTITUTE(SUBSTITUTE(SUBSTITUTE(SUBSTITUTE(SUBSTITUTE(SUBSTITUTE(SUBSTITUTE(SUBSTITUTE(SUBSTITUTE(SUBSTITUTE(SUBSTITUTE(SUBSTITUTE(SUBSTITUTE(SUBSTITUTE(SUBSTITUTE(SUBSTITUTE(SUBSTITUTE(SUBSTITUTE(SUBSTITUTE(SUBSTITUTE(SUBSTITUTE(SUBSTITUTE(SUBSTITUTE(SUBSTITUTE(SUBSTITUTE(SUBSTITUTE(SUBSTITUTE(SUBSTITUTE(INSTITUTIONAL!C30,\"-\",\"\"),\".\",\"\"),\" \",\"\"),\"/\",\"\"),CHAR(33),\"\"),CHAR(34),\"\"),CHAR(35),\"\"),CHAR(39),\"\"),CHAR(40),\"\"),CHAR(41),\"\"),CHAR(42),\"\"),CHAR(45),\"\"),CHAR(47),\"\"),CHAR(58),\"\"),CHAR(59),\"\"),CHAR(91),\"\"),CHAR(92),\"\"),CHAR(93),\"\"),CHAR(95),\"\"),CHAR(96),\"\"),CHAR(123),\"\"),CHAR(124),\"\"),CHAR(125),\"\"),CHAR(126),\"\"),CHAR(145),\"\"),CHAR(146),\"\"),CHAR(147),\"\"),CHAR(148),\"\"))<>VALUE(VLOOKUP(INSTITUTIONAL!$C$35,IBAN_requirments!$A:$C,3,0)),\"IBAN missing or incorrect length!\",\n\nIF(LEFT(SUBSTITUTE(INSTITUTIONAL!$C$30,\" \",\"\"),2)=VLOOKUP(INSTITUTIONAL!$C$35,IBAN_requirments!A:D,4,0),\n\nSUBSTITUTE(SUBSTITUTE(SUBSTITUTE(SUBSTITUTE(SUBSTITUTE(SUBSTITUTE(SUBSTITUTE(SUBSTITUTE(SUBSTITUTE(SUBSTITUTE(SUBSTITUTE(SUBSTITUTE(SUBSTITUTE(SUBSTITUTE(SUBSTITUTE(SUBSTITUTE(SUBSTITUTE(SUBSTITUTE(SUBSTITUTE(SUBSTITUTE(SUBSTITUTE(SUBSTITUTE(SUBSTITUTE(SUBSTITUTE(SUBSTITUTE(SUBSTITUTE(SUBSTITUTE(SUBSTITUTE(INSTITUTIONAL!C30,\"-\",\"\"),\".\",\"\"),\" \",\"\"),\"/\",\"\"),CHAR(33),\"\"),CHAR(34),\"\"),CHAR(35),\"\"),CHAR(39),\"\"),CHAR(40),\"\"),CHAR(41),\"\"),CHAR(42),\"\"),CHAR(45),\"\"),CHAR(47),\"\"),CHAR(58),\"\"),CHAR(59),\"\"),CHAR(91),\"\"),CHAR(92),\"\"),CHAR(93),\"\"),CHAR(95),\"\"),CHAR(96),\"\"),CHAR(123),\"\"),CHAR(124),\"\"),CHAR(125),\"\"),CHAR(126),\"\"),CHAR(145),\"\"),CHAR(146),\"\"),CHAR(147),\"\"),CHAR(148),\"\"),\n\n\"First two digits of the IBAN are incorrect!\"))))),\n\n\"Bank country is missing!\"))","v":"UA483052990000026008050274847"},null,null,null,{"$f":"AND(C30<>\"\",ISERROR(FIND(\"!\",C30)))","v":true},{"$f":"HYPERLINK(\"https://www.globalpaymentsresource.com/accuity-webapp/search.html#iban/validate/\"&C30,\"Link\")","v":"Link"},{"$f":"HYPERLINK(\"https://www.globalpaymentsresource.com/accuity-webapp/search.html#search/swift/\"&C34&\"/1\",\"Link\")","v":"Link"},{"$f":"HYPERLINK(\"https://www.globalpaymentsresource.com/accuity-webapp/search.html#search/code/\"&C34&\"/1\",\"Link\")","v":"Link"},{"$f":"HYPERLINK(\"https://www.globalpaymentsresource.com/accuity-webapp/search.html#search/name/asd\"&C33&\"/1\",\"Link\")","v":"Link"}]
[null,"Bank Account Currency ",{"$f":"IF(INSTITUTIONAL!C31=\"KPW01 KPWIF\",\"\",IF(INSTITUTIONAL!C31<>\"\",INSTITUTIONAL!C31,\"\"))","v":"UAH Ukrainian Hryvnia"}]
[null,"5. Bank Information"]
[null,"Name of Bank",{"$f":"IF(INSTITUTIONAL!C33<>\"\",INSTITUTIONAL!C33,\"\")","v":"JOINT-STOCK COMPANYCOMMERCIAL BANK \"PRIVATBANK\""}]
[null,{"$f":"IF(INSTITUTIONAL!B34<>\"\",INSTITUTIONAL!B34,\"\")","v":"SWIFT Code"},{"$f":"TRIM(IF(INSTITUTIONAL!C34=\"\",\"\",(SUBSTITUTE(SUBSTITUTE(SUBSTITUTE(SUBSTITUTE(SUBSTITUTE(SUBSTITUTE(SUBSTITUTE(SUBSTITUTE(SUBSTITUTE(SUBSTITUTE(SUBSTITUTE(SUBSTITUTE(SUBSTITUTE(SUBSTITUTE(SUBSTITUTE(SUBSTITUTE(SUBSTITUTE(SUBSTITUTE(SUBSTITUTE(SUBSTITUTE(SUBSTITUTE(SUBSTITUTE(SUBSTITUTE(SUBSTITUTE(SUBSTITUTE(SUBSTITUTE(SUBSTITUTE(SUBSTITUTE(SUBSTITUTE(SUBSTITUTE(SUBSTITUTE(SUBSTITUTE(SUBSTITUTE(SUBSTITUTE(SUBSTITUTE(SUBSTITUTE(SUBSTITUTE(SUBSTITUTE(SUBSTITUTE(INSTITUTIONAL!C34,\"-\",\"\"),\".\",\"\"),\"/\",\"\"),CHAR(33),\"\"),CHAR(34),\"\"),CHAR(35),\"\"),CHAR(36),\"\"),CHAR(37),\"\"),CHAR(38),\"\"),CHAR(39),\"\"),CHAR(40),\"\"),CHAR(41),\"\"),CHAR(42),\"\"),CHAR(43),\"\"),CHAR(45),\"\"),CHAR(47),\"\"),CHAR(58),\"\"),CHAR(59),\"\"),CHAR(60),\"\"),CHAR(61),\"\"),CHAR(62),\"\"),CHAR(63),\"\"),CHAR(64),\"\"),CHAR(91),\"\"),CHAR(92),\"\"),CHAR(93),\"\"),CHAR(94),\"\"),CHAR(95),\"\"),CHAR(96),\"\"),CHAR(123),\"\"),CHAR(124),\"\"),CHAR(125),\"\"),CHAR(126),\"\"),CHAR(127),\"\"),CHAR(145),\"\"),CHAR(146),\"\"),CHAR(147),\"\"),CHAR(148),\"\"),\" \",\"\"))))","v":"305299"}]
[null,"Bank Country",{"$f":"IF(INSTITUTIONAL!C35<>\"\",INSTITUTIONAL!C35,\"\")","v":"441 Ukraine"}]
[null,"Account is Add or Replacement",{"$f":"IF(INSTITUTIONAL!C36<>\"\",INSTITUTIONAL!C36,\"\")","v":"Add Additional Account"}]
[null,"Only visible for Implementing Partners - Vendor Account Group PRG2"]
[null,"Partner Type",{"$f":"IF(AND(C9=\"PRG2 Implementing Partners\",ISERROR(VLOOKUP(INSTITUTIONAL!C38,Partner_Type,1,0))),\"Partner Type is missing or invalid!\",\n\nIF(AND(C9=\"PRG2 Implementing Partners\",OR(INSTITUTIONAL!C38=\"UN - UN Agency\",INSTITUTIONAL!C38=\"Bilateral/Multilateral\",INSTITUTIONAL!C39=\"Intenational NGO\")),\"Vendors with parent organizations can't be created via WinShuttle!\",\n\nINSTITUTIONAL!C38))","v":"… Select"},"Date of Assessment (as per HACT procedure)\n(DD.MM.YYYY)",{"$f":"IFERROR(IF(AND(C9=\"PRG2 Implementing Partners\",OR(C38=\"CSO - Civil Society Organisations\",C38=\"GOVT - Government\"),C39<>\"International NGO\",INSTITUTIONAL!E38=\"\",INSTITUTIONAL!E41=\"5 - Not Required\"),TODAY(),\n\nIF(AND(C9=\"PRG2 Implementing Partners\",OR(C38=\"CSO - Civil Society Organisations\",C38=\"GOVT - Government\"),C39<>\"International NGO\",INSTITUTIONAL!E38=\"\",AND(OR(INSTITUTIONAL!E40=\"High Risk Assumed\",INSTITUTIONAL!E40=\"Low Risk Assumed\"),AND(INSTITUTIONAL!E41<>\"3 - Medium\",INSTITUTIONAL!E41<>\"2 - Significant\"))),TODAY(),\n\nIF(AND(C9=\"PRG2 Implementing Partners\",C38=\"GOVT - Government\",INSTITUTIONAL!E38=\"\",AND(OR(INSTITUTIONAL!E40=\"\",INSTITUTIONAL!E40=\"… Select\"),OR(INSTITUTIONAL!E41=\"5 - High\",INSTITUTIONAL!E41=\"\",INSTITUTIONAL!E41=\"… Select\"))),TODAY(),\n\nIF(AND(C9=\"PRG2 Implementing Partners\",OR(C38=\"CSO - Civil Society Organisations\",C38=\"GOVT - Government\"),C39<>\"International NGO\",INSTITUTIONAL!E38=\"\"),\"Mandatory HACT Assessment Date Missing!\",\n\nIF(ISBLANK(INSTITUTIONAL!E38),\"\",\n\nIF(AND(C9=\"PRG2 Implementing Partners\",OR(C38=\"CSO - Civil Society Organisations\",C38=\"GOVT - Government\"),C39<>\"International NGO\",DATEVALUE(SUBSTITUTE(MID(INSTITUTIONAL!E38,4,2)&\".\"&LEFT(INSTITUTIONAL!E38,2)&RIGHT(INSTITUTIONAL!E38,5),\".\",\"/\"))>TODAY()),\"Assessment date can't be future date!\",\n\nIF(AND(C9=\"PRG2 Implementing Partners\",OR(C38=\"CSO - Civil Society Organisations\",C38=\"GOVT - Government\"),C39<>\"International NGO\",DATEVALUE(SUBSTITUTE(MID(INSTITUTIONAL!E38,4,2)&\".\"&LEFT(INSTITUTIONAL!E38,2)&RIGHT(INSTITUTIONAL!E38,5),\".\",\"/\"))<DATE(YEAR(TODAY())-5,MONTH(TODAY()),DAY(TODAY()))),\"Assessment date can't be more than 5 years ago!\",\n\nINSTITUTIONAL!E38))))))),\"Invalid Date Format!\")","v":""}]
[null,"Civil Society Organization Type (if it is CSO)",{"$f":"IF(OR(C38=\"CSO - Civil Society Organisations\",INSTITUTIONAL!C39=\"… Select\"),INSTITUTIONAL!C39,\"\")","v":"… Select"},"Date of Positive Assessment against core values [mandatory for National CSO, Community Based Organisation and Academic Institution]\n(DD.MM.YYYY)",{"$f":"IFERROR(IF(AND(C9=\"PRG2 Implementing Partners\",C38=\"CSO - Civil Society Organisations\",C39<>\"International NGO\",INSTITUTIONAL!E39=\"\"),\"Mandatory Core Assessment Date Missing!\",\n\nIF(ISBLANK(INSTITUTIONAL!E39),\"\",\n\nIF(AND(C9=\"PRG2 Implementing Partners\",C38=\"CSO - Civil Society Organisations\",C39<>\"International NGO\",DATEVALUE(SUBSTITUTE(MID(INSTITUTIONAL!E39,4,2)&\".\"&LEFT(INSTITUTIONAL!E39,2)&RIGHT(INSTITUTIONAL!E39,5),\".\",\"/\"))>TODAY()),\"Assessment date can't be future date!\",\n\nIF(AND(C9=\"PRG2 Implementing Partners\",C38=\"CSO - Civil Society Organisations\",C39<>\"International NGO\",DATEVALUE(SUBSTITUTE(MID(INSTITUTIONAL!E39,4,2)&\".\"&LEFT(INSTITUTIONAL!E39,2)&RIGHT(INSTITUTIONAL!E39,5),\".\",\"/\"))<DATE(YEAR(TODAY())-5,MONTH(TODAY()),DAY(TODAY()))),\"Assessment date can't be more than 5 years ago!\",\n\nIF(AND(C9=\"PRG2 Implementing Partners\",C38=\"GOVT - Government\",INSTITUTIONAL!C38<>\"\"),\"\",\n\nINSTITUTIONAL!E39))))),\"Invalid Date Format!\")","v":""},null,null,"UNPP search term","UNPP Name"]
[null,null,null,"Type of Assessment as per HACT Procedure",{"$f":"IF(AND(C9=\"PRG2 Implementing Partners\",OR(C38=\"CSO - Civil Society Organisations\",C38=\"GOVT - Government\"),C39<>\"International NGO\",INSTITUTIONAL!E40=\"Low Risk Assumed\",VLOOKUP(INSTITUTIONAL!E12,Programme_countries,2,0)<>\"No\",INSTITUTIONAL!E41=\"5 - Not Required\"),\"Micro Assessment\",\n\nIF(AND(C9=\"PRG2 Implementing Partners\",OR(C38=\"CSO - Civil Society Organisations\",C38=\"GOVT - Government\"),C39<>\"International NGO\",INSTITUTIONAL!E40=\"Low Risk Assumed\",VLOOKUP(INSTITUTIONAL!E12,Programme_countries,2,0)<>\"No\"),\"Low Risk Assumed not applicable!\",\n\nIF(AND(C9=\"PRG2 Implementing Partners\",OR(C38=\"CSO - Civil Society Organisations\",C38=\"GOVT - Government\"),C39<>\"International NGO\",OR(INSTITUTIONAL!E40=\"\",INSTITUTIONAL!E40=\"… Select\",INSTITUTIONAL!E40=\"Audit Results\",INSTITUTIONAL!E40=\"Others\"),INSTITUTIONAL!E41=\"5 - Not Required\"),\"Micro Assessment\",\n\nIF(AND(C9=\"PRG2 Implementing Partners\",C38=\"GOVT - Government\",OR(INSTITUTIONAL!E40=\"\",INSTITUTIONAL!E40=\"… Select\"),OR(INSTITUTIONAL!E41=\"\",INSTITUTIONAL!E41=\"… Select\",INSTITUTIONAL!E41=\"1 - High\")),\"High Risk Assumed\",\n\nIF(AND(C9=\"PRG2 Implementing Partners\",C38=\"CSO - Civil Society Organisations\",C39<>\"International NGO\",INSTITUTIONAL!E40=\"High Risk Assumed\",INSTITUTIONAL!E41=\"5 - Not Required\"),\"Micro Assessment\",\n\nIF(AND(C9=\"PRG2 Implementing Partners\",OR(C38=\"CSO - Civil Society Organisations\",C38=\"GOVT - Government\"),C39<>\"International NGO\",ISERROR(VLOOKUP(INSTITUTIONAL!E40,HACT_Assessment_Types,1,0))),\"Assessment type is invalid or missing!\",\n\nINSTITUTIONAL!E40))))))","v":"… Select"},null,null,{"$f":"HYPERLINK(\"https://www.unpartnerportal.org/partner?legal_name=\"&E7&\"&page=1&page_size=20\",\"LINK\")","v":"LINK"},{"$f":"HYPERLINK(\"https://www.unpartnerportal.org/partner?legal_name=\"&E6&\"&page=1&page_size=20\",\"LINK\")","v":"LINK"}]
[null,"INGO Parent List",null,"Risk Rating (in case the Type of Assessment is Others, risk rating cannot be Not Required)",{"$f":"IF(AND(C9=\"PRG2 Implementing Partners\",OR(C38=\"CSO - Civil Society Organisations\",C38=\"GOVT - Government\"),C39<>\"International NGO\",E40=\"High Risk Assumed\",OR(INSTITUTIONAL!E41=\"\",INSTITUTIONAL!E41=\"… Select\")),\"1 - High\",\n\nIF(AND(C9=\"PRG2 Implementing Partners\",OR(C38=\"CSO - Civil Society Organisations\",C38=\"GOVT - Government\"),C39<>\"International NGO\",E40=\"Low Risk Assumed\",OR(INSTITUTIONAL!E41=\"\",INSTITUTIONAL!E41=\"… Select\")),\"4 - Low\",\n\nIF(AND(C9=\"PRG2 Implementing Partners\",C38=\"GOVT - Government\",OR(E40=\"\",E40=\"… Select\"),OR(INSTITUTIONAL!E41=\"\",INSTITUTIONAL!E41=\"… Select\")),\"1 - High\",\n\nIF(AND(C9=\"PRG2 Implementing Partners\",C38=\"GOVT - Government\",E40=\"High Risk Assumed\",INSTITUTIONAL!E41=\"5 - Not Required\"),\"1 - High\",\n\nIF(AND(C9=\"PRG2 Implementing Partners\",OR(C38=\"CSO - Civil Society Organisations\",C38=\"GOVT - Government\"),OR(E40=\"Audit Results\",E40=\"Others\",E40=\"Micro Assessment\"),OR(INSTITUTIONAL!E41=\"\",INSTITUTIONAL!E41=\"… Select\")),\"Missing Assessment rating!\",\n\nIF(AND(C9=\"PRG2 Implementing Partners\",OR(C38=\"CSO - Civil Society Organisations\",C38=\"GOVT - Government\"),E40=\"High Risk Assumed\",OR(INSTITUTIONAL!E41=\"4 - Low\",INSTITUTIONAL!E41=\"3 - Medium\",INSTITUTIONAL!E41=\"2 - Significant\")),\"Invalid Assessment+Risk rating!\",\n\nIF(AND(C9=\"PRG2 Implementing Partners\",OR(C38=\"CSO - Civil Society Organisations\",C38=\"GOVT - Government\"),E40=\"Low Risk Assumed\",OR(INSTITUTIONAL!E41=\"1 - High\",INSTITUTIONAL!E41=\"3 - Medium\",INSTITUTIONAL!E41=\"2 - Significant\")),\"Invalid Assessment+Risk rating!\",\n\nIF(AND(C9=\"PRG2 Implementing Partners\",OR(C38=\"CSO - Civil Society Organisations\",C38=\"GOVT - Government\"),ISERROR(VLOOKUP(INSTITUTIONAL!E41,HACT_Assessment_Ratings,1,0))),\"Invalid Risk rating Value!\",\n\nINSTITUTIONAL!E41))))))))","v":"… Select"}]
[null,"UN & Bi-Multilateral Org",null,"Permitted Payee Vendor Number (if applicable) ",{"$f":"IF(INSTITUTIONAL!E42<>\"\",INSTITUTIONAL!E42,\"\")","v":""}]
[null,"Name of Parent Organisation [mandatory for Bilateral/Multilateral, UN Agency and International CSO]",{"$f":"IF(INSTITUTIONAL!C43<>\"\",INSTITUTIONAL!C43,\"\")","v":""},"House Bank"]
[null,"Date of Protection from Sexual Exploitation and Abuse (PSEA) Assessment\n[mandatory for National CSO, Community Based Organisation and Academic Institution]\n(DD.MM.YYYY)",{"$f":"IFERROR(IF(AND(C9=\"PRG2 Implementing Partners\",OR(C38=\"CSO - Civil Society Organisations\",C38=\"GOVT - Government\"),INSTITUTIONAL!C44=\"\"),TODAY(),\n\nIF(AND(C9=\"PRG2 Implementing Partners\",C38=\"GOVT - Government\",INSTITUTIONAL!C44<>TODAY()),TODAY(),\n\nIF(AND(C9=\"PRG2 Implementing Partners\",C38=\"CSO - Civil Society Organisations\",C39=\"Intenational NGO\",INSTITUTIONAL!C44<>TODAY(),C45=\"6 - Not Assessed\"),TODAY(),\n\nIF(AND(C9=\"PRG2 Implementing Partners\",AND(C38<>\"CSO - Civil Society Organisations\",C38<>\"GOVT - Government\"),INSTITUTIONAL!C44<>\"\"),\"\",\n\nIF(ISBLANK(INSTITUTIONAL!C44),\"\",\n\nIF(AND(C9=\"PRG2 Implementing Partners\",C38=\"CSO - Civil Society Organisations\",C39<>\"International NGO\",DATEVALUE(SUBSTITUTE(MID(INSTITUTIONAL!C44,4,2)&\".\"&LEFT(INSTITUTIONAL!C44,2)&RIGHT(INSTITUTIONAL!C44,5),\".\",\"/\"))>TODAY()),\"Assessment date can't be future date!\",\n\nIF(AND(C9=\"PRG2 Implementing Partners\",C38=\"CSO - Civil Society Organisations\",C39<>\"International NGO\",DATEVALUE(SUBSTITUTE(MID(INSTITUTIONAL!C44,4,2)&\".\"&LEFT(INSTITUTIONAL!C44,2)&RIGHT(INSTITUTIONAL!C44,5),\".\",\"/\"))<DATE(YEAR(TODAY())-5,MONTH(TODAY()),DAY(TODAY()))),\"Assessment date can't be more than 5 years ago!\",\n\nIF(AND(C9=\"PRG2 Implementing Partners\",C38=\"GOVT - Government\",INSTITUTIONAL!C38<>\"\"),\"\",\n\nINSTITUTIONAL!C44)))))))),\"Invalid Date Format!\")","v":""},"Payment method",{"$f":"IF(ISERROR(VLOOKUP(INSTITUTIONAL!E44,Payment_methods,0)),\"\",INSTITUTIONAL!E44)","v":""}]
[null,"Risk Rating of Protection from Sexual Exploitation and Abuse (PSEA) Assessment",{"$f":"IF(AND(C9=\"PRG2 Implementing Partners\",AND(C38<>\"CSO - Civil Society Organisations\",C38<>\"Govt - Government\")),\"\",\n\nIF(AND(C9=\"PRG2 Implementing Partners\",C38=\"Govt - Government\"),\"6 - Not Assessed\",\n\nIF(AND(C9=\"PRG2 Implementing Partners\",C38=\"CSO - Civil Society Organisations\",C39<>\"Intenational NGO\",INSTITUTIONAL!C45=\"6 - Not Assessed\"),\"4 - High Risk Assumed\",\n\nIF(AND(C9=\"PRG2 Implementing Partners\",C38=\"CSO - Civil Society Organisations\",OR(INSTITUTIONAL!C45=\"\",INSTITUTIONAL!C45=\"… Select\")),\"4 - High Risk Assumed\",\n\nIF(INSTITUTIONAL!C45<>\"\",INSTITUTIONAL!C45,\n\n\"\")))))","v":"… Select"}]
[null,"Only visible for Block/Unblock Request Type"]
[null,"Action",{"$f":"IF(INSTITUTIONAL!C47<>\"\",INSTITUTIONAL!C47,\"\")","v":"Create "},"Please provide the reason",{"$f":"IF(INSTITUTIONAL!E47<>\"\",INSTITUTIONAL!C47,\"\")","v":"Create "}]
[]
[null,"Additional Instructions or Remarks ",{"$f":"IF(INSTITUTIONAL!C49<>\"\",INSTITUTIONAL!C49,\"\")","v":""}]
[]
[]
[]
[null,"Prepared by (Name/Section) :       "]
[null,"Approved by (Name/Section):  "]
[]
[null,"GSSC Agent Use Only"]
[null,"Agent","nzodor"]
[null,"Case Number"]
[null,"Payment method ","BCLNTU"]
[null,"Payment Terms","Z120 Within 30 days Due net","Effective start date",{"$f":"TODAY()","v":"2021-02-03"}]

{"sheet":"Log_file","index":2,"n_rows":47,"n_cols":14,"rows_kept":47,"cut":false,"hidden":true,"merged":[]}
["# of Changes","Name of field","Original value in field","Changed value in field","Name of field","INSTITUTIONAL Page","INSTITUTIONAL VENDOR Page","Reason of change","Required Action",null,null,null,"Reason of change","Required Action"]
[{"$f":"IF(C2<>D2,MAX(A$1:$A1)+1,0)","v":0},"Business Area of LFP",{"$f":"IF(ISBLANK(INSTITUTIONAL!C7),\"\",INSTITUTIONAL!C7)","v":"Create "},{"$f":"IF(ISBLANK('INSTITUTIONAL VENDOR'!C7),\"\",'INSTITUTIONAL VENDOR'!C7)","v":"Create "},{"$f":"IFERROR(VLOOKUP(ROWS($F$1:F1),A:D,2,0),\"\")","v":"House number"},{"$f":"IFERROR(VLOOKUP(ROWS($F$1:F1),A:D,3,0),\"\")","v":103},{"$f":"IFERROR(VLOOKUP(ROWS($F$1:F1),A:D,4,0),\"\")","v":"103"},{"$f":"IF($F2<>$G2,\n\nIF(NOT(ISERROR(SEARCH(\"!\",G2))),\"Error message, original field contained incorrect value\",\n\nIF(AND($E2=\"Company Name\",LEN($F2)>40),\"Name is too long\",\n\nIF(AND($E2=\"Region\",ISERROR(VLOOKUP('INSTITUTIONAL VENDOR'!$E$12,List_of_Region_Countries,1,0))),\"Not a region country, field removed\",\n\nIF(AND(ISERROR(VLOOKUP($F2,List_of_Dropdown_list_Values,1,0)),NOT(ISERROR(VLOOKUP($G2,List_of_Dropdown_list_Values,1,0)))),\"Original Value was not from dropdown list, has been corrected\",\n\nIF(AND($E2=\"Account type\",OR('INSTITUTIONAL VENDOR'!$C$35=\"370 Russian Fed.\",'INSTITUTIONAL VENDOR'!$C$35=\"681 Angola\",'INSTITUTIONAL VENDOR'!$C$35=\"689 Mozambique\")),\"Digits must be moved to account number as per country specifics\",\n\nIF(AND($E2=\"Vendor's Bank Account Number\",OR('INSTITUTIONAL VENDOR'!$C$35=\"370 Russian Fed.\",'INSTITUTIONAL VENDOR'!$C$35=\"681 Angola\",'INSTITUTIONAL VENDOR'!$C$35=\"689 Mozambique\"),LEN(Log_file!$F2)>LEN(Log_file!$G2)),\"Digits moved to account key as per country specifics\",\n\nIF(AND(LEN(SUBSTITUTE(TRIM($F2),\" \",\"\"))=LEN(SUBSTITUTE(TRIM($G2),\" \",\"\")),LEN($F2)>LEN($G2)),\"Spaces removed\",\n\nIF(LEN($F2)>VLOOKUP($E2,SAP_fields_MAX_length,2,0),\"Original value length was over SAP limit\",\n\n\"Number Format/Special characters substituted or Unknown Reason\")))))))),\n\n\"\")","v":"Number Format/Special characters substituted or Unknown Reason"},{"$f":"IF($H2=\"\",\"\",VLOOKUP($H2,M:N,2,0))","v":"Processor - Investigate if correction is required"},null,null,null,"Error message, original field contained incorrect value","Processor - Investigate original field and correct the error"]
[{"$f":"IF(C3<>D3,MAX(A$1:$A2)+1,0)","v":0},"Request type ",{"$f":"IF(ISBLANK(INSTITUTIONAL!C6),\"\",INSTITUTIONAL!C6)","v":"4410 - Ukraine"},{"$f":"IF(ISBLANK('INSTITUTIONAL VENDOR'!C6),\"\",'INSTITUTIONAL VENDOR'!C6)","v":"4410 - Ukraine"},{"$f":"IFERROR(VLOOKUP(ROWS($F$1:F2),A:D,2,0),\"\")","v":"Region"},{"$f":"IFERROR(VLOOKUP(ROWS($F$1:F2),A:D,3,0),\"\")","v":"… Select"},{"$f":"IFERROR(VLOOKUP(ROWS($F$1:F2),A:D,4,0),\"\")","v":""},{"$f":"IF($F3<>$G3,\n\nIF(NOT(ISERROR(SEARCH(\"!\",G3))),\"Error message, original field contained incorrect value\",\n\nIF(AND($E3=\"Company Name\",LEN($F3)>40),\"Name is too long\",\n\nIF(AND($E3=\"Region\",ISERROR(VLOOKUP('INSTITUTIONAL VENDOR'!$E$12,List_of_Region_Countries,1,0))),\"Not a region country, field removed\",\n\nIF(AND(ISERROR(VLOOKUP($F3,List_of_Dropdown_list_Values,1,0)),NOT(ISERROR(VLOOKUP($G3,List_of_Dropdown_list_Values,1,0)))),\"Original Value was not from dropdown list, has been corrected\",\n\nIF(AND($E3=\"Account type\",OR('INSTITUTIONAL VENDOR'!$C$35=\"370 Russian Fed.\",'INSTITUTIONAL VENDOR'!$C$35=\"681 Angola\",'INSTITUTIONAL VENDOR'!$C$35=\"689 Mozambique\")),\"Digits must be moved to account number as per country specifics\",\n\nIF(AND($E3=\"Vendor's Bank Account Number\",OR('INSTITUTIONAL VENDOR'!$C$35=\"370 Russian Fed.\",'INSTITUTIONAL VENDOR'!$C$35=\"681 Angola\",'INSTITUTIONAL VENDOR'!$C$35=\"689 Mozambique\"),LEN(Log_file!$F3)>LEN(Log_file!$G3)),\"Digits moved to account key as per country specifics\",\n\nIF(AND(LEN(SUBSTITUTE(TRIM($F3),\" \",\"\"))=LEN(SUBSTITUTE(TRIM($G3),\" \",\"\")),LEN($F3)>LEN($G3)),\"Spaces removed\",\n\nIF(LEN($F3)>VLOOKUP($E3,SAP_fields_MAX_length,2,0),\"Original value length was over SAP limit\",\n\n\"Number Format/Special characters substituted or Unknown Reason\")))))))),\n\n\"\")","v":"Not a region country, field removed"},{"$f":"IF($H3=\"\",\"\",VLOOKUP($H3,M:N,2,0))","v":"No Action Required"},null,null,null,"Name is too long","Senior Processor - Enter remaining part of name manually"]
[{"$f":"IF(C4<>D4,MAX(A$1:$A3)+1,0)","v":0},"Vendor Number (mandatory for Update/Block/Unblock)",{"$f":"IF(ISBLANK(INSTITUTIONAL!C8),\"\",INSTITUTIONAL!C8)","v":""},{"$f":"IF(ISBLANK('INSTITUTIONAL VENDOR'!C8),\"\",'INSTITUTIONAL VENDOR'!C8)","v":""},{"$f":"IFERROR(VLOOKUP(ROWS($F$1:F3),A:D,2,0),\"\")","v":"Account Type"},{"$f":"IFERROR(VLOOKUP(ROWS($F$1:F3),A:D,3,0),\"\")","v":"UA483052990000026008050274847"},{"$f":"IFERROR(VLOOKUP(ROWS($F$1:F3),A:D,4,0),\"\")","v":"01 - Current/Checking account"},{"$f":"IF($F4<>$G4,\n\nIF(NOT(ISERROR(SEARCH(\"!\",G4))),\"Error message, original field contained incorrect value\",\n\nIF(AND($E4=\"Company Name\",LEN($F4)>40),\"Name is too long\",\n\nIF(AND($E4=\"Region\",ISERROR(VLOOKUP('INSTITUTIONAL VENDOR'!$E$12,List_of_Region_Countries,1,0))),\"Not a region country, field removed\",\n\nIF(AND(ISERROR(VLOOKUP($F4,List_of_Dropdown_list_Values,1,0)),NOT(ISERROR(VLOOKUP($G4,List_of_Dropdown_list_Values,1,0)))),\"Original Value was not from dropdown list, has been corrected\",\n\nIF(AND($E4=\"Account type\",OR('INSTITUTIONAL VENDOR'!$C$35=\"370 Russian Fed.\",'INSTITUTIONAL VENDOR'!$C$35=\"681 Angola\",'INSTITUTIONAL VENDOR'!$C$35=\"689 Mozambique\")),\"Digits must be moved to account number as per country specifics\",\n\nIF(AND($E4=\"Vendor's Bank Account Number\",OR('INSTITUTIONAL VENDOR'!$C$35=\"370 Russian Fed.\",'INSTITUTIONAL VENDOR'!$C$35=\"681 Angola\",'INSTITUTIONAL VENDOR'!$C$35=\"689 Mozambique\"),LEN(Log_file!$F4)>LEN(Log_file!$G4)),\"Digits moved to account key as per country specifics\",\n\nIF(AND(LEN(SUBSTITUTE(TRIM($F4),\" \",\"\"))=LEN(SUBSTITUTE(TRIM($G4),\" \",\"\")),LEN($F4)>LEN($G4)),\"Spaces removed\",\n\nIF(LEN($F4)>VLOOKUP($E4,SAP_fields_MAX_length,2,0),\"Original value length was over SAP limit\",\n\n\"Number Format/Special characters substituted or Unknown Reason\")))))))),\n\n\"\")","v":"Number Format/Special characters substituted or Unknown Reason"},{"$f":"IF($H4=\"\",\"\",VLOOKUP($H4,M:N,2,0))","v":"Processor - Investigate if correction is required"},null,null,null,"Number Format/Special characters substituted or Unknown Reason","Processor - Investigate if correction is required"]
[{"$f":"IF(C5<>D5,MAX(A$1:$A4)+1,0)","v":0},"Vendor Account Group",{"$f":"IF(ISBLANK(INSTITUTIONAL!C9),\"\",INSTITUTIONAL!C9)","v":"ZFV Field Office Vendors"},{"$f":"IF(ISBLANK('INSTITUTIONAL VENDOR'!C9),\"\",'INSTITUTIONAL VENDOR'!C9)","v":"ZFV Field Office Vendors"},{"$f":"IFERROR(VLOOKUP(ROWS($F$1:F4),A:D,2,0),\"\")","v":"Payment method"},{"$f":"IFERROR(VLOOKUP(ROWS($F$1:F4),A:D,3,0),\"\")","v":"… Select"},{"$f":"IFERROR(VLOOKUP(ROWS($F$1:F4),A:D,4,0),\"\")","v":""},{"$f":"IF($F5<>$G5,\n\nIF(NOT(ISERROR(SEARCH(\"!\",G5))),\"Error message, original field contained incorrect value\",\n\nIF(AND($E5=\"Company Name\",LEN($F5)>40),\"Name is too long\",\n\nIF(AND($E5=\"Region\",ISERROR(VLOOKUP('INSTITUTIONAL VENDOR'!$E$12,List_of_Region_Countries,1,0))),\"Not a region country, field removed\",\n\nIF(AND(ISERROR(VLOOKUP($F5,List_of_Dropdown_list_Values,1,0)),NOT(ISERROR(VLOOKUP($G5,List_of_Dropdown_list_Values,1,0)))),\"Original Value was not from dropdown list, has been corrected\",\n\nIF(AND($E5=\"Account type\",OR('INSTITUTIONAL VENDOR'!$C$35=\"370 Russian Fed.\",'INSTITUTIONAL VENDOR'!$C$35=\"681 Angola\",'INSTITUTIONAL VENDOR'!$C$35=\"689 Mozambique\")),\"Digits must be moved to account number as per country specifics\",\n\nIF(AND($E5=\"Vendor's Bank Account Number\",OR('INSTITUTIONAL VENDOR'!$C$35=\"370 Russian Fed.\",'INSTITUTIONAL VENDOR'!$C$35=\"681 Angola\",'INSTITUTIONAL VENDOR'!$C$35=\"689 Mozambique\"),LEN(Log_file!$F5)>LEN(Log_file!$G5)),\"Digits moved to account key as per country specifics\",\n\nIF(AND(LEN(SUBSTITUTE(TRIM($F5),\" \",\"\"))=LEN(SUBSTITUTE(TRIM($G5),\" \",\"\")),LEN($F5)>LEN($G5)),\"Spaces removed\",\n\nIF(LEN($F5)>VLOOKUP($E5,SAP_fields_MAX_length,2,0),\"Original value length was over SAP limit\",\n\n\"Number Format/Special characters substituted or Unknown Reason\")))))))),\n\n\"\")","v":"Number Format/Special characters substituted or Unknown Reason"},"Processor - Investigate if correction is required",null,null,null,"Original Value was not from dropdown list, has been corrected","No Action Required"]
[{"$f":"IF(C6<>D6,MAX(A$1:$A5)+1,0)","v":0},"Prepayment enabled",{"$f":"IF(ISBLANK(INSTITUTIONAL!C10),\"\",INSTITUTIONAL!C10)","v":"… Select"},{"$f":"IF(ISBLANK('INSTITUTIONAL VENDOR'!C10),\"\",'INSTITUTIONAL VENDOR'!C10)","v":"… Select"},{"$f":"IFERROR(VLOOKUP(ROWS($F$1:F5),A:D,2,0),\"\")","v":""},{"$f":"IFERROR(VLOOKUP(ROWS($F$1:F5),A:D,3,0),\"\")","v":""},{"$f":"IFERROR(VLOOKUP(ROWS($F$1:F5),A:D,4,0),\"\")","v":""},{"$f":"IF($F6<>$G6,\n\nIF(NOT(ISERROR(SEARCH(\"!\",G6))),\"Error message, original field contained incorrect value\",\n\nIF(AND($E6=\"Company Name\",LEN($F6)>40),\"Name is too long\",\n\nIF(AND($E6=\"Region\",ISERROR(VLOOKUP('INSTITUTIONAL VENDOR'!$E$12,List_of_Region_Countries,1,0))),\"Not a region country, field removed\",\n\nIF(AND(ISERROR(VLOOKUP($F6,List_of_Dropdown_list_Values,1,0)),NOT(ISERROR(VLOOKUP($G6,List_of_Dropdown_list_Values,1,0)))),\"Original Value was not from dropdown list, has been corrected\",\n\nIF(AND($E6=\"Account type\",OR('INSTITUTIONAL VENDOR'!$C$35=\"370 Russian Fed.\",'INSTITUTIONAL VENDOR'!$C$35=\"681 Angola\",'INSTITUTIONAL VENDOR'!$C$35=\"689 Mozambique\")),\"Digits must be moved to account number as per country specifics\",\n\nIF(AND($E6=\"Vendor's Bank Account Number\",OR('INSTITUTIONAL VENDOR'!$C$35=\"370 Russian Fed.\",'INSTITUTIONAL VENDOR'!$C$35=\"681 Angola\",'INSTITUTIONAL VENDOR'!$C$35=\"689 Mozambique\"),LEN(Log_file!$F6)>LEN(Log_file!$G6)),\"Digits moved to account key as per country specifics\",\n\nIF(AND(LEN(SUBSTITUTE(TRIM($F6),\" \",\"\"))=LEN(SUBSTITUTE(TRIM($G6),\" \",\"\")),LEN($F6)>LEN($G6)),\"Spaces removed\",\n\nIF(LEN($F6)>VLOOKUP($E6,SAP_fields_MAX_length,2,0),\"Original value length was over SAP limit\",\n\n\"Number Format/Special characters substituted or Unknown Reason\")))))))),\n\n\"\")","v":""},"",null,null,null,"Not a region country, field removed","No Action Required"]
[{"$f":"IF(C7<>D7,MAX(A$1:$A6)+1,0)","v":0},"UNGM Number",{"$f":"IF(ISBLANK(INSTITUTIONAL!C11),\"\",INSTITUTIONAL!C11)","v":""},{"$f":"IF(ISBLANK('INSTITUTIONAL VENDOR'!C11),\"\",'INSTITUTIONAL VENDOR'!C11)","v":""},{"$f":"IFERROR(VLOOKUP(ROWS($F$1:F6),A:D,2,0),\"\")","v":""},{"$f":"IFERROR(VLOOKUP(ROWS($F$1:F6),A:D,3,0),\"\")","v":""},{"$f":"IFERROR(VLOOKUP(ROWS($F$1:F6),A:D,4,0),\"\")","v":""},{"$f":"IF($F7<>$G7,\n\nIF(NOT(ISERROR(SEARCH(\"!\",G7))),\"Error message, original field contained incorrect value\",\n\nIF(AND($E7=\"Company Name\",LEN($F7)>40),\"Name is too long\",\n\nIF(AND($E7=\"Region\",ISERROR(VLOOKUP('INSTITUTIONAL VENDOR'!$E$12,List_of_Region_Countries,1,0))),\"Not a region country, field removed\",\n\nIF(AND(ISERROR(VLOOKUP($F7,List_of_Dropdown_list_Values,1,0)),NOT(ISERROR(VLOOKUP($G7,List_of_Dropdown_list_Values,1,0)))),\"Original Value was not from dropdown list, has been corrected\",\n\nIF(AND($E7=\"Account type\",OR('INSTITUTIONAL VENDOR'!$C$35=\"370 Russian Fed.\",'INSTITUTIONAL VENDOR'!$C$35=\"681 Angola\",'INSTITUTIONAL VENDOR'!$C$35=\"689 Mozambique\")),\"Digits must be moved to account number as per country specifics\",\n\nIF(AND($E7=\"Vendor's Bank Account Number\",OR('INSTITUTIONAL VENDOR'!$C$35=\"370 Russian Fed.\",'INSTITUTIONAL VENDOR'!$C$35=\"681 Angola\",'INSTITUTIONAL VENDOR'!$C$35=\"689 Mozambique\"),LEN(Log_file!$F7)>LEN(Log_file!$G7)),\"Digits moved to account key as per country specifics\",\n\nIF(AND(LEN(SUBSTITUTE(TRIM($F7),\" \",\"\"))=LEN(SUBSTITUTE(TRIM($G7),\" \",\"\")),LEN($F7)>LEN($G7)),\"Spaces removed\",\n\nIF(LEN($F7)>VLOOKUP($E7,SAP_fields_MAX_length,2,0),\"Original value length was over SAP limit\",\n\n\"Number Format/Special characters substituted or Unknown Reason\")))))))),\n\n\"\")","v":""},"",null,null,null,"Original value length was over SAP limit","Processor - Check if additional characters should be included"]
[{"$f":"IF(C8<>D8,MAX(A$1:$A7)+1,0)","v":0},"Purpose of vendor",{"$f":"IF(ISBLANK(INSTITUTIONAL!C12),\"\",INSTITUTIONAL!C12)","v":"Corporate Contract"},{"$f":"IF(ISBLANK('INSTITUTIONAL VENDOR'!C12),\"\",'INSTITUTIONAL VENDOR'!C12)","v":"Corporate Contract"},{"$f":"IFERROR(VLOOKUP(ROWS($F$1:F7),A:D,2,0),\"\")","v":""},{"$f":"IFERROR(VLOOKUP(ROWS($F$1:F7),A:D,3,0),\"\")","v":""},{"$f":"IFERROR(VLOOKUP(ROWS($F$1:F7),A:D,4,0),\"\")","v":""},{"$f":"IF($F8<>$G8,\n\nIF(NOT(ISERROR(SEARCH(\"!\",G8))),\"Error message, original field contained incorrect value\",\n\nIF(AND($E8=\"Company Name\",LEN($F8)>40),\"Name is too long\",\n\nIF(AND($E8=\"Region\",ISERROR(VLOOKUP('INSTITUTIONAL VENDOR'!$E$12,List_of_Region_Countries,1,0))),\"Not a region country, field removed\",\n\nIF(AND(ISERROR(VLOOKUP($F8,List_of_Dropdown_list_Values,1,0)),NOT(ISERROR(VLOOKUP($G8,List_of_Dropdown_list_Values,1,0)))),\"Original Value was not from dropdown list, has been corrected\",\n\nIF(AND($E8=\"Account type\",OR('INSTITUTIONAL VENDOR'!$C$35=\"370 Russian Fed.\",'INSTITUTIONAL VENDOR'!$C$35=\"681 Angola\",'INSTITUTIONAL VENDOR'!$C$35=\"689 Mozambique\")),\"Digits must be moved to account number as per country specifics\",\n\nIF(AND($E8=\"Vendor's Bank Account Number\",OR('INSTITUTIONAL VENDOR'!$C$35=\"370 Russian Fed.\",'INSTITUTIONAL VENDOR'!$C$35=\"681 Angola\",'INSTITUTIONAL VENDOR'!$C$35=\"689 Mozambique\"),LEN(Log_file!$F8)>LEN(Log_file!$G8)),\"Digits moved to account key as per country specifics\",\n\nIF(AND(LEN(SUBSTITUTE(TRIM($F8),\" \",\"\"))=LEN(SUBSTITUTE(TRIM($G8),\" \",\"\")),LEN($F8)>LEN($G8)),\"Spaces removed\",\n\nIF(LEN($F8)>VLOOKUP($E8,SAP_fields_MAX_length,2,0),\"Original value length was over SAP limit\",\n\n\"Number Format/Special characters substituted or Unknown Reason\")))))))),\n\n\"\")","v":""},"",null,null,null,"Spaces removed","No Action Required"]
[{"$f":"IF(C9<>D9,MAX(A$1:$A8)+1,0)","v":0},"Telephone",{"$f":"IF(ISBLANK(INSTITUTIONAL!C15),\"\",INSTITUTIONAL!C15)","v":"380961478054"},{"$f":"IF(ISBLANK('INSTITUTIONAL VENDOR'!C15),\"\",'INSTITUTIONAL VENDOR'!C15)","v":"380961478054"},{"$f":"IFERROR(VLOOKUP(ROWS($F$1:F8),A:D,2,0),\"\")","v":""},{"$f":"IFERROR(VLOOKUP(ROWS($F$1:F8),A:D,3,0),\"\")","v":""},{"$f":"IFERROR(VLOOKUP(ROWS($F$1:F8),A:D,4,0),\"\")","v":""},{"$f":"IF($F9<>$G9,\n\nIF(NOT(ISERROR(SEARCH(\"!\",G9))),\"Error message, original field contained incorrect value\",\n\nIF(AND($E9=\"Company Name\",LEN($F9)>40),\"Name is too long\",\n\nIF(AND($E9=\"Region\",ISERROR(VLOOKUP('INSTITUTIONAL VENDOR'!$E$12,List_of_Region_Countries,1,0))),\"Not a region country, field removed\",\n\nIF(AND(ISERROR(VLOOKUP($F9,List_of_Dropdown_list_Values,1,0)),NOT(ISERROR(VLOOKUP($G9,List_of_Dropdown_list_Values,1,0)))),\"Original Value was not from dropdown list, has been corrected\",\n\nIF(AND($E9=\"Account type\",OR('INSTITUTIONAL VENDOR'!$C$35=\"370 Russian Fed.\",'INSTITUTIONAL VENDOR'!$C$35=\"681 Angola\",'INSTITUTIONAL VENDOR'!$C$35=\"689 Mozambique\")),\"Digits must be moved to account number as per country specifics\",\n\nIF(AND($E9=\"Vendor's Bank Account Number\",OR('INSTITUTIONAL VENDOR'!$C$35=\"370 Russian Fed.\",'INSTITUTIONAL VENDOR'!$C$35=\"681 Angola\",'INSTITUTIONAL VENDOR'!$C$35=\"689 Mozambique\"),LEN(Log_file!$F9)>LEN(Log_file!$G9)),\"Digits moved to account key as per country specifics\",\n\nIF(AND(LEN(SUBSTITUTE(TRIM($F9),\" \",\"\"))=LEN(SUBSTITUTE(TRIM($G9),\" \",\"\")),LEN($F9)>LEN($G9)),\"Spaces removed\",\n\nIF(LEN($F9)>VLOOKUP($E9,SAP_fields_MAX_length,2,0),\"Original value length was over SAP limit\",\n\n\"Number Format/Special characters substituted or Unknown Reason\")))))))),\n\n\"\")","v":""},"",null,null,null,"Digits must be moved to account number as per country specifics","No Action Required"]
[{"$f":"IF(C10<>D10,MAX(A$1:$A9)+1,0)","v":0},"Mobile Telephone",{"$f":"IF(ISBLANK(INSTITUTIONAL!C16),\"\",INSTITUTIONAL!C16)","v":"380961478054"},{"$f":"IF(ISBLANK('INSTITUTIONAL VENDOR'!C16),\"\",'INSTITUTIONAL VENDOR'!C16)","v":"380961478054"},{"$f":"IFERROR(VLOOKUP(ROWS($F$1:F9),A:D,2,0),\"\")","v":""},{"$f":"IFERROR(VLOOKUP(ROWS($F$1:F9),A:D,3,0),\"\")","v":""},{"$f":"IFERROR(VLOOKUP(ROWS($F$1:F9),A:D,4,0),\"\")","v":""},{"$f":"IF($F10<>$G10,\n\nIF(NOT(ISERROR(SEARCH(\"!\",G10))),\"Error message, original field contained incorrect value\",\n\nIF(AND($E10=\"Company Name\",LEN($F10)>40),\"Name is too long\",\n\nIF(AND($E10=\"Region\",ISERROR(VLOOKUP('INSTITUTIONAL VENDOR'!$E$12,List_of_Region_Countries,1,0))),\"Not a region country, field removed\",\n\nIF(AND(ISERROR(VLOOKUP($F10,List_of_Dropdown_list_Values,1,0)),NOT(ISERROR(VLOOKUP($G10,List_of_Dropdown_list_Values,1,0)))),\"Original Value was not from dropdown list, has been corrected\",\n\nIF(AND($E10=\"Account type\",OR('INSTITUTIONAL VENDOR'!$C$35=\"370 Russian Fed.\",'INSTITUTIONAL VENDOR'!$C$35=\"681 Angola\",'INSTITUTIONAL VENDOR'!$C$35=\"689 Mozambique\")),\"Digits must be moved to account number as per country specifics\",\n\nIF(AND($E10=\"Vendor's Bank Account Number\",OR('INSTITUTIONAL VENDOR'!$C$35=\"370 Russian Fed.\",'INSTITUTIONAL VENDOR'!$C$35=\"681 Angola\",'INSTITUTIONAL VENDOR'!$C$35=\"689 Mozambique\"),LEN(Log_file!$F10)>LEN(Log_file!$G10)),\"Digits moved to account key as per country specifics\",\n\nIF(AND(LEN(SUBSTITUTE(TRIM($F10),\" \",\"\"))=LEN(SUBSTITUTE(TRIM($G10),\" \",\"\")),LEN($F10)>LEN($G10)),\"Spaces removed\",\n\nIF(LEN($F10)>VLOOKUP($E10,SAP_fields_MAX_length,2,0),\"Original value length was over SAP limit\",\n\n\"Number Format/Special characters substituted or Unknown Reason\")))))))),\n\n\"\")","v":""},"",null,null,null,"Digits moved to account key as per country specifics","No Action Required"]
[{"$f":"IF(C11<>D11,MAX(A$1:$A10)+1,0)","v":0},"Fax",{"$f":"IF(ISBLANK(INSTITUTIONAL!C17),\"\",INSTITUTIONAL!C17)","v":""},{"$f":"IF(ISBLANK('INSTITUTIONAL VENDOR'!C17),\"\",'INSTITUTIONAL VENDOR'!C17)","v":""},{"$f":"IFERROR(VLOOKUP(ROWS($F$1:F10),A:D,2,0),\"\")","v":""},{"$f":"IFERROR(VLOOKUP(ROWS($F$1:F10),A:D,3,0),\"\")","v":""},{"$f":"IFERROR(VLOOKUP(ROWS($F$1:F10),A:D,4,0),\"\")","v":""},{"$f":"IF($F11<>$G11,\n\nIF(NOT(ISERROR(SEARCH(\"!\",G11))),\"Error message, original field contained incorrect value\",\n\nIF(AND($E11=\"Company Name\",LEN($F11)>40),\"Name is too long\",\n\nIF(AND($E11=\"Region\",ISERROR(VLOOKUP('INSTITUTIONAL VENDOR'!$E$12,List_of_Region_Countries,1,0))),\"Not a region country, field removed\",\n\nIF(AND(ISERROR(VLOOKUP($F11,List_of_Dropdown_list_Values,1,0)),NOT(ISERROR(VLOOKUP($G11,List_of_Dropdown_list_Values,1,0)))),\"Original Value was not from dropdown list, has been corrected\",\n\nIF(AND($E11=\"Account type\",OR('INSTITUTIONAL VENDOR'!$C$35=\"370 Russian Fed.\",'INSTITUTIONAL VENDOR'!$C$35=\"681 Angola\",'INSTITUTIONAL VENDOR'!$C$35=\"689 Mozambique\")),\"Digits must be moved to account number as per country specifics\",\n\nIF(AND($E11=\"Vendor's Bank Account Number\",OR('INSTITUTIONAL VENDOR'!$C$35=\"370 Russian Fed.\",'INSTITUTIONAL VENDOR'!$C$35=\"681 Angola\",'INSTITUTIONAL VENDOR'!$C$35=\"689 Mozambique\"),LEN(Log_file!$F11)>LEN(Log_file!$G11)),\"Digits moved to account key as per country specifics\",\n\nIF(AND(LEN(SUBSTITUTE(TRIM($F11),\" \",\"\"))=LEN(SUBSTITUTE(TRIM($G11),\" \",\"\")),LEN($F11)>LEN($G11)),\"Spaces removed\",\n\nIF(LEN($F11)>VLOOKUP($E11,SAP_fields_MAX_length,2,0),\"Original value length was over SAP limit\",\n\n\"Number Format/Special characters substituted or Unknown Reason\")))))))),\n\n\"\")","v":""},""]
[{"$f":"IF(C12<>D12,MAX(A$1:$A11)+1,0)","v":0},"Name of Contact",{"$f":"IF(ISBLANK(INSTITUTIONAL!C18),\"\",INSTITUTIONAL!C18)","v":"AKSIUTA TETIANA"},{"$f":"IF(ISBLANK('INSTITUTIONAL VENDOR'!C18),\"\",'INSTITUTIONAL VENDOR'!C18)","v":"Aksiuta Tetiana"},{"$f":"IFERROR(VLOOKUP(ROWS($F$1:F11),A:D,2,0),\"\")","v":""},{"$f":"IFERROR(VLOOKUP(ROWS($F$1:F11),A:D,3,0),\"\")","v":""},{"$f":"IFERROR(VLOOKUP(ROWS($F$1:F11),A:D,4,0),\"\")","v":""},{"$f":"IF($F12<>$G12,\n\nIF(NOT(ISERROR(SEARCH(\"!\",G12))),\"Error message, original field contained incorrect value\",\n\nIF(AND($E12=\"Company Name\",LEN($F12)>40),\"Name is too long\",\n\nIF(AND($E12=\"Region\",ISERROR(VLOOKUP('INSTITUTIONAL VENDOR'!$E$12,List_of_Region_Countries,1,0))),\"Not a region country, field removed\",\n\nIF(AND(ISERROR(VLOOKUP($F12,List_of_Dropdown_list_Values,1,0)),NOT(ISERROR(VLOOKUP($G12,List_of_Dropdown_list_Values,1,0)))),\"Original Value was not from dropdown list, has been corrected\",\n\nIF(AND($E12=\"Account type\",OR('INSTITUTIONAL VENDOR'!$C$35=\"370 Russian Fed.\",'INSTITUTIONAL VENDOR'!$C$35=\"681 Angola\",'INSTITUTIONAL VENDOR'!$C$35=\"689 Mozambique\")),\"Digits must be moved to account number as per country specifics\",\n\nIF(AND($E12=\"Vendor's Bank Account Number\",OR('INSTITUTIONAL VENDOR'!$C$35=\"370 Russian Fed.\",'INSTITUTIONAL VENDOR'!$C$35=\"681 Angola\",'INSTITUTIONAL VENDOR'!$C$35=\"689 Mozambique\"),LEN(Log_file!$F12)>LEN(Log_file!$G12)),\"Digits moved to account key as per country specifics\",\n\nIF(AND(LEN(SUBSTITUTE(TRIM($F12),\" \",\"\"))=LEN(SUBSTITUTE(TRIM($G12),\" \",\"\")),LEN($F12)>LEN($G12)),\"Spaces removed\",\n\nIF(LEN($F12)>VLOOKUP($E12,SAP_fields_MAX_length,2,0),\"Original value length was over SAP limit\",\n\n\"Number Format/Special characters substituted or Unknown Reason\")))))))),\n\n\"\")","v":""},""]
[{"$f":"IF(C13<>D13,MAX(A$1:$A12)+1,0)","v":0},"Contact person's E-mail Address  ",{"$f":"IF(ISBLANK(INSTITUTIONAL!C19),\"\",INSTITUTIONAL!C19)","v":"oplata.anuka@gmail.com"},{"$f":"IF(ISBLANK('INSTITUTIONAL VENDOR'!C19),\"\",'INSTITUTIONAL VENDOR'!C19)","v":"oplata.anuka@gmail.com"},{"$f":"IFERROR(VLOOKUP(ROWS($F$1:F12),A:D,2,0),\"\")","v":""},{"$f":"IFERROR(VLOOKUP(ROWS($F$1:F12),A:D,3,0),\"\")","v":""},{"$f":"IFERROR(VLOOKUP(ROWS($F$1:F12),A:D,4,0),\"\")","v":""},{"$f":"IF($F13<>$G13,\n\nIF(NOT(ISERROR(SEARCH(\"!\",G13))),\"Error message, original field contained incorrect value\",\n\nIF(AND($E13=\"Company Name\",LEN($F13)>40),\"Name is too long\",\n\nIF(AND($E13=\"Region\",ISERROR(VLOOKUP('INSTITUTIONAL VENDOR'!$E$12,List_of_Region_Countries,1,0))),\"Not a region country, field removed\",\n\nIF(AND(ISERROR(VLOOKUP($F13,List_of_Dropdown_list_Values,1,0)),NOT(ISERROR(VLOOKUP($G13,List_of_Dropdown_list_Values,1,0)))),\"Original Value was not from dropdown list, has been corrected\",\n\nIF(AND($E13=\"Account type\",OR('INSTITUTIONAL VENDOR'!$C$35=\"370 Russian Fed.\",'INSTITUTIONAL VENDOR'!$C$35=\"681 Angola\",'INSTITUTIONAL VENDOR'!$C$35=\"689 Mozambique\")),\"Digits must be moved to account number as per country specifics\",\n\nIF(AND($E13=\"Vendor's Bank Account Number\",OR('INSTITUTIONAL VENDOR'!$C$35=\"370 Russian Fed.\",'INSTITUTIONAL VENDOR'!$C$35=\"681 Angola\",'INSTITUTIONAL VENDOR'!$C$35=\"689 Mozambique\"),LEN(Log_file!$F13)>LEN(Log_file!$G13)),\"Digits moved to account key as per country specifics\",\n\nIF(AND(LEN(SUBSTITUTE(TRIM($F13),\" \",\"\"))=LEN(SUBSTITUTE(TRIM($G13),\" \",\"\")),LEN($F13)>LEN($G13)),\"Spaces removed\",\n\nIF(LEN($F13)>VLOOKUP($E13,SAP_fields_MAX_length,2,0),\"Original value length was over SAP limit\",\n\n\"Number Format/Special characters substituted or Unknown Reason\")))))))),\n\n\"\")","v":""},""]
[{"$f":"IF(C14<>D14,MAX(A$1:$A13)+1,0)","v":0},"E-mail Address (Payment advice)  ",{"$f":"IF(ISBLANK(INSTITUTIONAL!C20),\"\",INSTITUTIONAL!C20)","v":"oplata.anuka@gmail.com"},{"$f":"IF(ISBLANK('INSTITUTIONAL VENDOR'!C20),\"\",'INSTITUTIONAL VENDOR'!C20)","v":"oplata.anuka@gmail.com"},{"$f":"IFERROR(VLOOKUP(ROWS($F$1:F13),A:D,2,0),\"\")","v":""},{"$f":"IFERROR(VLOOKUP(ROWS($F$1:F13),A:D,3,0),\"\")","v":""},{"$f":"IFERROR(VLOOKUP(ROWS($F$1:F13),A:D,4,0),\"\")","v":""},{"$f":"IF($F14<>$G14,\n\nIF(NOT(ISERROR(SEARCH(\"!\",G14))),\"Error message, original field contained incorrect value\",\n\nIF(AND($E14=\"Company Name\",LEN($F14)>40),\"Name is too long\",\n\nIF(AND($E14=\"Region\",ISERROR(VLOOKUP('INSTITUTIONAL VENDOR'!$E$12,List_of_Region_Countries,1,0))),\"Not a region country, field removed\",\n\nIF(AND(ISERROR(VLOOKUP($F14,List_of_Dropdown_list_Values,1,0)),NOT(ISERROR(VLOOKUP($G14,List_of_Dropdown_list_Values,1,0)))),\"Original Value was not from dropdown list, has been corrected\",\n\nIF(AND($E14=\"Account type\",OR('INSTITUTIONAL VENDOR'!$C$35=\"370 Russian Fed.\",'INSTITUTIONAL VENDOR'!$C$35=\"681 Angola\",'INSTITUTIONAL VENDOR'!$C$35=\"689 Mozambique\")),\"Digits must be moved to account number as per country specifics\",\n\nIF(AND($E14=\"Vendor's Bank Account Number\",OR('INSTITUTIONAL VENDOR'!$C$35=\"370 Russian Fed.\",'INSTITUTIONAL VENDOR'!$C$35=\"681 Angola\",'INSTITUTIONAL VENDOR'!$C$35=\"689 Mozambique\"),LEN(Log_file!$F14)>LEN(Log_file!$G14)),\"Digits moved to account key as per country specifics\",\n\nIF(AND(LEN(SUBSTITUTE(TRIM($F14),\" \",\"\"))=LEN(SUBSTITUTE(TRIM($G14),\" \",\"\")),LEN($F14)>LEN($G14)),\"Spaces removed\",\n\nIF(LEN($F14)>VLOOKUP($E14,SAP_fields_MAX_length,2,0),\"Original value length was over SAP limit\",\n\n\"Number Format/Special characters substituted or Unknown Reason\")))))))),\n\n\"\")","v":""},""]
[{"$f":"IF(C15<>D15,MAX(A$1:$A14)+1,0)","v":0},"WEB Site",{"$f":"IF(ISBLANK(INSTITUTIONAL!C21),\"\",INSTITUTIONAL!C21)","v":""},{"$f":"IF(ISBLANK('INSTITUTIONAL VENDOR'!C21),\"\",'INSTITUTIONAL VENDOR'!C21)","v":""},{"$f":"IFERROR(VLOOKUP(ROWS($F$1:F14),A:D,2,0),\"\")","v":""},{"$f":"IFERROR(VLOOKUP(ROWS($F$1:F14),A:D,3,0),\"\")","v":""},{"$f":"IFERROR(VLOOKUP(ROWS($F$1:F14),A:D,4,0),\"\")","v":""},{"$f":"IF($F15<>$G15,\n\nIF(NOT(ISERROR(SEARCH(\"!\",G15))),\"Error message, original field contained incorrect value\",\n\nIF(AND($E15=\"Company Name\",LEN($F15)>40),\"Name is too long\",\n\nIF(AND($E15=\"Region\",ISERROR(VLOOKUP('INSTITUTIONAL VENDOR'!$E$12,List_of_Region_Countries,1,0))),\"Not a region country, field removed\",\n\nIF(AND(ISERROR(VLOOKUP($F15,List_of_Dropdown_list_Values,1,0)),NOT(ISERROR(VLOOKUP($G15,List_of_Dropdown_list_Values,1,0)))),\"Original Value was not from dropdown list, has been corrected\",\n\nIF(AND($E15=\"Account type\",OR('INSTITUTIONAL VENDOR'!$C$35=\"370 Russian Fed.\",'INSTITUTIONAL VENDOR'!$C$35=\"681 Angola\",'INSTITUTIONAL VENDOR'!$C$35=\"689 Mozambique\")),\"Digits must be moved to account number as per country specifics\",\n\nIF(AND($E15=\"Vendor's Bank Account Number\",OR('INSTITUTIONAL VENDOR'!$C$35=\"370 Russian Fed.\",'INSTITUTIONAL VENDOR'!$C$35=\"681 Angola\",'INSTITUTIONAL VENDOR'!$C$35=\"689 Mozambique\"),LEN(Log_file!$F15)>LEN(Log_file!$G15)),\"Digits moved to account key as per country specifics\",\n\nIF(AND(LEN(SUBSTITUTE(TRIM($F15),\" \",\"\"))=LEN(SUBSTITUTE(TRIM($G15),\" \",\"\")),LEN($F15)>LEN($G15)),\"Spaces removed\",\n\nIF(LEN($F15)>VLOOKUP($E15,SAP_fields_MAX_length,2,0),\"Original value length was over SAP limit\",\n\n\"Number Format/Special characters substituted or Unknown Reason\")))))))),\n\n\"\")","v":""},""]
[{"$f":"IF(C16<>D16,MAX(A$1:$A15)+1,0)","v":0},"Company Name",{"$f":"IF(ISBLANK(INSTITUTIONAL!E6),\"\",INSTITUTIONAL!E6)","v":"AKSIUTA TETIANA Individual Entepreneur"},{"$f":"IF(ISBLANK('INSTITUTIONAL VENDOR'!E6),\"\",'INSTITUTIONAL VENDOR'!E6)","v":"AKSIUTA TETIANA Individual Entepreneur"},{"$f":"IFERROR(VLOOKUP(ROWS($F$1:F15),A:D,2,0),\"\")","v":""},{"$f":"IFERROR(VLOOKUP(ROWS($F$1:F15),A:D,3,0),\"\")","v":""},{"$f":"IFERROR(VLOOKUP(ROWS($F$1:F15),A:D,4,0),\"\")","v":""},{"$f":"IF($F16<>$G16,\n\nIF(NOT(ISERROR(SEARCH(\"!\",G16))),\"Error message, original field contained incorrect value\",\n\nIF(AND($E16=\"Company Name\",LEN($F16)>40),\"Name is too long\",\n\nIF(AND($E16=\"Region\",ISERROR(VLOOKUP('INSTITUTIONAL VENDOR'!$E$12,List_of_Region_Countries,1,0))),\"Not a region country, field removed\",\n\nIF(AND(ISERROR(VLOOKUP($F16,List_of_Dropdown_list_Values,1,0)),NOT(ISERROR(VLOOKUP($G16,List_of_Dropdown_list_Values,1,0)))),\"Original Value was not from dropdown list, has been corrected\",\n\nIF(AND($E16=\"Account type\",OR('INSTITUTIONAL VENDOR'!$C$35=\"370 Russian Fed.\",'INSTITUTIONAL VENDOR'!$C$35=\"681 Angola\",'INSTITUTIONAL VENDOR'!$C$35=\"689 Mozambique\")),\"Digits must be moved to account number as per country specifics\",\n\nIF(AND($E16=\"Vendor's Bank Account Number\",OR('INSTITUTIONAL VENDOR'!$C$35=\"370 Russian Fed.\",'INSTITUTIONAL VENDOR'!$C$35=\"681 Angola\",'INSTITUTIONAL VENDOR'!$C$35=\"689 Mozambique\"),LEN(Log_file!$F16)>LEN(Log_file!$G16)),\"Digits moved to account key as per country specifics\",\n\nIF(AND(LEN(SUBSTITUTE(TRIM($F16),\" \",\"\"))=LEN(SUBSTITUTE(TRIM($G16),\" \",\"\")),LEN($F16)>LEN($G16)),\"Spaces removed\",\n\nIF(LEN($F16)>VLOOKUP($E16,SAP_fields_MAX_length,2,0),\"Original value length was over SAP limit\",\n\n\"Number Format/Special characters substituted or Unknown Reason\")))))))),\n\n\"\")","v":""},""]
[{"$f":"IF(C17<>D17,MAX(A$1:$A16)+1,0)","v":0},"Search Term",{"$f":"IF(ISBLANK(INSTITUTIONAL!E7),\"\",INSTITUTIONAL!E7)","v":""},{"$f":"IF(ISBLANK('INSTITUTIONAL VENDOR'!E7),\"\",'INSTITUTIONAL VENDOR'!E7)","v":""},{"$f":"IFERROR(VLOOKUP(ROWS($F$1:F16),A:D,2,0),\"\")","v":""},{"$f":"IFERROR(VLOOKUP(ROWS($F$1:F16),A:D,3,0),\"\")","v":""},{"$f":"IFERROR(VLOOKUP(ROWS($F$1:F16),A:D,4,0),\"\")","v":""},{"$f":"IF($F17<>$G17,\n\nIF(NOT(ISERROR(SEARCH(\"!\",G17))),\"Error message, original field contained incorrect value\",\n\nIF(AND($E17=\"Company Name\",LEN($F17)>40),\"Name is too long\",\n\nIF(AND($E17=\"Region\",ISERROR(VLOOKUP('INSTITUTIONAL VENDOR'!$E$12,List_of_Region_Countries,1,0))),\"Not a region country, field removed\",\n\nIF(AND(ISERROR(VLOOKUP($F17,List_of_Dropdown_list_Values,1,0)),NOT(ISERROR(VLOOKUP($G17,List_of_Dropdown_list_Values,1,0)))),\"Original Value was not from dropdown list, has been corrected\",\n\nIF(AND($E17=\"Account type\",OR('INSTITUTIONAL VENDOR'!$C$35=\"370 Russian Fed.\",'INSTITUTIONAL VENDOR'!$C$35=\"681 Angola\",'INSTITUTIONAL VENDOR'!$C$35=\"689 Mozambique\")),\"Digits must be moved to account number as per country specifics\",\n\nIF(AND($E17=\"Vendor's Bank Account Number\",OR('INSTITUTIONAL VENDOR'!$C$35=\"370 Russian Fed.\",'INSTITUTIONAL VENDOR'!$C$35=\"681 Angola\",'INSTITUTIONAL VENDOR'!$C$35=\"689 Mozambique\"),LEN(Log_file!$F17)>LEN(Log_file!$G17)),\"Digits moved to account key as per country specifics\",\n\nIF(AND(LEN(SUBSTITUTE(TRIM($F17),\" \",\"\"))=LEN(SUBSTITUTE(TRIM($G17),\" \",\"\")),LEN($F17)>LEN($G17)),\"Spaces removed\",\n\nIF(LEN($F17)>VLOOKUP($E17,SAP_fields_MAX_length,2,0),\"Original value length was over SAP limit\",\n\n\"Number Format/Special characters substituted or Unknown Reason\")))))))),\n\n\"\")","v":""},""]
[{"$f":"IF(C18<>D18,MAX(A$1:$A17)+1,0)","v":1},"House number",{"$f":"IF(ISBLANK(INSTITUTIONAL!E8),\"\",INSTITUTIONAL!E8)","v":103},{"$f":"IF(ISBLANK('INSTITUTIONAL VENDOR'!E8),\"\",'INSTITUTIONAL VENDOR'!E8)","v":"103"},{"$f":"IFERROR(VLOOKUP(ROWS($F$1:F17),A:D,2,0),\"\")","v":""},{"$f":"IFERROR(VLOOKUP(ROWS($F$1:F17),A:D,3,0),\"\")","v":""},{"$f":"IFERROR(VLOOKUP(ROWS($F$1:F17),A:D,4,0),\"\")","v":""},{"$f":"IF($F18<>$G18,\n\nIF(NOT(ISERROR(SEARCH(\"!\",G18))),\"Error message, original field contained incorrect value\",\n\nIF(AND($E18=\"Company Name\",LEN($F18)>40),\"Name is too long\",\n\nIF(AND($E18=\"Region\",ISERROR(VLOOKUP('INSTITUTIONAL VENDOR'!$E$12,List_of_Region_Countries,1,0))),\"Not a region country, field removed\",\n\nIF(AND(ISERROR(VLOOKUP($F18,List_of_Dropdown_list_Values,1,0)),NOT(ISERROR(VLOOKUP($G18,List_of_Dropdown_list_Values,1,0)))),\"Original Value was not from dropdown list, has been corrected\",\n\nIF(AND($E18=\"Account type\",OR('INSTITUTIONAL VENDOR'!$C$35=\"370 Russian Fed.\",'INSTITUTIONAL VENDOR'!$C$35=\"681 Angola\",'INSTITUTIONAL VENDOR'!$C$35=\"689 Mozambique\")),\"Digits must be moved to account number as per country specifics\",\n\nIF(AND($E18=\"Vendor's Bank Account Number\",OR('INSTITUTIONAL VENDOR'!$C$35=\"370 Russian Fed.\",'INSTITUTIONAL VENDOR'!$C$35=\"681 Angola\",'INSTITUTIONAL VENDOR'!$C$35=\"689 Mozambique\"),LEN(Log_file!$F18)>LEN(Log_file!$G18)),\"Digits moved to account key as per country specifics\",\n\nIF(AND(LEN(SUBSTITUTE(TRIM($F18),\" \",\"\"))=LEN(SUBSTITUTE(TRIM($G18),\" \",\"\")),LEN($F18)>LEN($G18)),\"Spaces removed\",\n\nIF(LEN($F18)>VLOOKUP($E18,SAP_fields_MAX_length,2,0),\"Original value length was over SAP limit\",\n\n\"Number Format/Special characters substituted or Unknown Reason\")))))))),\n\n\"\")","v":""},""]
[{"$f":"IF(C19<>D19,MAX(A$1:$A18)+1,0)","v":0},"Street",{"$f":"IF(ISBLANK(INSTITUTIONAL!E9),\"\",INSTITUTIONAL!E9)","v":"Pereyaslavskaya"},{"$f":"IF(ISBLANK('INSTITUTIONAL VENDOR'!E9),\"\",'INSTITUTIONAL VENDOR'!E9)","v":"Pereyaslavskaya"},{"$f":"IFERROR(VLOOKUP(ROWS($F$1:F18),A:D,2,0),\"\")","v":""},{"$f":"IFERROR(VLOOKUP(ROWS($F$1:F18),A:D,3,0),\"\")","v":""},{"$f":"IFERROR(VLOOKUP(ROWS($F$1:F18),A:D,4,0),\"\")","v":""},{"$f":"IF($F19<>$G19,\n\nIF(NOT(ISERROR(SEARCH(\"!\",G19))),\"Error message, original field contained incorrect value\",\n\nIF(AND($E19=\"Company Name\",LEN($F19)>40),\"Name is too long\",\n\nIF(AND($E19=\"Region\",ISERROR(VLOOKUP('INSTITUTIONAL VENDOR'!$E$12,List_of_Region_Countries,1,0))),\"Not a region country, field removed\",\n\nIF(AND(ISERROR(VLOOKUP($F19,List_of_Dropdown_list_Values,1,0)),NOT(ISERROR(VLOOKUP($G19,List_of_Dropdown_list_Values,1,0)))),\"Original Value was not from dropdown list, has been corrected\",\n\nIF(AND($E19=\"Account type\",OR('INSTITUTIONAL VENDOR'!$C$35=\"370 Russian Fed.\",'INSTITUTIONAL VENDOR'!$C$35=\"681 Angola\",'INSTITUTIONAL VENDOR'!$C$35=\"689 Mozambique\")),\"Digits must be moved to account number as per country specifics\",\n\nIF(AND($E19=\"Vendor's Bank Account Number\",OR('INSTITUTIONAL VENDOR'!$C$35=\"370 Russian Fed.\",'INSTITUTIONAL VENDOR'!$C$35=\"681 Angola\",'INSTITUTIONAL VENDOR'!$C$35=\"689 Mozambique\"),LEN(Log_file!$F19)>LEN(Log_file!$G19)),\"Digits moved to account key as per country specifics\",\n\nIF(AND(LEN(SUBSTITUTE(TRIM($F19),\" \",\"\"))=LEN(SUBSTITUTE(TRIM($G19),\" \",\"\")),LEN($F19)>LEN($G19)),\"Spaces removed\",\n\nIF(LEN($F19)>VLOOKUP($E19,SAP_fields_MAX_length,2,0),\"Original value length was over SAP limit\",\n\n\"Number Format/Special characters substituted or Unknown Reason\")))))))),\n\n\"\")","v":""},""]
[{"$f":"IF(C20<>D20,MAX(A$1:$A19)+1,0)","v":0},"Zip / Postal code",{"$f":"IF(ISBLANK(INSTITUTIONAL!E10),\"\",INSTITUTIONAL!E10)","v":""},{"$f":"IF(ISBLANK('INSTITUTIONAL VENDOR'!E10),\"\",'INSTITUTIONAL VENDOR'!E10)","v":""},{"$f":"IFERROR(VLOOKUP(ROWS($F$1:F19),A:D,2,0),\"\")","v":""},{"$f":"IFERROR(VLOOKUP(ROWS($F$1:F19),A:D,3,0),\"\")","v":""},{"$f":"IFERROR(VLOOKUP(ROWS($F$1:F19),A:D,4,0),\"\")","v":""},{"$f":"IF($F20<>$G20,\n\nIF(NOT(ISERROR(SEARCH(\"!\",G20))),\"Error message, original field contained incorrect value\",\n\nIF(AND($E20=\"Company Name\",LEN($F20)>40),\"Name is too long\",\n\nIF(AND($E20=\"Region\",ISERROR(VLOOKUP('INSTITUTIONAL VENDOR'!$E$12,List_of_Region_Countries,1,0))),\"Not a region country, field removed\",\n\nIF(AND(ISERROR(VLOOKUP($F20,List_of_Dropdown_list_Values,1,0)),NOT(ISERROR(VLOOKUP($G20,List_of_Dropdown_list_Values,1,0)))),\"Original Value was not from dropdown list, has been corrected\",\n\nIF(AND($E20=\"Account type\",OR('INSTITUTIONAL VENDOR'!$C$35=\"370 Russian Fed.\",'INSTITUTIONAL VENDOR'!$C$35=\"681 Angola\",'INSTITUTIONAL VENDOR'!$C$35=\"689 Mozambique\")),\"Digits must be moved to account number as per country specifics\",\n\nIF(AND($E20=\"Vendor's Bank Account Number\",OR('INSTITUTIONAL VENDOR'!$C$35=\"370 Russian Fed.\",'INSTITUTIONAL VENDOR'!$C$35=\"681 Angola\",'INSTITUTIONAL VENDOR'!$C$35=\"689 Mozambique\"),LEN(Log_file!$F20)>LEN(Log_file!$G20)),\"Digits moved to account key as per country specifics\",\n\nIF(AND(LEN(SUBSTITUTE(TRIM($F20),\" \",\"\"))=LEN(SUBSTITUTE(TRIM($G20),\" \",\"\")),LEN($F20)>LEN($G20)),\"Spaces removed\",\n\nIF(LEN($F20)>VLOOKUP($E20,SAP_fields_MAX_length,2,0),\"Original value length was over SAP limit\",\n\n\"Number Format/Special characters substituted or Unknown Reason\")))))))),\n\n\"\")","v":""},""]
[{"$f":"IF(C21<>D21,MAX(A$1:$A20)+1,0)","v":0},"City",{"$f":"IF(ISBLANK(INSTITUTIONAL!E11),\"\",INSTITUTIONAL!E11)","v":"Dnipro"},{"$f":"IF(ISBLANK('INSTITUTIONAL VENDOR'!E11),\"\",'INSTITUTIONAL VENDOR'!E11)","v":"Dnipro"},{"$f":"IFERROR(VLOOKUP(ROWS($F$1:F20),A:D,2,0),\"\")","v":""},{"$f":"IFERROR(VLOOKUP(ROWS($F$1:F20),A:D,3,0),\"\")","v":""},{"$f":"IFERROR(VLOOKUP(ROWS($F$1:F20),A:D,4,0),\"\")","v":""},{"$f":"IF($F21<>$G21,\n\nIF(NOT(ISERROR(SEARCH(\"!\",G21))),\"Error message, original field contained incorrect value\",\n\nIF(AND($E21=\"Company Name\",LEN($F21)>40),\"Name is too long\",\n\nIF(AND($E21=\"Region\",ISERROR(VLOOKUP('INSTITUTIONAL VENDOR'!$E$12,List_of_Region_Countries,1,0))),\"Not a region country, field removed\",\n\nIF(AND(ISERROR(VLOOKUP($F21,List_of_Dropdown_list_Values,1,0)),NOT(ISERROR(VLOOKUP($G21,List_of_Dropdown_list_Values,1,0)))),\"Original Value was not from dropdown list, has been corrected\",\n\nIF(AND($E21=\"Account type\",OR('INSTITUTIONAL VENDOR'!$C$35=\"370 Russian Fed.\",'INSTITUTIONAL VENDOR'!$C$35=\"681 Angola\",'INSTITUTIONAL VENDOR'!$C$35=\"689 Mozambique\")),\"Digits must be moved to account number as per country specifics\",\n\nIF(AND($E21=\"Vendor's Bank Account Number\",OR('INSTITUTIONAL VENDOR'!$C$35=\"370 Russian Fed.\",'INSTITUTIONAL VENDOR'!$C$35=\"681 Angola\",'INSTITUTIONAL VENDOR'!$C$35=\"689 Mozambique\"),LEN(Log_file!$F21)>LEN(Log_file!$G21)),\"Digits moved to account key as per country specifics\",\n\nIF(AND(LEN(SUBSTITUTE(TRIM($F21),\" \",\"\"))=LEN(SUBSTITUTE(TRIM($G21),\" \",\"\")),LEN($F21)>LEN($G21)),\"Spaces removed\",\n\nIF(LEN($F21)>VLOOKUP($E21,SAP_fields_MAX_length,2,0),\"Original value length was over SAP limit\",\n\n\"Number Format/Special characters substituted or Unknown Reason\")))))))),\n\n\"\")","v":""},{"$f":"IF($H21=\"\",\"\",VLOOKUP($H21,M:N,2,0))","v":""}]
[{"$f":"IF(C22<>D22,MAX(A$1:$A21)+1,0)","v":0},"Country",{"$f":"IF(ISBLANK(INSTITUTIONAL!E12),\"\",INSTITUTIONAL!E12)","v":"441 Ukraine"},{"$f":"IF(ISBLANK('INSTITUTIONAL VENDOR'!E12),\"\",'INSTITUTIONAL VENDOR'!E12)","v":"441 Ukraine"},{"$f":"IFERROR(VLOOKUP(ROWS($F$1:F21),A:D,2,0),\"\")","v":""},{"$f":"IFERROR(VLOOKUP(ROWS($F$1:F21),A:D,3,0),\"\")","v":""},{"$f":"IFERROR(VLOOKUP(ROWS($F$1:F21),A:D,4,0),\"\")","v":""},{"$f":"IF($F22<>$G22,\n\nIF(NOT(ISERROR(SEARCH(\"!\",G22))),\"Error message, original field contained incorrect value\",\n\nIF(AND($E22=\"Company Name\",LEN($F22)>40),\"Name is too long\",\n\nIF(AND($E22=\"Region\",ISERROR(VLOOKUP('INSTITUTIONAL VENDOR'!$E$12,List_of_Region_Countries,1,0))),\"Not a region country, field removed\",\n\nIF(AND(ISERROR(VLOOKUP($F22,List_of_Dropdown_list_Values,1,0)),NOT(ISERROR(VLOOKUP($G22,List_of_Dropdown_list_Values,1,0)))),\"Original Value was not from dropdown list, has been corrected\",\n\nIF(AND($E22=\"Account type\",OR('INSTITUTIONAL VENDOR'!$C$35=\"370 Russian Fed.\",'INSTITUTIONAL VENDOR'!$C$35=\"681 Angola\",'INSTITUTIONAL VENDOR'!$C$35=\"689 Mozambique\")),\"Digits must be moved to account number as per country specifics\",\n\nIF(AND($E22=\"Vendor's Bank Account Number\",OR('INSTITUTIONAL VENDOR'!$C$35=\"370 Russian Fed.\",'INSTITUTIONAL VENDOR'!$C$35=\"681 Angola\",'INSTITUTIONAL VENDOR'!$C$35=\"689 Mozambique\"),LEN(Log_file!$F22)>LEN(Log_file!$G22)),\"Digits moved to account key as per country specifics\",\n\nIF(AND(LEN(SUBSTITUTE(TRIM($F22),\" \",\"\"))=LEN(SUBSTITUTE(TRIM($G22),\" \",\"\")),LEN($F22)>LEN($G22)),\"Spaces removed\",\n\nIF(LEN($F22)>VLOOKUP($E22,SAP_fields_MAX_length,2,0),\"Original value length was over SAP limit\",\n\n\"Number Format/Special characters substituted or Unknown Reason\")))))))),\n\n\"\")","v":""},{"$f":"IF($H22=\"\",\"\",VLOOKUP($H22,M:N,2,0))","v":""}]
[{"$f":"IF(C23<>D23,MAX(A$1:$A22)+1,0)","v":2},"Region",{"$f":"IF(ISBLANK(INSTITUTIONAL!E13),\"\",INSTITUTIONAL!E13)","v":"… Select"},{"$f":"IF(ISBLANK('INSTITUTIONAL VENDOR'!E13),\"\",'INSTITUTIONAL VENDOR'!E13)","v":""},{"$f":"IFERROR(VLOOKUP(ROWS($F$1:F22),A:D,2,0),\"\")","v":""},{"$f":"IFERROR(VLOOKUP(ROWS($F$1:F22),A:D,3,0),\"\")","v":""},{"$f":"IFERROR(VLOOKUP(ROWS($F$1:F22),A:D,4,0),\"\")","v":""},{"$f":"IF($F23<>$G23,\n\nIF(NOT(ISERROR(SEARCH(\"!\",G23))),\"Error message, original field contained incorrect value\",\n\nIF(AND($E23=\"Company Name\",LEN($F23)>40),\"Name is too long\",\n\nIF(AND($E23=\"Region\",ISERROR(VLOOKUP('INSTITUTIONAL VENDOR'!$E$12,List_of_Region_Countries,1,0))),\"Not a region country, field removed\",\n\nIF(AND(ISERROR(VLOOKUP($F23,List_of_Dropdown_list_Values,1,0)),NOT(ISERROR(VLOOKUP($G23,List_of_Dropdown_list_Values,1,0)))),\"Original Value was not from dropdown list, has been corrected\",\n\nIF(AND($E23=\"Account type\",OR('INSTITUTIONAL VENDOR'!$C$35=\"370 Russian Fed.\",'INSTITUTIONAL VENDOR'!$C$35=\"681 Angola\",'INSTITUTIONAL VENDOR'!$C$35=\"689 Mozambique\")),\"Digits must be moved to account number as per country specifics\",\n\nIF(AND($E23=\"Vendor's Bank Account Number\",OR('INSTITUTIONAL VENDOR'!$C$35=\"370 Russian Fed.\",'INSTITUTIONAL VENDOR'!$C$35=\"681 Angola\",'INSTITUTIONAL VENDOR'!$C$35=\"689 Mozambique\"),LEN(Log_file!$F23)>LEN(Log_file!$G23)),\"Digits moved to account key as per country specifics\",\n\nIF(AND(LEN(SUBSTITUTE(TRIM($F23),\" \",\"\"))=LEN(SUBSTITUTE(TRIM($G23),\" \",\"\")),LEN($F23)>LEN($G23)),\"Spaces removed\",\n\nIF(LEN($F23)>VLOOKUP($E23,SAP_fields_MAX_length,2,0),\"Original value length was over SAP limit\",\n\n\"Number Format/Special characters substituted or Unknown Reason\")))))))),\n\n\"\")","v":""},""]
[{"$f":"IF(C24<>D24,MAX(A$1:$A23)+1,0)","v":0},"TAX ID #",{"$f":"IF(ISBLANK(INSTITUTIONAL!E21),\"\",INSTITUTIONAL!E21)","v":"2506100308"},{"$f":"IF(ISBLANK('INSTITUTIONAL VENDOR'!E21),\"\",'INSTITUTIONAL VENDOR'!E21)","v":"2506100308"},{"$f":"IFERROR(VLOOKUP(ROWS($F$1:F23),A:D,2,0),\"\")","v":""},{"$f":"IFERROR(VLOOKUP(ROWS($F$1:F23),A:D,3,0),\"\")","v":""},{"$f":"IFERROR(VLOOKUP(ROWS($F$1:F23),A:D,4,0),\"\")","v":""},{"$f":"IF($F24<>$G24,\n\nIF(NOT(ISERROR(SEARCH(\"!\",G24))),\"Error message, original field contained incorrect value\",\n\nIF(AND($E24=\"Company Name\",LEN($F24)>40),\"Name is too long\",\n\nIF(AND($E24=\"Region\",ISERROR(VLOOKUP('INSTITUTIONAL VENDOR'!$E$12,List_of_Region_Countries,1,0))),\"Not a region country, field removed\",\n\nIF(AND(ISERROR(VLOOKUP($F24,List_of_Dropdown_list_Values,1,0)),NOT(ISERROR(VLOOKUP($G24,List_of_Dropdown_list_Values,1,0)))),\"Original Value was not from dropdown list, has been corrected\",\n\nIF(AND($E24=\"Account type\",OR('INSTITUTIONAL VENDOR'!$C$35=\"370 Russian Fed.\",'INSTITUTIONAL VENDOR'!$C$35=\"681 Angola\",'INSTITUTIONAL VENDOR'!$C$35=\"689 Mozambique\")),\"Digits must be moved to account number as per country specifics\",\n\nIF(AND($E24=\"Vendor's Bank Account Number\",OR('INSTITUTIONAL VENDOR'!$C$35=\"370 Russian Fed.\",'INSTITUTIONAL VENDOR'!$C$35=\"681 Angola\",'INSTITUTIONAL VENDOR'!$C$35=\"689 Mozambique\"),LEN(Log_file!$F24)>LEN(Log_file!$G24)),\"Digits moved to account key as per country specifics\",\n\nIF(AND(LEN(SUBSTITUTE(TRIM($F24),\" \",\"\"))=LEN(SUBSTITUTE(TRIM($G24),\" \",\"\")),LEN($F24)>LEN($G24)),\"Spaces removed\",\n\nIF(LEN($F24)>VLOOKUP($E24,SAP_fields_MAX_length,2,0),\"Original value length was over SAP limit\",\n\n\"Number Format/Special characters substituted or Unknown Reason\")))))))),\n\n\"\")","v":""},""]
[{"$f":"IF(C25<>D25,MAX(A$1:$A24)+1,0)","v":3},"Account Type",{"$f":"IF(ISBLANK(INSTITUTIONAL!C27),\"\",\n\nIF(INSTITUTIONAL!C27=\"… Select\",\"… Select\",\n\nINSTITUTIONAL!C30))","v":"UA483052990000026008050274847"},{"$f":"IF(ISBLANK('INSTITUTIONAL VENDOR'!C27),\"\",'INSTITUTIONAL VENDOR'!C27)","v":"01 - Current/Checking account"},{"$f":"IFERROR(VLOOKUP(ROWS($F$1:F24),A:D,2,0),\"\")","v":""},{"$f":"IFERROR(VLOOKUP(ROWS($F$1:F24),A:D,3,0),\"\")","v":""},{"$f":"IFERROR(VLOOKUP(ROWS($F$1:F24),A:D,4,0),\"\")","v":""},{"$f":"IF($F25<>$G25,\n\nIF(NOT(ISERROR(SEARCH(\"!\",G25))),\"Error message, original field contained incorrect value\",\n\nIF(AND($E25=\"Company Name\",LEN($F25)>40),\"Name is too long\",\n\nIF(AND($E25=\"Region\",ISERROR(VLOOKUP('INSTITUTIONAL VENDOR'!$E$12,List_of_Region_Countries,1,0))),\"Not a region country, field removed\",\n\nIF(AND(ISERROR(VLOOKUP($F25,List_of_Dropdown_list_Values,1,0)),NOT(ISERROR(VLOOKUP($G25,List_of_Dropdown_list_Values,1,0)))),\"Original Value was not from dropdown list, has been corrected\",\n\nIF(AND($E25=\"Account type\",OR('INSTITUTIONAL VENDOR'!$C$35=\"370 Russian Fed.\",'INSTITUTIONAL VENDOR'!$C$35=\"681 Angola\",'INSTITUTIONAL VENDOR'!$C$35=\"689 Mozambique\")),\"Digits must be moved to account number as per country specifics\",\n\nIF(AND($E25=\"Vendor's Bank Account Number\",OR('INSTITUTIONAL VENDOR'!$C$35=\"370 Russian Fed.\",'INSTITUTIONAL VENDOR'!$C$35=\"681 Angola\",'INSTITUTIONAL VENDOR'!$C$35=\"689 Mozambique\"),LEN(Log_file!$F25)>LEN(Log_file!$G25)),\"Digits moved to account key as per country specifics\",\n\nIF(AND(LEN(SUBSTITUTE(TRIM($F25),\" \",\"\"))=LEN(SUBSTITUTE(TRIM($G25),\" \",\"\")),LEN($F25)>LEN($G25)),\"Spaces removed\",\n\nIF(LEN($F25)>VLOOKUP($E25,SAP_fields_MAX_length,2,0),\"Original value length was over SAP limit\",\n\n\"Number Format/Special characters substituted or Unknown Reason\")))))))),\n\n\"\")","v":""},""]
[{"$f":"IF(C26<>D26,MAX(A$1:$A25)+1,0)","v":0},"Vendor's Bank Account Number",{"$f":"IF(ISBLANK(INSTITUTIONAL!C28),\"\",INSTITUTIONAL!C28)","v":"UA483052990000026008050274847"},{"$f":"IF(ISBLANK('INSTITUTIONAL VENDOR'!C28),\"\",'INSTITUTIONAL VENDOR'!C28)","v":"UA483052990000026008050274847"},{"$f":"IFERROR(VLOOKUP(ROWS($F$1:F25),A:D,2,0),\"\")","v":""},{"$f":"IFERROR(VLOOKUP(ROWS($F$1:F25),A:D,3,0),\"\")","v":""},{"$f":"IFERROR(VLOOKUP(ROWS($F$1:F25),A:D,4,0),\"\")","v":""},{"$f":"IF($F26<>$G26,\n\nIF(NOT(ISERROR(SEARCH(\"!\",G26))),\"Error message, original field contained incorrect value\",\n\nIF(AND($E26=\"Company Name\",LEN($F26)>40),\"Name is too long\",\n\nIF(AND($E26=\"Region\",ISERROR(VLOOKUP('INSTITUTIONAL VENDOR'!$E$12,List_of_Region_Countries,1,0))),\"Not a region country, field removed\",\n\nIF(AND(ISERROR(VLOOKUP($F26,List_of_Dropdown_list_Values,1,0)),NOT(ISERROR(VLOOKUP($G26,List_of_Dropdown_list_Values,1,0)))),\"Original Value was not from dropdown list, has been corrected\",\n\nIF(AND($E26=\"Account type\",OR('INSTITUTIONAL VENDOR'!$C$35=\"370 Russian Fed.\",'INSTITUTIONAL VENDOR'!$C$35=\"681 Angola\",'INSTITUTIONAL VENDOR'!$C$35=\"689 Mozambique\")),\"Digits must be moved to account number as per country specifics\",\n\nIF(AND($E26=\"Vendor's Bank Account Number\",OR('INSTITUTIONAL VENDOR'!$C$35=\"370 Russian Fed.\",'INSTITUTIONAL VENDOR'!$C$35=\"681 Angola\",'INSTITUTIONAL VENDOR'!$C$35=\"689 Mozambique\"),LEN(Log_file!$F26)>LEN(Log_file!$G26)),\"Digits moved to account key as per country specifics\",\n\nIF(AND(LEN(SUBSTITUTE(TRIM($F26),\" \",\"\"))=LEN(SUBSTITUTE(TRIM($G26),\" \",\"\")),LEN($F26)>LEN($G26)),\"Spaces removed\",\n\nIF(LEN($F26)>VLOOKUP($E26,SAP_fields_MAX_length,2,0),\"Original value length was over SAP limit\",\n\n\"Number Format/Special characters substituted or Unknown Reason\")))))))),\n\n\"\")","v":""},""]
[{"$f":"IF(C27<>D27,MAX(A$1:$A26)+1,0)","v":0},"Account holder's name",{"$f":"IF(ISBLANK(INSTITUTIONAL!C29),\"\",INSTITUTIONAL!C29)","v":"AKSIUTA TETIANA"},{"$f":"IF(ISBLANK('INSTITUTIONAL VENDOR'!C29),\"\",'INSTITUTIONAL VENDOR'!C29)","v":"AKSIUTA TETIANA"},{"$f":"IFERROR(VLOOKUP(ROWS($F$1:F26),A:D,2,0),\"\")","v":""},{"$f":"IFERROR(VLOOKUP(ROWS($F$1:F26),A:D,3,0),\"\")","v":""},{"$f":"IFERROR(VLOOKUP(ROWS($F$1:F26),A:D,4,0),\"\")","v":""},{"$f":"IF($F27<>$G27,\n\nIF(NOT(ISERROR(SEARCH(\"!\",G27))),\"Error message, original field contained incorrect value\",\n\nIF(AND($E27=\"Company Name\",LEN($F27)>40),\"Name is too long\",\n\nIF(AND($E27=\"Region\",ISERROR(VLOOKUP('INSTITUTIONAL VENDOR'!$E$12,List_of_Region_Countries,1,0))),\"Not a region country, field removed\",\n\nIF(AND(ISERROR(VLOOKUP($F27,List_of_Dropdown_list_Values,1,0)),NOT(ISERROR(VLOOKUP($G27,List_of_Dropdown_list_Values,1,0)))),\"Original Value was not from dropdown list, has been corrected\",\n\nIF(AND($E27=\"Account type\",OR('INSTITUTIONAL VENDOR'!$C$35=\"370 Russian Fed.\",'INSTITUTIONAL VENDOR'!$C$35=\"681 Angola\",'INSTITUTIONAL VENDOR'!$C$35=\"689 Mozambique\")),\"Digits must be moved to account number as per country specifics\",\n\nIF(AND($E27=\"Vendor's Bank Account Number\",OR('INSTITUTIONAL VENDOR'!$C$35=\"370 Russian Fed.\",'INSTITUTIONAL VENDOR'!$C$35=\"681 Angola\",'INSTITUTIONAL VENDOR'!$C$35=\"689 Mozambique\"),LEN(Log_file!$F27)>LEN(Log_file!$G27)),\"Digits moved to account key as per country specifics\",\n\nIF(AND(LEN(SUBSTITUTE(TRIM($F27),\" \",\"\"))=LEN(SUBSTITUTE(TRIM($G27),\" \",\"\")),LEN($F27)>LEN($G27)),\"Spaces removed\",\n\nIF(LEN($F27)>VLOOKUP($E27,SAP_fields_MAX_length,2,0),\"Original value length was over SAP limit\",\n\n\"Number Format/Special characters substituted or Unknown Reason\")))))))),\n\n\"\")","v":""},""]
[{"$f":"IF(C28<>D28,MAX(A$1:$A27)+1,0)","v":0},"IBAN",{"$f":"IF(ISBLANK(INSTITUTIONAL!C30),\"\",INSTITUTIONAL!C30)","v":"UA483052990000026008050274847"},{"$f":"IF(ISBLANK('INSTITUTIONAL VENDOR'!C30),\"\",'INSTITUTIONAL VENDOR'!C30)","v":"UA483052990000026008050274847"},{"$f":"IFERROR(VLOOKUP(ROWS($F$1:F27),A:D,2,0),\"\")","v":""},{"$f":"IFERROR(VLOOKUP(ROWS($F$1:F27),A:D,3,0),\"\")","v":""},{"$f":"IFERROR(VLOOKUP(ROWS($F$1:F27),A:D,4,0),\"\")","v":""},{"$f":"IF($F28<>$G28,\n\nIF(NOT(ISERROR(SEARCH(\"!\",G28))),\"Error message, original field contained incorrect value\",\n\nIF(AND($E28=\"Company Name\",LEN($F28)>40),\"Name is too long\",\n\nIF(AND($E28=\"Region\",ISERROR(VLOOKUP('INSTITUTIONAL VENDOR'!$E$12,List_of_Region_Countries,1,0))),\"Not a region country, field removed\",\n\nIF(AND(ISERROR(VLOOKUP($F28,List_of_Dropdown_list_Values,1,0)),NOT(ISERROR(VLOOKUP($G28,List_of_Dropdown_list_Values,1,0)))),\"Original Value was not from dropdown list, has been corrected\",\n\nIF(AND($E28=\"Account type\",OR('INSTITUTIONAL VENDOR'!$C$35=\"370 Russian Fed.\",'INSTITUTIONAL VENDOR'!$C$35=\"681 Angola\",'INSTITUTIONAL VENDOR'!$C$35=\"689 Mozambique\")),\"Digits must be moved to account number as per country specifics\",\n\nIF(AND($E28=\"Vendor's Bank Account Number\",OR('INSTITUTIONAL VENDOR'!$C$35=\"370 Russian Fed.\",'INSTITUTIONAL VENDOR'!$C$35=\"681 Angola\",'INSTITUTIONAL VENDOR'!$C$35=\"689 Mozambique\"),LEN(Log_file!$F28)>LEN(Log_file!$G28)),\"Digits moved to account key as per country specifics\",\n\nIF(AND(LEN(SUBSTITUTE(TRIM($F28),\" \",\"\"))=LEN(SUBSTITUTE(TRIM($G28),\" \",\"\")),LEN($F28)>LEN($G28)),\"Spaces removed\",\n\nIF(LEN($F28)>VLOOKUP($E28,SAP_fields_MAX_length,2,0),\"Original value length was over SAP limit\",\n\n\"Number Format/Special characters substituted or Unknown Reason\")))))))),\n\n\"\")","v":""},""]
[{"$f":"IF(C29<>D29,MAX(A$1:$A28)+1,0)","v":0},"Bank Account Currency ",{"$f":"IF(ISBLANK(INSTITUTIONAL!C31),\"\",\n\nIF(INSTITUTIONAL!C31=\"… Select\",\"… Select\",\n\nINSTITUTIONAL!C31))","v":"UAH Ukrainian Hryvnia"},{"$f":"IF(ISBLANK('INSTITUTIONAL VENDOR'!C31),\"\",'INSTITUTIONAL VENDOR'!C31)","v":"UAH Ukrainian Hryvnia"},{"$f":"IFERROR(VLOOKUP(ROWS($F$1:F28),A:D,2,0),\"\")","v":""},{"$f":"IFERROR(VLOOKUP(ROWS($F$1:F28),A:D,3,0),\"\")","v":""},{"$f":"IFERROR(VLOOKUP(ROWS($F$1:F28),A:D,4,0),\"\")","v":""},{"$f":"IF($F29<>$G29,\n\nIF(NOT(ISERROR(SEARCH(\"!\",G29))),\"Error message, original field contained incorrect value\",\n\nIF(AND($E29=\"Company Name\",LEN($F29)>40),\"Name is too long\",\n\nIF(AND($E29=\"Region\",ISERROR(VLOOKUP('INSTITUTIONAL VENDOR'!$E$12,List_of_Region_Countries,1,0))),\"Not a region country, field removed\",\n\nIF(AND(ISERROR(VLOOKUP($F29,List_of_Dropdown_list_Values,1,0)),NOT(ISERROR(VLOOKUP($G29,List_of_Dropdown_list_Values,1,0)))),\"Original Value was not from dropdown list, has been corrected\",\n\nIF(AND($E29=\"Account type\",OR('INSTITUTIONAL VENDOR'!$C$35=\"370 Russian Fed.\",'INSTITUTIONAL VENDOR'!$C$35=\"681 Angola\",'INSTITUTIONAL VENDOR'!$C$35=\"689 Mozambique\")),\"Digits must be moved to account number as per country specifics\",\n\nIF(AND($E29=\"Vendor's Bank Account Number\",OR('INSTITUTIONAL VENDOR'!$C$35=\"370 Russian Fed.\",'INSTITUTIONAL VENDOR'!$C$35=\"681 Angola\",'INSTITUTIONAL VENDOR'!$C$35=\"689 Mozambique\"),LEN(Log_file!$F29)>LEN(Log_file!$G29)),\"Digits moved to account key as per country specifics\",\n\nIF(AND(LEN(SUBSTITUTE(TRIM($F29),\" \",\"\"))=LEN(SUBSTITUTE(TRIM($G29),\" \",\"\")),LEN($F29)>LEN($G29)),\"Spaces removed\",\n\nIF(LEN($F29)>VLOOKUP($E29,SAP_fields_MAX_length,2,0),\"Original value length was over SAP limit\",\n\n\"Number Format/Special characters substituted or Unknown Reason\")))))))),\n\n\"\")","v":""},""]
[{"$f":"IF(C30<>D30,MAX(A$1:$A29)+1,0)","v":0},"Name of Bank",{"$f":"IF(ISBLANK(INSTITUTIONAL!C33),\"\",INSTITUTIONAL!C33)","v":"JOINT-STOCK COMPANYCOMMERCIAL BANK \"PRIVATBANK\""},{"$f":"IF(ISBLANK('INSTITUTIONAL VENDOR'!C33),\"\",'INSTITUTIONAL VENDOR'!C33)","v":"JOINT-STOCK COMPANYCOMMERCIAL BANK \"PRIVATBANK\""},{"$f":"IFERROR(VLOOKUP(ROWS($F$1:F29),A:D,2,0),\"\")","v":""},{"$f":"IFERROR(VLOOKUP(ROWS($F$1:F29),A:D,3,0),\"\")","v":""},{"$f":"IFERROR(VLOOKUP(ROWS($F$1:F29),A:D,4,0),\"\")","v":""},{"$f":"IF($F30<>$G30,\n\nIF(NOT(ISERROR(SEARCH(\"!\",G30))),\"Error message, original field contained incorrect value\",\n\nIF(AND($E30=\"Company Name\",LEN($F30)>40),\"Name is too long\",\n\nIF(AND($E30=\"Region\",ISERROR(VLOOKUP('INSTITUTIONAL VENDOR'!$E$12,List_of_Region_Countries,1,0))),\"Not a region country, field removed\",\n\nIF(AND(ISERROR(VLOOKUP($F30,List_of_Dropdown_list_Values,1,0)),NOT(ISERROR(VLOOKUP($G30,List_of_Dropdown_list_Values,1,0)))),\"Original Value was not from dropdown list, has been corrected\",\n\nIF(AND($E30=\"Account type\",OR('INSTITUTIONAL VENDOR'!$C$35=\"370 Russian Fed.\",'INSTITUTIONAL VENDOR'!$C$35=\"681 Angola\",'INSTITUTIONAL VENDOR'!$C$35=\"689 Mozambique\")),\"Digits must be moved to account number as per country specifics\",\n\nIF(AND($E30=\"Vendor's Bank Account Number\",OR('INSTITUTIONAL VENDOR'!$C$35=\"370 Russian Fed.\",'INSTITUTIONAL VENDOR'!$C$35=\"681 Angola\",'INSTITUTIONAL VENDOR'!$C$35=\"689 Mozambique\"),LEN(Log_file!$F30)>LEN(Log_file!$G30)),\"Digits moved to account key as per country specifics\",\n\nIF(AND(LEN(SUBSTITUTE(TRIM($F30),\" \",\"\"))=LEN(SUBSTITUTE(TRIM($G30),\" \",\"\")),LEN($F30)>LEN($G30)),\"Spaces removed\",\n\nIF(LEN($F30)>VLOOKUP($E30,SAP_fields_MAX_length,2,0),\"Original value length was over SAP limit\",\n\n\"Number Format/Special characters substituted or Unknown Reason\")))))))),\n\n\"\")","v":""},""]
[{"$f":"IF(C31<>D31,MAX(A$1:$A30)+1,0)","v":0},"Bank key",{"$f":"IF(ISBLANK(INSTITUTIONAL!C34),\"\",INSTITUTIONAL!C34)","v":"305299"},{"$f":"IF(ISBLANK('INSTITUTIONAL VENDOR'!C34),\"\",'INSTITUTIONAL VENDOR'!C34)","v":"305299"},{"$f":"IFERROR(VLOOKUP(ROWS($F$1:F30),A:D,2,0),\"\")","v":""},{"$f":"IFERROR(VLOOKUP(ROWS($F$1:F30),A:D,3,0),\"\")","v":""},{"$f":"IFERROR(VLOOKUP(ROWS($F$1:F30),A:D,4,0),\"\")","v":""},{"$f":"IF($F31<>$G31,\n\nIF(NOT(ISERROR(SEARCH(\"!\",G31))),\"Error message, original field contained incorrect value\",\n\nIF(AND($E31=\"Company Name\",LEN($F31)>40),\"Name is too long\",\n\nIF(AND($E31=\"Region\",ISERROR(VLOOKUP('INSTITUTIONAL VENDOR'!$E$12,List_of_Region_Countries,1,0))),\"Not a region country, field removed\",\n\nIF(AND(ISERROR(VLOOKUP($F31,List_of_Dropdown_list_Values,1,0)),NOT(ISERROR(VLOOKUP($G31,List_of_Dropdown_list_Values,1,0)))),\"Original Value was not from dropdown list, has been corrected\",\n\nIF(AND($E31=\"Account type\",OR('INSTITUTIONAL VENDOR'!$C$35=\"370 Russian Fed.\",'INSTITUTIONAL VENDOR'!$C$35=\"681 Angola\",'INSTITUTIONAL VENDOR'!$C$35=\"689 Mozambique\")),\"Digits must be moved to account number as per country specifics\",\n\nIF(AND($E31=\"Vendor's Bank Account Number\",OR('INSTITUTIONAL VENDOR'!$C$35=\"370 Russian Fed.\",'INSTITUTIONAL VENDOR'!$C$35=\"681 Angola\",'INSTITUTIONAL VENDOR'!$C$35=\"689 Mozambique\"),LEN(Log_file!$F31)>LEN(Log_file!$G31)),\"Digits moved to account key as per country specifics\",\n\nIF(AND(LEN(SUBSTITUTE(TRIM($F31),\" \",\"\"))=LEN(SUBSTITUTE(TRIM($G31),\" \",\"\")),LEN($F31)>LEN($G31)),\"Spaces removed\",\n\nIF(LEN($F31)>VLOOKUP($E31,SAP_fields_MAX_length,2,0),\"Original value length was over SAP limit\",\n\n\"Number Format/Special characters substituted or Unknown Reason\")))))))),\n\n\"\")","v":""},""]
[{"$f":"IF(C32<>D32,MAX(A$1:$A31)+1,0)","v":0},"Bank Country",{"$f":"IF(ISBLANK(INSTITUTIONAL!C35),\"\",INSTITUTIONAL!C35)","v":"441 Ukraine"},{"$f":"IF(ISBLANK('INSTITUTIONAL VENDOR'!C35),\"\",'INSTITUTIONAL VENDOR'!C35)","v":"441 Ukraine"},{"$f":"IFERROR(VLOOKUP(ROWS($F$1:F31),A:D,2,0),\"\")","v":""},{"$f":"IFERROR(VLOOKUP(ROWS($F$1:F31),A:D,3,0),\"\")","v":""},{"$f":"IFERROR(VLOOKUP(ROWS($F$1:F31),A:D,4,0),\"\")","v":""},{"$f":"IF($F32<>$G32,\n\nIF(NOT(ISERROR(SEARCH(\"!\",G32))),\"Error message, original field contained incorrect value\",\n\nIF(AND($E32=\"Company Name\",LEN($F32)>40),\"Name is too long\",\n\nIF(AND($E32=\"Region\",ISERROR(VLOOKUP('INSTITUTIONAL VENDOR'!$E$12,List_of_Region_Countries,1,0))),\"Not a region country, field removed\",\n\nIF(AND(ISERROR(VLOOKUP($F32,List_of_Dropdown_list_Values,1,0)),NOT(ISERROR(VLOOKUP($G32,List_of_Dropdown_list_Values,1,0)))),\"Original Value was not from dropdown list, has been corrected\",\n\nIF(AND($E32=\"Account type\",OR('INSTITUTIONAL VENDOR'!$C$35=\"370 Russian Fed.\",'INSTITUTIONAL VENDOR'!$C$35=\"681 Angola\",'INSTITUTIONAL VENDOR'!$C$35=\"689 Mozambique\")),\"Digits must be moved to account number as per country specifics\",\n\nIF(AND($E32=\"Vendor's Bank Account Number\",OR('INSTITUTIONAL VENDOR'!$C$35=\"370 Russian Fed.\",'INSTITUTIONAL VENDOR'!$C$35=\"681 Angola\",'INSTITUTIONAL VENDOR'!$C$35=\"689 Mozambique\"),LEN(Log_file!$F32)>LEN(Log_file!$G32)),\"Digits moved to account key as per country specifics\",\n\nIF(AND(LEN(SUBSTITUTE(TRIM($F32),\" \",\"\"))=LEN(SUBSTITUTE(TRIM($G32),\" \",\"\")),LEN($F32)>LEN($G32)),\"Spaces removed\",\n\nIF(LEN($F32)>VLOOKUP($E32,SAP_fields_MAX_length,2,0),\"Original value length was over SAP limit\",\n\n\"Number Format/Special characters substituted or Unknown Reason\")))))))),\n\n\"\")","v":""},""]
[{"$f":"IF(C33<>D33,MAX(A$1:$A32)+1,0)","v":0},"Additional Instructions or Remarks ",{"$f":"IF(ISBLANK(INSTITUTIONAL!C36),\"\",INSTITUTIONAL!C36)","v":"Add Additional Account"},{"$f":"IF(ISBLANK('INSTITUTIONAL VENDOR'!C36),\"\",'INSTITUTIONAL VENDOR'!C36)","v":"Add Additional Account"},{"$f":"IFERROR(VLOOKUP(ROWS($F$1:F32),A:D,2,0),\"\")","v":""},{"$f":"IFERROR(VLOOKUP(ROWS($F$1:F32),A:D,3,0),\"\")","v":""},{"$f":"IFERROR(VLOOKUP(ROWS($F$1:F32),A:D,4,0),\"\")","v":""},{"$f":"IF($F33<>$G33,\n\nIF(NOT(ISERROR(SEARCH(\"!\",G33))),\"Error message, original field contained incorrect value\",\n\nIF(AND($E33=\"Company Name\",LEN($F33)>40),\"Name is too long\",\n\nIF(AND($E33=\"Region\",ISERROR(VLOOKUP('INSTITUTIONAL VENDOR'!$E$12,List_of_Region_Countries,1,0))),\"Not a region country, field removed\",\n\nIF(AND(ISERROR(VLOOKUP($F33,List_of_Dropdown_list_Values,1,0)),NOT(ISERROR(VLOOKUP($G33,List_of_Dropdown_list_Values,1,0)))),\"Original Value was not from dropdown list, has been corrected\",\n\nIF(AND($E33=\"Account type\",OR('INSTITUTIONAL VENDOR'!$C$35=\"370 Russian Fed.\",'INSTITUTIONAL VENDOR'!$C$35=\"681 Angola\",'INSTITUTIONAL VENDOR'!$C$35=\"689 Mozambique\")),\"Digits must be moved to account number as per country specifics\",\n\nIF(AND($E33=\"Vendor's Bank Account Number\",OR('INSTITUTIONAL VENDOR'!$C$35=\"370 Russian Fed.\",'INSTITUTIONAL VENDOR'!$C$35=\"681 Angola\",'INSTITUTIONAL VENDOR'!$C$35=\"689 Mozambique\"),LEN(Log_file!$F33)>LEN(Log_file!$G33)),\"Digits moved to account key as per country specifics\",\n\nIF(AND(LEN(SUBSTITUTE(TRIM($F33),\" \",\"\"))=LEN(SUBSTITUTE(TRIM($G33),\" \",\"\")),LEN($F33)>LEN($G33)),\"Spaces removed\",\n\nIF(LEN($F33)>VLOOKUP($E33,SAP_fields_MAX_length,2,0),\"Original value length was over SAP limit\",\n\n\"Number Format/Special characters substituted or Unknown Reason\")))))))),\n\n\"\")","v":""},""]
[{"$f":"IF(C34<>D34,MAX(A$1:$A33)+1,0)","v":0},"Partner Type",{"$f":"IF(ISBLANK(INSTITUTIONAL!C38),\"\",INSTITUTIONAL!C38)","v":"… Select"},{"$f":"IF(ISBLANK('INSTITUTIONAL VENDOR'!C38),\"\",'INSTITUTIONAL VENDOR'!C38)","v":"… Select"},{"$f":"IFERROR(VLOOKUP(ROWS($F$1:F33),A:D,2,0),\"\")","v":""},{"$f":"IFERROR(VLOOKUP(ROWS($F$1:F33),A:D,3,0),\"\")","v":""},{"$f":"IFERROR(VLOOKUP(ROWS($F$1:F33),A:D,4,0),\"\")","v":""},{"$f":"IF($F34<>$G34,\n\nIF(NOT(ISERROR(SEARCH(\"!\",G34))),\"Error message, original field contained incorrect value\",\n\nIF(AND($E34=\"Company Name\",LEN($F34)>40),\"Name is too long\",\n\nIF(AND($E34=\"Region\",ISERROR(VLOOKUP('INSTITUTIONAL VENDOR'!$E$12,List_of_Region_Countries,1,0))),\"Not a region country, field removed\",\n\nIF(AND(ISERROR(VLOOKUP($F34,List_of_Dropdown_list_Values,1,0)),NOT(ISERROR(VLOOKUP($G34,List_of_Dropdown_list_Values,1,0)))),\"Original Value was not from dropdown list, has been corrected\",\n\nIF(AND($E34=\"Account type\",OR('INSTITUTIONAL VENDOR'!$C$35=\"370 Russian Fed.\",'INSTITUTIONAL VENDOR'!$C$35=\"681 Angola\",'INSTITUTIONAL VENDOR'!$C$35=\"689 Mozambique\")),\"Digits must be moved to account number as per country specifics\",\n\nIF(AND($E34=\"Vendor's Bank Account Number\",OR('INSTITUTIONAL VENDOR'!$C$35=\"370 Russian Fed.\",'INSTITUTIONAL VENDOR'!$C$35=\"681 Angola\",'INSTITUTIONAL VENDOR'!$C$35=\"689 Mozambique\"),LEN(Log_file!$F34)>LEN(Log_file!$G34)),\"Digits moved to account key as per country specifics\",\n\nIF(AND(LEN(SUBSTITUTE(TRIM($F34),\" \",\"\"))=LEN(SUBSTITUTE(TRIM($G34),\" \",\"\")),LEN($F34)>LEN($G34)),\"Spaces removed\",\n\nIF(LEN($F34)>VLOOKUP($E34,SAP_fields_MAX_length,2,0),\"Original value length was over SAP limit\",\n\n\"Number Format/Special characters substituted or Unknown Reason\")))))))),\n\n\"\")","v":""},""]
[{"$f":"IF(C35<>D35,MAX(A$1:$A34)+1,0)","v":0},"Civil Society Organization Type (if it is CSO)",{"$f":"IF(ISBLANK(INSTITUTIONAL!C39),\"\",INSTITUTIONAL!C39)","v":"… Select"},{"$f":"IF(ISBLANK('INSTITUTIONAL VENDOR'!C39),\"\",'INSTITUTIONAL VENDOR'!C39)","v":"… Select"},{"$f":"IFERROR(VLOOKUP(ROWS($F$1:F34),A:D,2,0),\"\")","v":""},{"$f":"IFERROR(VLOOKUP(ROWS($F$1:F34),A:D,3,0),\"\")","v":""},{"$f":"IFERROR(VLOOKUP(ROWS($F$1:F34),A:D,4,0),\"\")","v":""},{"$f":"IF($F35<>$G35,\n\nIF(NOT(ISERROR(SEARCH(\"!\",G35))),\"Error message, original field contained incorrect value\",\n\nIF(AND($E35=\"Company Name\",LEN($F35)>40),\"Name is too long\",\n\nIF(AND($E35=\"Region\",ISERROR(VLOOKUP('INSTITUTIONAL VENDOR'!$E$12,List_of_Region_Countries,1,0))),\"Not a region country, field removed\",\n\nIF(AND(ISERROR(VLOOKUP($F35,List_of_Dropdown_list_Values,1,0)),NOT(ISERROR(VLOOKUP($G35,List_of_Dropdown_list_Values,1,0)))),\"Original Value was not from dropdown list, has been corrected\",\n\nIF(AND($E35=\"Account type\",OR('INSTITUTIONAL VENDOR'!$C$35=\"370 Russian Fed.\",'INSTITUTIONAL VENDOR'!$C$35=\"681 Angola\",'INSTITUTIONAL VENDOR'!$C$35=\"689 Mozambique\")),\"Digits must be moved to account number as per country specifics\",\n\nIF(AND($E35=\"Vendor's Bank Account Number\",OR('INSTITUTIONAL VENDOR'!$C$35=\"370 Russian Fed.\",'INSTITUTIONAL VENDOR'!$C$35=\"681 Angola\",'INSTITUTIONAL VENDOR'!$C$35=\"689 Mozambique\"),LEN(Log_file!$F35)>LEN(Log_file!$G35)),\"Digits moved to account key as per country specifics\",\n\nIF(AND(LEN(SUBSTITUTE(TRIM($F35),\" \",\"\"))=LEN(SUBSTITUTE(TRIM($G35),\" \",\"\")),LEN($F35)>LEN($G35)),\"Spaces removed\",\n\nIF(LEN($F35)>VLOOKUP($E35,SAP_fields_MAX_length,2,0),\"Original value length was over SAP limit\",\n\n\"Number Format/Special characters substituted or Unknown Reason\")))))))),\n\n\"\")","v":""},""]
[{"$f":"IF(C36<>D36,MAX(A$1:$A35)+1,0)","v":0},"Name of Parent Organisation",{"$f":"IF(ISBLANK(INSTITUTIONAL!C43),\"\",INSTITUTIONAL!C43)","v":""},{"$f":"IF(ISBLANK('INSTITUTIONAL VENDOR'!C43),\"\",'INSTITUTIONAL VENDOR'!C43)","v":""},{"$f":"IFERROR(VLOOKUP(ROWS($F$1:F35),A:D,2,0),\"\")","v":""},{"$f":"IFERROR(VLOOKUP(ROWS($F$1:F35),A:D,3,0),\"\")","v":""},{"$f":"IFERROR(VLOOKUP(ROWS($F$1:F35),A:D,4,0),\"\")","v":""},{"$f":"IF($F36<>$G36,\n\nIF(NOT(ISERROR(SEARCH(\"!\",G36))),\"Error message, original field contained incorrect value\",\n\nIF(AND($E36=\"Company Name\",LEN($F36)>40),\"Name is too long\",\n\nIF(AND($E36=\"Region\",ISERROR(VLOOKUP('INSTITUTIONAL VENDOR'!$E$12,List_of_Region_Countries,1,0))),\"Not a region country, field removed\",\n\nIF(AND(ISERROR(VLOOKUP($F36,List_of_Dropdown_list_Values,1,0)),NOT(ISERROR(VLOOKUP($G36,List_of_Dropdown_list_Values,1,0)))),\"Original Value was not from dropdown list, has been corrected\",\n\nIF(AND($E36=\"Account type\",OR('INSTITUTIONAL VENDOR'!$C$35=\"370 Russian Fed.\",'INSTITUTIONAL VENDOR'!$C$35=\"681 Angola\",'INSTITUTIONAL VENDOR'!$C$35=\"689 Mozambique\")),\"Digits must be moved to account number as per country specifics\",\n\nIF(AND($E36=\"Vendor's Bank Account Number\",OR('INSTITUTIONAL VENDOR'!$C$35=\"370 Russian Fed.\",'INSTITUTIONAL VENDOR'!$C$35=\"681 Angola\",'INSTITUTIONAL VENDOR'!$C$35=\"689 Mozambique\"),LEN(Log_file!$F36)>LEN(Log_file!$G36)),\"Digits moved to account key as per country specifics\",\n\nIF(AND(LEN(SUBSTITUTE(TRIM($F36),\" \",\"\"))=LEN(SUBSTITUTE(TRIM($G36),\" \",\"\")),LEN($F36)>LEN($G36)),\"Spaces removed\",\n\nIF(LEN($F36)>VLOOKUP($E36,SAP_fields_MAX_length,2,0),\"Original value length was over SAP limit\",\n\n\"Number Format/Special characters substituted or Unknown Reason\")))))))),\n\n\"\")","v":""},""]
[{"$f":"IF(C37<>D37,MAX(A$1:$A36)+1,0)","v":0},"Date of (PSEA) Assessment",{"$f":"IF(ISBLANK(INSTITUTIONAL!C44),\"\",INSTITUTIONAL!C44)","v":""},{"$f":"IF(ISBLANK('INSTITUTIONAL VENDOR'!C44),\"\",'INSTITUTIONAL VENDOR'!C44)","v":""},{"$f":"IFERROR(VLOOKUP(ROWS($F$1:F36),A:D,2,0),\"\")","v":""},{"$f":"IFERROR(VLOOKUP(ROWS($F$1:F36),A:D,3,0),\"\")","v":""},{"$f":"IFERROR(VLOOKUP(ROWS($F$1:F36),A:D,4,0),\"\")","v":""},{"$f":"IF($F37<>$G37,\n\nIF(NOT(ISERROR(SEARCH(\"!\",G37))),\"Error message, original field contained incorrect value\",\n\nIF(AND($E37=\"Company Name\",LEN($F37)>40),\"Name is too long\",\n\nIF(AND($E37=\"Region\",ISERROR(VLOOKUP('INSTITUTIONAL VENDOR'!$E$12,List_of_Region_Countries,1,0))),\"Not a region country, field removed\",\n\nIF(AND(ISERROR(VLOOKUP($F37,List_of_Dropdown_list_Values,1,0)),NOT(ISERROR(VLOOKUP($G37,List_of_Dropdown_list_Values,1,0)))),\"Original Value was not from dropdown list, has been corrected\",\n\nIF(AND($E37=\"Account type\",OR('INSTITUTIONAL VENDOR'!$C$35=\"370 Russian Fed.\",'INSTITUTIONAL VENDOR'!$C$35=\"681 Angola\",'INSTITUTIONAL VENDOR'!$C$35=\"689 Mozambique\")),\"Digits must be moved to account number as per country specifics\",\n\nIF(AND($E37=\"Vendor's Bank Account Number\",OR('INSTITUTIONAL VENDOR'!$C$35=\"370 Russian Fed.\",'INSTITUTIONAL VENDOR'!$C$35=\"681 Angola\",'INSTITUTIONAL VENDOR'!$C$35=\"689 Mozambique\"),LEN(Log_file!$F37)>LEN(Log_file!$G37)),\"Digits moved to account key as per country specifics\",\n\nIF(AND(LEN(SUBSTITUTE(TRIM($F37),\" \",\"\"))=LEN(SUBSTITUTE(TRIM($G37),\" \",\"\")),LEN($F37)>LEN($G37)),\"Spaces removed\",\n\nIF(LEN($F37)>VLOOKUP($E37,SAP_fields_MAX_length,2,0),\"Original value length was over SAP limit\",\n\n\"Number Format/Special characters substituted or Unknown Reason\")))))))),\n\n\"\")","v":""},""]
[{"$f":"IF(C38<>D38,MAX(A$1:$A37)+1,0)","v":0},"Risk Rating of (PSEA) Assessment",{"$f":"IF(ISBLANK(INSTITUTIONAL!C45),\"\",INSTITUTIONAL!C45)","v":"… Select"},{"$f":"IF(ISBLANK('INSTITUTIONAL VENDOR'!C45),\"\",'INSTITUTIONAL VENDOR'!C45)","v":"… Select"},{"$f":"IFERROR(VLOOKUP(ROWS($F$1:F37),A:D,2,0),\"\")","v":""},{"$f":"IFERROR(VLOOKUP(ROWS($F$1:F37),A:D,3,0),\"\")","v":""},{"$f":"IFERROR(VLOOKUP(ROWS($F$1:F37),A:D,4,0),\"\")","v":""},{"$f":"IF($F38<>$G38,\n\nIF(NOT(ISERROR(SEARCH(\"!\",G38))),\"Error message, original field contained incorrect value\",\n\nIF(AND($E38=\"Company Name\",LEN($F38)>40),\"Name is too long\",\n\nIF(AND($E38=\"Region\",ISERROR(VLOOKUP('INSTITUTIONAL VENDOR'!$E$12,List_of_Region_Countries,1,0))),\"Not a region country, field removed\",\n\nIF(AND(ISERROR(VLOOKUP($F38,List_of_Dropdown_list_Values,1,0)),NOT(ISERROR(VLOOKUP($G38,List_of_Dropdown_list_Values,1,0)))),\"Original Value was not from dropdown list, has been corrected\",\n\nIF(AND($E38=\"Account type\",OR('INSTITUTIONAL VENDOR'!$C$35=\"370 Russian Fed.\",'INSTITUTIONAL VENDOR'!$C$35=\"681 Angola\",'INSTITUTIONAL VENDOR'!$C$35=\"689 Mozambique\")),\"Digits must be moved to account number as per country specifics\",\n\nIF(AND($E38=\"Vendor's Bank Account Number\",OR('INSTITUTIONAL VENDOR'!$C$35=\"370 Russian Fed.\",'INSTITUTIONAL VENDOR'!$C$35=\"681 Angola\",'INSTITUTIONAL VENDOR'!$C$35=\"689 Mozambique\"),LEN(Log_file!$F38)>LEN(Log_file!$G38)),\"Digits moved to account key as per country specifics\",\n\nIF(AND(LEN(SUBSTITUTE(TRIM($F38),\" \",\"\"))=LEN(SUBSTITUTE(TRIM($G38),\" \",\"\")),LEN($F38)>LEN($G38)),\"Spaces removed\",\n\nIF(LEN($F38)>VLOOKUP($E38,SAP_fields_MAX_length,2,0),\"Original value length was over SAP limit\",\n\n\"Number Format/Special characters substituted or Unknown Reason\")))))))),\n\n\"\")","v":""},""]
[{"$f":"IF(C39<>D39,MAX(A$1:$A38)+1,0)","v":0},"Date of Assessment",{"$f":"IF(ISBLANK(INSTITUTIONAL!E38),\"\",INSTITUTIONAL!E38)","v":""},{"$f":"IF(ISBLANK('INSTITUTIONAL VENDOR'!E38),\"\",'INSTITUTIONAL VENDOR'!E38)","v":""},{"$f":"IFERROR(VLOOKUP(ROWS($F$1:F38),A:D,2,0),\"\")","v":""},{"$f":"IFERROR(VLOOKUP(ROWS($F$1:F38),A:D,3,0),\"\")","v":""},{"$f":"IFERROR(VLOOKUP(ROWS($F$1:F38),A:D,4,0),\"\")","v":""},{"$f":"IF($F39<>$G39,\n\nIF(NOT(ISERROR(SEARCH(\"!\",G39))),\"Error message, original field contained incorrect value\",\n\nIF(AND($E39=\"Company Name\",LEN($F39)>40),\"Name is too long\",\n\nIF(AND($E39=\"Region\",ISERROR(VLOOKUP('INSTITUTIONAL VENDOR'!$E$12,List_of_Region_Countries,1,0))),\"Not a region country, field removed\",\n\nIF(AND(ISERROR(VLOOKUP($F39,List_of_Dropdown_list_Values,1,0)),NOT(ISERROR(VLOOKUP($G39,List_of_Dropdown_list_Values,1,0)))),\"Original Value was not from dropdown list, has been corrected\",\n\nIF(AND($E39=\"Account type\",OR('INSTITUTIONAL VENDOR'!$C$35=\"370 Russian Fed.\",'INSTITUTIONAL VENDOR'!$C$35=\"681 Angola\",'INSTITUTIONAL VENDOR'!$C$35=\"689 Mozambique\")),\"Digits must be moved to account number as per country specifics\",\n\nIF(AND($E39=\"Vendor's Bank Account Number\",OR('INSTITUTIONAL VENDOR'!$C$35=\"370 Russian Fed.\",'INSTITUTIONAL VENDOR'!$C$35=\"681 Angola\",'INSTITUTIONAL VENDOR'!$C$35=\"689 Mozambique\"),LEN(Log_file!$F39)>LEN(Log_file!$G39)),\"Digits moved to account key as per country specifics\",\n\nIF(AND(LEN(SUBSTITUTE(TRIM($F39),\" \",\"\"))=LEN(SUBSTITUTE(TRIM($G39),\" \",\"\")),LEN($F39)>LEN($G39)),\"Spaces removed\",\n\nIF(LEN($F39)>VLOOKUP($E39,SAP_fields_MAX_length,2,0),\"Original value length was over SAP limit\",\n\n\"Number Format/Special characters substituted or Unknown Reason\")))))))),\n\n\"\")","v":""},""]
[{"$f":"IF(C40<>D40,MAX(A$1:$A39)+1,0)","v":0},"Date of Positive Assessment",{"$f":"IF(ISBLANK(INSTITUTIONAL!E39),\"\",INSTITUTIONAL!E39)","v":""},{"$f":"IF(ISBLANK('INSTITUTIONAL VENDOR'!E39),\"\",'INSTITUTIONAL VENDOR'!E39)","v":""},{"$f":"IFERROR(VLOOKUP(ROWS($F$1:F39),A:D,2,0),\"\")","v":""},{"$f":"IFERROR(VLOOKUP(ROWS($F$1:F39),A:D,3,0),\"\")","v":""},{"$f":"IFERROR(VLOOKUP(ROWS($F$1:F39),A:D,4,0),\"\")","v":""},{"$f":"IF($F40<>$G40,\n\nIF(NOT(ISERROR(SEARCH(\"!\",G40))),\"Error message, original field contained incorrect value\",\n\nIF(AND($E40=\"Company Name\",LEN($F40)>40),\"Name is too long\",\n\nIF(AND($E40=\"Region\",ISERROR(VLOOKUP('INSTITUTIONAL VENDOR'!$E$12,List_of_Region_Countries,1,0))),\"Not a region country, field removed\",\n\nIF(AND(ISERROR(VLOOKUP($F40,List_of_Dropdown_list_Values,1,0)),NOT(ISERROR(VLOOKUP($G40,List_of_Dropdown_list_Values,1,0)))),\"Original Value was not from dropdown list, has been corrected\",\n\nIF(AND($E40=\"Account type\",OR('INSTITUTIONAL VENDOR'!$C$35=\"370 Russian Fed.\",'INSTITUTIONAL VENDOR'!$C$35=\"681 Angola\",'INSTITUTIONAL VENDOR'!$C$35=\"689 Mozambique\")),\"Digits must be moved to account number as per country specifics\",\n\nIF(AND($E40=\"Vendor's Bank Account Number\",OR('INSTITUTIONAL VENDOR'!$C$35=\"370 Russian Fed.\",'INSTITUTIONAL VENDOR'!$C$35=\"681 Angola\",'INSTITUTIONAL VENDOR'!$C$35=\"689 Mozambique\"),LEN(Log_file!$F40)>LEN(Log_file!$G40)),\"Digits moved to account key as per country specifics\",\n\nIF(AND(LEN(SUBSTITUTE(TRIM($F40),\" \",\"\"))=LEN(SUBSTITUTE(TRIM($G40),\" \",\"\")),LEN($F40)>LEN($G40)),\"Spaces removed\",\n\nIF(LEN($F40)>VLOOKUP($E40,SAP_fields_MAX_length,2,0),\"Original value length was over SAP limit\",\n\n\"Number Format/Special characters substituted or Unknown Reason\")))))))),\n\n\"\")","v":""},""]
[{"$f":"IF(C41<>D41,MAX(A$1:$A40)+1,0)","v":0},"Type of Assessment",{"$f":"IF(ISBLANK(INSTITUTIONAL!E40),\"\",INSTITUTIONAL!E40)","v":"… Select"},{"$f":"IF(ISBLANK('INSTITUTIONAL VENDOR'!E40),\"\",'INSTITUTIONAL VENDOR'!E40)","v":"… Select"},{"$f":"IFERROR(VLOOKUP(ROWS($F$1:F40),A:D,2,0),\"\")","v":""},{"$f":"IFERROR(VLOOKUP(ROWS($F$1:F40),A:D,3,0),\"\")","v":""},{"$f":"IFERROR(VLOOKUP(ROWS($F$1:F40),A:D,4,0),\"\")","v":""},{"$f":"IF($F41<>$G41,\n\nIF(NOT(ISERROR(SEARCH(\"!\",G41))),\"Error message, original field contained incorrect value\",\n\nIF(AND($E41=\"Company Name\",LEN($F41)>40),\"Name is too long\",\n\nIF(AND($E41=\"Region\",ISERROR(VLOOKUP('INSTITUTIONAL VENDOR'!$E$12,List_of_Region_Countries,1,0))),\"Not a region country, field removed\",\n\nIF(AND(ISERROR(VLOOKUP($F41,List_of_Dropdown_list_Values,1,0)),NOT(ISERROR(VLOOKUP($G41,List_of_Dropdown_list_Values,1,0)))),\"Original Value was not from dropdown list, has been corrected\",\n\nIF(AND($E41=\"Account type\",OR('INSTITUTIONAL VENDOR'!$C$35=\"370 Russian Fed.\",'INSTITUTIONAL VENDOR'!$C$35=\"681 Angola\",'INSTITUTIONAL VENDOR'!$C$35=\"689 Mozambique\")),\"Digits must be moved to account number as per country specifics\",\n\nIF(AND($E41=\"Vendor's Bank Account Number\",OR('INSTITUTIONAL VENDOR'!$C$35=\"370 Russian Fed.\",'INSTITUTIONAL VENDOR'!$C$35=\"681 Angola\",'INSTITUTIONAL VENDOR'!$C$35=\"689 Mozambique\"),LEN(Log_file!$F41)>LEN(Log_file!$G41)),\"Digits moved to account key as per country specifics\",\n\nIF(AND(LEN(SUBSTITUTE(TRIM($F41),\" \",\"\"))=LEN(SUBSTITUTE(TRIM($G41),\" \",\"\")),LEN($F41)>LEN($G41)),\"Spaces removed\",\n\nIF(LEN($F41)>VLOOKUP($E41,SAP_fields_MAX_length,2,0),\"Original value length was over SAP limit\",\n\n\"Number Format/Special characters substituted or Unknown Reason\")))))))),\n\n\"\")","v":""},""]
[{"$f":"IF(C42<>D42,MAX(A$1:$A41)+1,0)","v":0},"Risk Rating ",{"$f":"IF(ISBLANK(INSTITUTIONAL!E41),\"\",INSTITUTIONAL!E41)","v":"… Select"},{"$f":"IF(ISBLANK('INSTITUTIONAL VENDOR'!E41),\"\",'INSTITUTIONAL VENDOR'!E41)","v":"… Select"},{"$f":"IFERROR(VLOOKUP(ROWS($F$1:F41),A:D,2,0),\"\")","v":""},{"$f":"IFERROR(VLOOKUP(ROWS($F$1:F41),A:D,3,0),\"\")","v":""},{"$f":"IFERROR(VLOOKUP(ROWS($F$1:F41),A:D,4,0),\"\")","v":""},{"$f":"IF($F42<>$G42,\n\nIF(NOT(ISERROR(SEARCH(\"!\",G42))),\"Error message, original field contained incorrect value\",\n\nIF(AND($E42=\"Company Name\",LEN($F42)>40),\"Name is too long\",\n\nIF(AND($E42=\"Region\",ISERROR(VLOOKUP('INSTITUTIONAL VENDOR'!$E$12,List_of_Region_Countries,1,0))),\"Not a region country, field removed\",\n\nIF(AND(ISERROR(VLOOKUP($F42,List_of_Dropdown_list_Values,1,0)),NOT(ISERROR(VLOOKUP($G42,List_of_Dropdown_list_Values,1,0)))),\"Original Value was not from dropdown list, has been corrected\",\n\nIF(AND($E42=\"Account type\",OR('INSTITUTIONAL VENDOR'!$C$35=\"370 Russian Fed.\",'INSTITUTIONAL VENDOR'!$C$35=\"681 Angola\",'INSTITUTIONAL VENDOR'!$C$35=\"689 Mozambique\")),\"Digits must be moved to account number as per country specifics\",\n\nIF(AND($E42=\"Vendor's Bank Account Number\",OR('INSTITUTIONAL VENDOR'!$C$35=\"370 Russian Fed.\",'INSTITUTIONAL VENDOR'!$C$35=\"681 Angola\",'INSTITUTIONAL VENDOR'!$C$35=\"689 Mozambique\"),LEN(Log_file!$F42)>LEN(Log_file!$G42)),\"Digits moved to account key as per country specifics\",\n\nIF(AND(LEN(SUBSTITUTE(TRIM($F42),\" \",\"\"))=LEN(SUBSTITUTE(TRIM($G42),\" \",\"\")),LEN($F42)>LEN($G42)),\"Spaces removed\",\n\nIF(LEN($F42)>VLOOKUP($E42,SAP_fields_MAX_length,2,0),\"Original value length was over SAP limit\",\n\n\"Number Format/Special characters substituted or Unknown Reason\")))))))),\n\n\"\")","v":""},""]
[{"$f":"IF(C43<>D43,MAX(A$1:$A42)+1,0)","v":0},"Permitted Payee Vendor Number",{"$f":"IF(ISBLANK(INSTITUTIONAL!E42),\"\",INSTITUTIONAL!E42)","v":""},{"$f":"IF(ISBLANK('INSTITUTIONAL VENDOR'!E42),\"\",'INSTITUTIONAL VENDOR'!E42)","v":""},{"$f":"IFERROR(VLOOKUP(ROWS($F$1:F42),A:D,2,0),\"\")","v":""},{"$f":"IFERROR(VLOOKUP(ROWS($F$1:F42),A:D,3,0),\"\")","v":""},{"$f":"IFERROR(VLOOKUP(ROWS($F$1:F42),A:D,4,0),\"\")","v":""},{"$f":"IF($F43<>$G43,\n\nIF(NOT(ISERROR(SEARCH(\"!\",G43))),\"Error message, original field contained incorrect value\",\n\nIF(AND($E43=\"Company Name\",LEN($F43)>40),\"Name is too long\",\n\nIF(AND($E43=\"Region\",ISERROR(VLOOKUP('INSTITUTIONAL VENDOR'!$E$12,List_of_Region_Countries,1,0))),\"Not a region country, field removed\",\n\nIF(AND(ISERROR(VLOOKUP($F43,List_of_Dropdown_list_Values,1,0)),NOT(ISERROR(VLOOKUP($G43,List_of_Dropdown_list_Values,1,0)))),\"Original Value was not from dropdown list, has been corrected\",\n\nIF(AND($E43=\"Account type\",OR('INSTITUTIONAL VENDOR'!$C$35=\"370 Russian Fed.\",'INSTITUTIONAL VENDOR'!$C$35=\"681 Angola\",'INSTITUTIONAL VENDOR'!$C$35=\"689 Mozambique\")),\"Digits must be moved to account number as per country specifics\",\n\nIF(AND($E43=\"Vendor's Bank Account Number\",OR('INSTITUTIONAL VENDOR'!$C$35=\"370 Russian Fed.\",'INSTITUTIONAL VENDOR'!$C$35=\"681 Angola\",'INSTITUTIONAL VENDOR'!$C$35=\"689 Mozambique\"),LEN(Log_file!$F43)>LEN(Log_file!$G43)),\"Digits moved to account key as per country specifics\",\n\nIF(AND(LEN(SUBSTITUTE(TRIM($F43),\" \",\"\"))=LEN(SUBSTITUTE(TRIM($G43),\" \",\"\")),LEN($F43)>LEN($G43)),\"Spaces removed\",\n\nIF(LEN($F43)>VLOOKUP($E43,SAP_fields_MAX_length,2,0),\"Original value length was over SAP limit\",\n\n\"Number Format/Special characters substituted or Unknown Reason\")))))))),\n\n\"\")","v":""},""]
[{"$f":"IF(C44<>D44,MAX(A$1:$A43)+1,0)","v":0},"House Bank",{"$f":"IF(ISBLANK(INSTITUTIONAL!E43),\"\",INSTITUTIONAL!E43)","v":""},{"$f":"IF(ISBLANK('INSTITUTIONAL VENDOR'!E43),\"\",'INSTITUTIONAL VENDOR'!E43)","v":""},{"$f":"IFERROR(VLOOKUP(ROWS($F$1:F43),A:D,2,0),\"\")","v":""},{"$f":"IFERROR(VLOOKUP(ROWS($F$1:F43),A:D,3,0),\"\")","v":""},{"$f":"IFERROR(VLOOKUP(ROWS($F$1:F43),A:D,4,0),\"\")","v":""},{"$f":"IF($F44<>$G44,\n\nIF(NOT(ISERROR(SEARCH(\"!\",G44))),\"Error message, original field contained incorrect value\",\n\nIF(AND($E44=\"Company Name\",LEN($F44)>40),\"Name is too long\",\n\nIF(AND($E44=\"Region\",ISERROR(VLOOKUP('INSTITUTIONAL VENDOR'!$E$12,List_of_Region_Countries,1,0))),\"Not a region country, field removed\",\n\nIF(AND(ISERROR(VLOOKUP($F44,List_of_Dropdown_list_Values,1,0)),NOT(ISERROR(VLOOKUP($G44,List_of_Dropdown_list_Values,1,0)))),\"Original Value was not from dropdown list, has been corrected\",\n\nIF(AND($E44=\"Account type\",OR('INSTITUTIONAL VENDOR'!$C$35=\"370 Russian Fed.\",'INSTITUTIONAL VENDOR'!$C$35=\"681 Angola\",'INSTITUTIONAL VENDOR'!$C$35=\"689 Mozambique\")),\"Digits must be moved to account number as per country specifics\",\n\nIF(AND($E44=\"Vendor's Bank Account Number\",OR('INSTITUTIONAL VENDOR'!$C$35=\"370 Russian Fed.\",'INSTITUTIONAL VENDOR'!$C$35=\"681 Angola\",'INSTITUTIONAL VENDOR'!$C$35=\"689 Mozambique\"),LEN(Log_file!$F44)>LEN(Log_file!$G44)),\"Digits moved to account key as per country specifics\",\n\nIF(AND(LEN(SUBSTITUTE(TRIM($F44),\" \",\"\"))=LEN(SUBSTITUTE(TRIM($G44),\" \",\"\")),LEN($F44)>LEN($G44)),\"Spaces removed\",\n\nIF(LEN($F44)>VLOOKUP($E44,SAP_fields_MAX_length,2,0),\"Original value length was over SAP limit\",\n\n\"Number Format/Special characters substituted or Unknown Reason\")))))))),\n\n\"\")","v":""},""]
[{"$f":"IF(C45<>D45,MAX(A$1:$A44)+1,0)","v":4},"Payment method",{"$f":"IF(ISBLANK(INSTITUTIONAL!E44),\"\",INSTITUTIONAL!E44)","v":"… Select"},{"$f":"IF(ISBLANK('INSTITUTIONAL VENDOR'!E44),\"\",'INSTITUTIONAL VENDOR'!E44)","v":""},{"$f":"IFERROR(VLOOKUP(ROWS($F$1:F44),A:D,2,0),\"\")","v":""},{"$f":"IFERROR(VLOOKUP(ROWS($F$1:F44),A:D,3,0),\"\")","v":""},{"$f":"IFERROR(VLOOKUP(ROWS($F$1:F44),A:D,4,0),\"\")","v":""},{"$f":"IF($F45<>$G45,\n\nIF(NOT(ISERROR(SEARCH(\"!\",G45))),\"Error message, original field contained incorrect value\",\n\nIF(AND($E45=\"Company Name\",LEN($F45)>40),\"Name is too long\",\n\nIF(AND($E45=\"Region\",ISERROR(VLOOKUP('INSTITUTIONAL VENDOR'!$E$12,List_of_Region_Countries,1,0))),\"Not a region country, field removed\",\n\nIF(AND(ISERROR(VLOOKUP($F45,List_of_Dropdown_list_Values,1,0)),NOT(ISERROR(VLOOKUP($G45,List_of_Dropdown_list_Values,1,0)))),\"Original Value was not from dropdown list, has been corrected\",\n\nIF(AND($E45=\"Account type\",OR('INSTITUTIONAL VENDOR'!$C$35=\"370 Russian Fed.\",'INSTITUTIONAL VENDOR'!$C$35=\"681 Angola\",'INSTITUTIONAL VENDOR'!$C$35=\"689 Mozambique\")),\"Digits must be moved to account number as per country specifics\",\n\nIF(AND($E45=\"Vendor's Bank Account Number\",OR('INSTITUTIONAL VENDOR'!$C$35=\"370 Russian Fed.\",'INSTITUTIONAL VENDOR'!$C$35=\"681 Angola\",'INSTITUTIONAL VENDOR'!$C$35=\"689 Mozambique\"),LEN(Log_file!$F45)>LEN(Log_file!$G45)),\"Digits moved to account key as per country specifics\",\n\nIF(AND(LEN(SUBSTITUTE(TRIM($F45),\" \",\"\"))=LEN(SUBSTITUTE(TRIM($G45),\" \",\"\")),LEN($F45)>LEN($G45)),\"Spaces removed\",\n\nIF(LEN($F45)>VLOOKUP($E45,SAP_fields_MAX_length,2,0),\"Original value length was over SAP limit\",\n\n\"Number Format/Special characters substituted or Unknown Reason\")))))))),\n\n\"\")","v":""},""]
[{"$f":"IF(C46<>D46,MAX(A$1:$A45)+1,0)","v":0},"Planned Annual Expenditure (USD) - optional",{"$f":"IF(ISBLANK(INSTITUTIONAL!E45),\"\",INSTITUTIONAL!E45)","v":""},{"$f":"IF(ISBLANK('INSTITUTIONAL VENDOR'!E45),\"\",'INSTITUTIONAL VENDOR'!E45)","v":""},{"$f":"IFERROR(VLOOKUP(ROWS($F$1:F45),A:D,2,0),\"\")","v":""},{"$f":"IFERROR(VLOOKUP(ROWS($F$1:F45),A:D,3,0),\"\")","v":""},{"$f":"IFERROR(VLOOKUP(ROWS($F$1:F45),A:D,4,0),\"\")","v":""},{"$f":"IF($F46<>$G46,\n\nIF(NOT(ISERROR(SEARCH(\"!\",G46))),\"Error message, original field contained incorrect value\",\n\nIF(AND($E46=\"Company Name\",LEN($F46)>40),\"Name is too long\",\n\nIF(AND($E46=\"Region\",ISERROR(VLOOKUP('INSTITUTIONAL VENDOR'!$E$12,List_of_Region_Countries,1,0))),\"Not a region country, field removed\",\n\nIF(AND(ISERROR(VLOOKUP($F46,List_of_Dropdown_list_Values,1,0)),NOT(ISERROR(VLOOKUP($G46,List_of_Dropdown_list_Values,1,0)))),\"Original Value was not from dropdown list, has been corrected\",\n\nIF(AND($E46=\"Account type\",OR('INSTITUTIONAL VENDOR'!$C$35=\"370 Russian Fed.\",'INSTITUTIONAL VENDOR'!$C$35=\"681 Angola\",'INSTITUTIONAL VENDOR'!$C$35=\"689 Mozambique\")),\"Digits must be moved to account number as per country specifics\",\n\nIF(AND($E46=\"Vendor's Bank Account Number\",OR('INSTITUTIONAL VENDOR'!$C$35=\"370 Russian Fed.\",'INSTITUTIONAL VENDOR'!$C$35=\"681 Angola\",'INSTITUTIONAL VENDOR'!$C$35=\"689 Mozambique\"),LEN(Log_file!$F46)>LEN(Log_file!$G46)),\"Digits moved to account key as per country specifics\",\n\nIF(AND(LEN(SUBSTITUTE(TRIM($F46),\" \",\"\"))=LEN(SUBSTITUTE(TRIM($G46),\" \",\"\")),LEN($F46)>LEN($G46)),\"Spaces removed\",\n\nIF(LEN($F46)>VLOOKUP($E46,SAP_fields_MAX_length,2,0),\"Original value length was over SAP limit\",\n\n\"Number Format/Special characters substituted or Unknown Reason\")))))))),\n\n\"\")","v":""},""]
[{"$f":"IF(C47<>D47,MAX(A$1:$A46)+1,0)","v":0},"Additional Instructions or Remarks ",{"$f":"IF(ISBLANK(INSTITUTIONAL!C49),\"\",INSTITUTIONAL!C49)","v":""},{"$f":"IF(ISBLANK('INSTITUTIONAL VENDOR'!C49),\"\",'INSTITUTIONAL VENDOR'!C49)","v":""},{"$f":"IFERROR(VLOOKUP(ROWS($F$1:F46),A:D,2,0),\"\")","v":""},{"$f":"IFERROR(VLOOKUP(ROWS($F$1:F46),A:D,3,0),\"\")","v":""},{"$f":"IFERROR(VLOOKUP(ROWS($F$1:F46),A:D,4,0),\"\")","v":""},{"$f":"IF($F47<>$G47,\n\nIF(NOT(ISERROR(SEARCH(\"!\",G47))),\"Error message, original field contained incorrect value\",\n\nIF(AND($E47=\"Company Name\",LEN($F47)>40),\"Name is too long\",\n\nIF(AND($E47=\"Region\",ISERROR(VLOOKUP('INSTITUTIONAL VENDOR'!$E$12,List_of_Region_Countries,1,0))),\"Not a region country, field removed\",\n\nIF(AND(ISERROR(VLOOKUP($F47,List_of_Dropdown_list_Values,1,0)),NOT(ISERROR(VLOOKUP($G47,List_of_Dropdown_list_Values,1,0)))),\"Original Value was not from dropdown list, has been corrected\",\n\nIF(AND($E47=\"Account type\",OR('INSTITUTIONAL VENDOR'!$C$35=\"370 Russian Fed.\",'INSTITUTIONAL VENDOR'!$C$35=\"681 Angola\",'INSTITUTIONAL VENDOR'!$C$35=\"689 Mozambique\")),\"Digits must be moved to account number as per country specifics\",\n\nIF(AND($E47=\"Vendor's Bank Account Number\",OR('INSTITUTIONAL VENDOR'!$C$35=\"370 Russian Fed.\",'INSTITUTIONAL VENDOR'!$C$35=\"681 Angola\",'INSTITUTIONAL VENDOR'!$C$35=\"689 Mozambique\"),LEN(Log_file!$F47)>LEN(Log_file!$G47)),\"Digits moved to account key as per country specifics\",\n\nIF(AND(LEN(SUBSTITUTE(TRIM($F47),\" \",\"\"))=LEN(SUBSTITUTE(TRIM($G47),\" \",\"\")),LEN($F47)>LEN($G47)),\"Spaces removed\",\n\nIF(LEN($F47)>VLOOKUP($E47,SAP_fields_MAX_length,2,0),\"Original value length was over SAP limit\",\n\n\"Number Format/Special characters substituted or Unknown Reason\")))))))),\n\n\"\")","v":""},""]

{"sheet":"DD","index":3,"n_rows":1249,"n_cols":49,"rows_kept":1249,"cut":false,"hidden":true,"merged":[]}
["block",null,"CountryCodes_Dropdown_NumberofMatches","Contry codes","CountryCodes_Dropdown_ListofMatches",null,null,null,"Vendor_account_group",{"$nulls":4},"Payment Method",null,null,"Account Type",null,"Partner_Type","CSO Type","Type of Assessment done","Risk Rating",null,"Parent Organization exists","Cost Ctr",{"$nulls":18},"List of Values in Dropdown Lists","Country_Codes","Programme_country?",null,"Field name","Maximum Length in SAP"]
["… Select",null,{"$f":"IF(ISNUMBER(SEARCH('INSTITUTIONAL VENDOR'!$E$12,D2)),MAX($C$1:C1)+1,0)","v":0},"… Select",{"$f":"IFERROR(VLOOKUP(ROWS($E$1:E1),C:D,2,0),\"\")","v":"441 Ukraine"},"Currency_Dropdown_NumberofMatches","Currency","Currency_Dropdown_ListofMatches","… Select","BA_Dropdown_NumberofMatches","Business Area","BA_Dropdown_ListofMatches",null,"… Select",null,null,"… Select",null,"… Select","… Select","… Select","… Select",null,"… Select","0060A00000 - AFGHANISTAN",null,"0001 Payable immediately Due net",{"$nulls":5},"… Select","… Select","… Select",{"$nulls":8},"001 Greenland","… Select","-",null,"House number",10]
["1 POs/LTAs not permitted (refer to SEU/DB)",null,{"$f":"IF(ISNUMBER(SEARCH('INSTITUTIONAL VENDOR'!$E$12,D3)),MAX($C$1:C2)+1,0)","v":0},"001 Greenland",{"$f":"IFERROR(VLOOKUP(ROWS($E$1:E2),C:D,2,0),\"\")","v":""},{"$f":"IF(ISNUMBER(SEARCH('INSTITUTIONAL VENDOR'!$C$31,G3)),MAX($F$2:F2)+1,0)","v":0},"… Select",{"$f":"IFERROR(VLOOKUP(ROWS($H$2:H2),F:G,2,0),\"\")","v":"UAH Ukrainian Hryvnia"},"ZCNT Institutional Contractors",{"$f":"IF(ISNUMBER(SEARCH('INSTITUTIONAL VENDOR'!$C$6,K3)),MAX($J$2:J2)+1,0)","v":0},"… Select",{"$f":"IFERROR(VLOOKUP(ROWS($L$2:L2),J:K,2,0),\"\")","v":"4410 - Ukraine"},null,"A Incountry Domestic Payment",null,null,"01 - Current/Checking account",null,"CSO - Civil Society Organisations","Intenational NGO","Micro Assessment","5 - Not Required",null,"Y","0060B00000 - KABUL AFGHANISTAN",null,"0002 within 14 days 3 % cash discount",{"$nulls":5},"Single","Male","1 - High",{"$nulls":8},"004 Guam","001 Greenland","No",null,"Street",60]
["2 Block request and purchase order",null,{"$f":"IF(ISNUMBER(SEARCH('INSTITUTIONAL VENDOR'!$E$12,D4)),MAX($C$1:C3)+1,0)","v":0},"004 Guam",{"$f":"IFERROR(VLOOKUP(ROWS($E$1:E3),C:D,2,0),\"\")","v":""},{"$f":"IF(ISNUMBER(SEARCH('INSTITUTIONAL VENDOR'!$C$31,G4)),MAX($F$2:F3)+1,0)","v":0},"AED United Arab Emirates Dirham",{"$f":"IFERROR(VLOOKUP(ROWS($H$2:H3),F:G,2,0),\"\")","v":""},"ZFO UNICEF Field Offices",{"$f":"IF(ISNUMBER(SEARCH('INSTITUTIONAL VENDOR'!$C$6,K4)),MAX($J$2:J3)+1,0)","v":0},"0060 - Afghanistan",{"$f":"IFERROR(VLOOKUP(ROWS($L$2:L3),J:K,2,0),\"\")","v":""},null,"B AP - Book Transfer (BKTR)",null,null,"02 - Saving account",null,"GOVT - Government","National NGO","High Risk Assumed","4 - Low",null,"N","0060C00000 - KABUL ZO CENTRAL",null," within 30 days 2 % cash discount",{"$nulls":5},"Mar&Re","Female","2 - Medium",{"$nulls":8},"006 Afghanistan","004 Guam","Yes",null,"City",40]
["3 Block quot.req., order and goods receipt",null,{"$f":"IF(ISNUMBER(SEARCH('INSTITUTIONAL VENDOR'!$E$12,D5)),MAX($C$1:C4)+1,0)","v":0},"006 Afghanistan",{"$f":"IFERROR(VLOOKUP(ROWS($E$1:E4),C:D,2,0),\"\")","v":""},{"$f":"IF(ISNUMBER(SEARCH('INSTITUTIONAL VENDOR'!$C$31,G5)),MAX($F$2:F4)+1,0)","v":0},"AFN Afghani",{"$f":"IFERROR(VLOOKUP(ROWS($H$2:H4),F:G,2,0),\"\")","v":""},"ZFV Field Office Vendors",{"$f":"IF(ISNUMBER(SEARCH('INSTITUTIONAL VENDOR'!$C$6,K5)),MAX($J$2:J4)+1,0)","v":0},"0090 - Albania",{"$f":"IFERROR(VLOOKUP(ROWS($L$2:L4),J:K,2,0),\"\")","v":""},null,"C Payment By Check",{"$nulls":4},"UN - UN Agency","Community Based Organisation","Audit Results","3 - Medium",null,null,"0060D00000 - BAMYAN CENTRAL",null," within 45 days Due net",{"$nulls":5},"Wid.",null,"3 - Low",{"$nulls":8},"009 Albania","006 Afghanistan","Yes",null,"Name of Contact",35]
["4 Block source determination",null,{"$f":"IF(ISNUMBER(SEARCH('INSTITUTIONAL VENDOR'!$E$12,D6)),MAX($C$1:C5)+1,0)","v":0},"009 Albania",{"$f":"IFERROR(VLOOKUP(ROWS($E$1:E5),C:D,2,0),\"\")","v":""},{"$f":"IF(ISNUMBER(SEARCH('INSTITUTIONAL VENDOR'!$C$31,G6)),MAX($F$2:F5)+1,0)","v":0},"ALL Albanian Lek(e)",{"$f":"IFERROR(VLOOKUP(ROWS($H$2:H5),F:G,2,0),\"\")","v":""},"ZNC National Committees",{"$f":"IF(ISNUMBER(SEARCH('INSTITUTIONAL VENDOR'!$C$6,K6)),MAX($J$2:J5)+1,0)","v":0},"0120 - Algeria",{"$f":"IFERROR(VLOOKUP(ROWS($L$2:L5),J:K,2,0),\"\")","v":""},null,"L Cash Payment Letter",{"$nulls":4},"Bilateral/Multilateral","Academic Institution","Low Risk Assumed","2 - Significant",null,null,"0060E00000 - DAIKUNDI CENTRAL",null,"0003 For Invoicing up to 15 of Month",{"$nulls":5},"Dev.",null,"4 - High Risk Assumed",{"$nulls":8},"012 Algeria","009 Albania","Yes",null,"Account holder's name",60]
["11 PQ manuf. Site. PO with main supplier",null,{"$f":"IF(ISNUMBER(SEARCH('INSTITUTIONAL VENDOR'!$E$12,D7)),MAX($C$1:C6)+1,0)","v":0},"012 Algeria",{"$f":"IFERROR(VLOOKUP(ROWS($E$1:E6),C:D,2,0),\"\")","v":""},{"$f":"IF(ISNUMBER(SEARCH('INSTITUTIONAL VENDOR'!$C$31,G7)),MAX($F$2:F6)+1,0)","v":0},"AMD Armenian Dram",{"$f":"IFERROR(VLOOKUP(ROWS($H$2:H6),F:G,2,0),\"\")","v":""},"ZUN UN Agencies",{"$f":"IF(ISNUMBER(SEARCH('INSTITUTIONAL VENDOR'!$C$6,K7)),MAX($J$2:J6)+1,0)","v":0},"0240 - Argentina",{"$f":"IFERROR(VLOOKUP(ROWS($L$2:L6),J:K,2,0),\"\")","v":""},null,"N AP - Non Urgent Payment (NURG)",null,null,"Account Update or Additional",null,null,null,"Others","1 - High",null,null,"0060F00000 - GARDEZCENTRAL",null," within 14 days 2 % cash discount",{"$nulls":5},"LegSep",null,"5 - Low Risk Assumed",{"$nulls":5},"BankCountryCodes_Dropdown_NumberofMatches","Bank_Contry_codes","BankCountryCodes_Dropdown_ListofMatches","024 Argentina","012 Algeria","Yes",null,"Business Area of LFP",999]
["21 Potential supplier, Not GMP evaluated",null,{"$f":"IF(ISNUMBER(SEARCH('INSTITUTIONAL VENDOR'!$E$12,D8)),MAX($C$1:C7)+1,0)","v":0},"024 Argentina",{"$f":"IFERROR(VLOOKUP(ROWS($E$1:E7),C:D,2,0),\"\")","v":""},{"$f":"IF(ISNUMBER(SEARCH('INSTITUTIONAL VENDOR'!$C$31,G8)),MAX($F$2:F7)+1,0)","v":0},"ANG Netherlands Antillean Gulder",{"$f":"IFERROR(VLOOKUP(ROWS($H$2:H7),F:G,2,0),\"\")","v":""},"PRG2 Implementing Partners",{"$f":"IF(ISNUMBER(SEARCH('INSTITUTIONAL VENDOR'!$C$6,K8)),MAX($J$2:J7)+1,0)","v":0},"0260 - Armenia",{"$f":"IFERROR(VLOOKUP(ROWS($L$2:L7),J:K,2,0),\"\")","v":""},null,"T Bank Trasfer",null,null,"… Select",{"$nulls":7},"0060G00000 - PARWAN CENTRAL",null," within 30 days 1.5 % cash discount",{"$nulls":5},"ComLaw",null,"6 - Not Assessed",{"$nulls":5},{"$f":"IF(ISNUMBER(SEARCH('INSTITUTIONAL VENDOR'!$C$35,AP8)),MAX($AO$7:AO7)+1,0)","v":0},"… Select",{"$f":"IFERROR(VLOOKUP(ROWS(AQ$7:$AQ7),AO:AP,2,0),\"\")","v":"441 Ukraine"},"025 Aruba","024 Argentina","Yes",null,"Request type ",999]
["74 Block on vendor's product for quality",null,{"$f":"IF(ISNUMBER(SEARCH('INSTITUTIONAL VENDOR'!$E$12,D9)),MAX($C$1:C8)+1,0)","v":0},"025 Aruba",{"$f":"IFERROR(VLOOKUP(ROWS($E$1:E8),C:D,2,0),\"\")","v":""},{"$f":"IF(ISNUMBER(SEARCH('INSTITUTIONAL VENDOR'!$C$31,G9)),MAX($F$2:F8)+1,0)","v":0},"AOA Angolan Kwanza",{"$f":"IFERROR(VLOOKUP(ROWS($H$2:H8),F:G,2,0),\"\")","v":""},"ZTVA Travel Agency",{"$f":"IF(ISNUMBER(SEARCH('INSTITUTIONAL VENDOR'!$C$6,K9)),MAX($J$2:J8)+1,0)","v":0},"0310 - Azerbaijan",{"$f":"IFERROR(VLOOKUP(ROWS($L$2:L8),J:K,2,0),\"\")","v":""},null,"U AP - Urgent Payment (URGP)",null,null,"Update/Replace Existing Account",{"$nulls":7},"0060H00000 - JALALABAD EASTERN",null," within 45 days Due net",{"$nulls":13},{"$f":"IF(ISNUMBER(SEARCH('INSTITUTIONAL VENDOR'!$C$35,AP9)),MAX($AO$7:AO8)+1,0)","v":0},"001 Greenland",{"$f":"IFERROR(VLOOKUP(ROWS(AQ$7:$AQ8),AO:AP,2,0),\"\")","v":""},"026 Armenia","025 Aruba","Yes",null,"Vendor Number (mandatory for Update/Block/Unblock)",999]
["97 Blocked for ethical reasons(total block)",null,{"$f":"IF(ISNUMBER(SEARCH('INSTITUTIONAL VENDOR'!$E$12,D10)),MAX($C$1:C9)+1,0)","v":0},"026 Armenia",{"$f":"IFERROR(VLOOKUP(ROWS($E$1:E9),C:D,2,0),\"\")","v":""},{"$f":"IF(ISNUMBER(SEARCH('INSTITUTIONAL VENDOR'!$C$31,G10)),MAX($F$2:F9)+1,0)","v":0},"ARS Argentine Peso",{"$f":"IFERROR(VLOOKUP(ROWS($H$2:H9),F:G,2,0),\"\")","v":""},null,{"$f":"IF(ISNUMBER(SEARCH('INSTITUTIONAL VENDOR'!$C$6,K10)),MAX($J$2:J9)+1,0)","v":0},"0420 - Barbados",{"$f":"IFERROR(VLOOKUP(ROWS($L$2:L9),J:K,2,0),\"\")","v":""},{"$nulls":4},"Add Additional Account",{"$nulls":7},"0060I00000 - MEZAR-I-SHARIF NORTH",null," Baseline date on 30 of the month",{"$nulls":13},{"$f":"IF(ISNUMBER(SEARCH('INSTITUTIONAL VENDOR'!$C$35,AP10)),MAX($AO$7:AO9)+1,0)","v":0},"004 Guam",{"$f":"IFERROR(VLOOKUP(ROWS(AQ$7:$AQ9),AO:AP,2,0),\"\")","v":""},"027 Australia","026 Armenia","Yes",null,"Vendor Account Group",999]
["98 Failed GMP inspection / total block",null,{"$f":"IF(ISNUMBER(SEARCH('INSTITUTIONAL VENDOR'!$E$12,D11)),MAX($C$1:C10)+1,0)","v":0},"027 Australia",{"$f":"IFERROR(VLOOKUP(ROWS($E$1:E10),C:D,2,0),\"\")","v":""},{"$f":"IF(ISNUMBER(SEARCH('INSTITUTIONAL VENDOR'!$C$31,G11)),MAX($F$2:F10)+1,0)","v":0},"AUD Australian Dollar",{"$f":"IFERROR(VLOOKUP(ROWS($H$2:H10),F:G,2,0),\"\")","v":""},null,{"$f":"IF(ISNUMBER(SEARCH('INSTITUTIONAL VENDOR'!$C$6,K11)),MAX($J$2:J10)+1,0)","v":0},"0490 - Bhutan",{"$f":"IFERROR(VLOOKUP(ROWS($L$2:L10),J:K,2,0),\"\")","v":""},{"$nulls":12},"0060J00000 - FAIZABAD NORTHERN",null," For Invoicing up to End  of Month",{"$nulls":5},"… Select",{"$nulls":7},{"$f":"IF(ISNUMBER(SEARCH('INSTITUTIONAL VENDOR'!$C$35,AP11)),MAX($AO$7:AO10)+1,0)","v":0},"006 Afghanistan",{"$f":"IFERROR(VLOOKUP(ROWS(AQ$7:$AQ10),AO:AP,2,0),\"\")","v":""},"030 Austria","027 Australia","Yes",null,"Prepayment enabled",999]
["99 Not Recommended by SEU/Total block",null,{"$f":"IF(ISNUMBER(SEARCH('INSTITUTIONAL VENDOR'!$E$12,D12)),MAX($C$1:C11)+1,0)","v":0},"030 Austria",{"$f":"IFERROR(VLOOKUP(ROWS($E$1:E11),C:D,2,0),\"\")","v":""},{"$f":"IF(ISNUMBER(SEARCH('INSTITUTIONAL VENDOR'!$C$31,G12)),MAX($F$2:F11)+1,0)","v":0},"AWG Aruban Guilder",{"$f":"IFERROR(VLOOKUP(ROWS($H$2:H11),F:G,2,0),\"\")","v":""},null,{"$f":"IF(ISNUMBER(SEARCH('INSTITUTIONAL VENDOR'!$C$6,K12)),MAX($J$2:J11)+1,0)","v":0},"0510 - Bolivia",{"$f":"IFERROR(VLOOKUP(ROWS($L$2:L11),J:K,2,0),\"\")","v":""},{"$nulls":12},"0060K00000 - FARYABNORTHERN",null," within 14 days 2.125 % cash discount",{"$nulls":5},"000 Unknown",{"$nulls":7},{"$f":"IF(ISNUMBER(SEARCH('INSTITUTIONAL VENDOR'!$C$35,AP12)),MAX($AO$7:AO11)+1,0)","v":0},"009 Albania",{"$f":"IFERROR(VLOOKUP(ROWS(AQ$7:$AQ11),AO:AP,2,0),\"\")","v":""},"031 Azerbaijan","030 Austria","No",null,"UNGM Number",999]
[null,null,{"$f":"IF(ISNUMBER(SEARCH('INSTITUTIONAL VENDOR'!$E$12,D13)),MAX($C$1:C12)+1,0)","v":0},"031 Azerbaijan",{"$f":"IFERROR(VLOOKUP(ROWS($E$1:E12),C:D,2,0),\"\")","v":""},{"$f":"IF(ISNUMBER(SEARCH('INSTITUTIONAL VENDOR'!$C$31,G13)),MAX($F$2:F12)+1,0)","v":0},"AZN New Azerbaijan Manat",{"$f":"IFERROR(VLOOKUP(ROWS($H$2:H12),F:G,2,0),\"\")","v":""},null,{"$f":"IF(ISNUMBER(SEARCH('INSTITUTIONAL VENDOR'!$C$6,K13)),MAX($J$2:J12)+1,0)","v":0},"0520 - Botswana",{"$f":"IFERROR(VLOOKUP(ROWS($L$2:L12),J:K,2,0),\"\")","v":""},{"$nulls":12},"0060L00000 - KUNDUZ NORTHERN",null," within 30 days 1.5 % cash discount",{"$nulls":5},"006 Afghanistan",{"$nulls":7},{"$f":"IF(ISNUMBER(SEARCH('INSTITUTIONAL VENDOR'!$C$35,AP13)),MAX($AO$7:AO12)+1,0)","v":0},"012 Algeria",{"$f":"IFERROR(VLOOKUP(ROWS(AQ$7:$AQ12),AO:AP,2,0),\"\")","v":""},"042 Barbados","031 Azerbaijan","Yes",null,"Purpose of vendor",999]
[null,null,{"$f":"IF(ISNUMBER(SEARCH('INSTITUTIONAL VENDOR'!$E$12,D14)),MAX($C$1:C13)+1,0)","v":0},"042 Barbados",{"$f":"IFERROR(VLOOKUP(ROWS($E$1:E13),C:D,2,0),\"\")","v":""},{"$f":"IF(ISNUMBER(SEARCH('INSTITUTIONAL VENDOR'!$C$31,G14)),MAX($F$2:F13)+1,0)","v":0},"BAM Bosnia-Herzegovina Mark",{"$f":"IFERROR(VLOOKUP(ROWS($H$2:H13),F:G,2,0),\"\")","v":""},null,{"$f":"IF(ISNUMBER(SEARCH('INSTITUTIONAL VENDOR'!$C$6,K14)),MAX($J$2:J13)+1,0)","v":0},"0530 - Bosnia and Herzegovina",{"$f":"IFERROR(VLOOKUP(ROWS($L$2:L13),J:K,2,0),\"\")","v":""},{"$nulls":12},"0060M00000 - KANDAHARSOUTHERN",null," within 45 days Due net",{"$nulls":5},"009 Albania",{"$nulls":7},{"$f":"IF(ISNUMBER(SEARCH('INSTITUTIONAL VENDOR'!$C$35,AP14)),MAX($AO$7:AO13)+1,0)","v":0},"024 Argentina",{"$f":"IFERROR(VLOOKUP(ROWS(AQ$7:$AQ13),AO:AP,2,0),\"\")","v":""},"048 Belgium","042 Barbados","Yes",null,"Telephone",999]
[null,null,{"$f":"IF(ISNUMBER(SEARCH('INSTITUTIONAL VENDOR'!$E$12,D15)),MAX($C$1:C14)+1,0)","v":0},"048 Belgium",{"$f":"IFERROR(VLOOKUP(ROWS($E$1:E14),C:D,2,0),\"\")","v":""},{"$f":"IF(ISNUMBER(SEARCH('INSTITUTIONAL VENDOR'!$C$31,G15)),MAX($F$2:F14)+1,0)","v":0},"BBD Barbados Dollar",{"$f":"IFERROR(VLOOKUP(ROWS($H$2:H14),F:G,2,0),\"\")","v":""},null,{"$f":"IF(ISNUMBER(SEARCH('INSTITUTIONAL VENDOR'!$C$6,K15)),MAX($J$2:J14)+1,0)","v":0},"0540 - Brazil",{"$f":"IFERROR(VLOOKUP(ROWS($L$2:L14),J:K,2,0),\"\")","v":""},{"$nulls":12},"0060N00000 - NIMROZ SOUTHERN",null," Baseline date on 15 of next month",{"$nulls":5},"012 Algeria",{"$nulls":7},{"$f":"IF(ISNUMBER(SEARCH('INSTITUTIONAL VENDOR'!$C$35,AP15)),MAX($AO$7:AO14)+1,0)","v":0},"025 Aruba",{"$f":"IFERROR(VLOOKUP(ROWS(AQ$7:$AQ14),AO:AP,2,0),\"\")","v":""},"049 Bhutan","048 Belgium","No",null,"Mobile Telephone",999]
[null,null,{"$f":"IF(ISNUMBER(SEARCH('INSTITUTIONAL VENDOR'!$E$12,D16)),MAX($C$1:C15)+1,0)","v":0},"049 Bhutan",{"$f":"IFERROR(VLOOKUP(ROWS($E$1:E15),C:D,2,0),\"\")","v":""},{"$f":"IF(ISNUMBER(SEARCH('INSTITUTIONAL VENDOR'!$C$31,G16)),MAX($F$2:F15)+1,0)","v":0},"BDT Bangladesh Taka",{"$f":"IFERROR(VLOOKUP(ROWS($H$2:H15),F:G,2,0),\"\")","v":""},null,{"$f":"IF(ISNUMBER(SEARCH('INSTITUTIONAL VENDOR'!$C$6,K16)),MAX($J$2:J15)+1,0)","v":0},"0570 - Bulgaria",{"$f":"IFERROR(VLOOKUP(ROWS($L$2:L15),J:K,2,0),\"\")","v":""},{"$nulls":12},"0060O00000 - HERATWESTERN",null,"0004 within 14 days 3 % cash discount",{"$nulls":5},"024 Argentina",{"$nulls":7},{"$f":"IF(ISNUMBER(SEARCH('INSTITUTIONAL VENDOR'!$C$35,AP16)),MAX($AO$7:AO15)+1,0)","v":0},"026 Armenia",{"$f":"IFERROR(VLOOKUP(ROWS(AQ$7:$AQ15),AO:AP,2,0),\"\")","v":""},"051 Bolivia","049 Bhutan","Yes",null,"Fax",999]
[null,null,{"$f":"IF(ISNUMBER(SEARCH('INSTITUTIONAL VENDOR'!$E$12,D17)),MAX($C$1:C16)+1,0)","v":0},"051 Bolivia",{"$f":"IFERROR(VLOOKUP(ROWS($E$1:E16),C:D,2,0),\"\")","v":""},{"$f":"IF(ISNUMBER(SEARCH('INSTITUTIONAL VENDOR'!$C$31,G17)),MAX($F$2:F16)+1,0)","v":0},"BGN Bulgarian Lev(a)",{"$f":"IFERROR(VLOOKUP(ROWS($H$2:H16),F:G,2,0),\"\")","v":""},null,{"$f":"IF(ISNUMBER(SEARCH('INSTITUTIONAL VENDOR'!$C$6,K17)),MAX($J$2:J16)+1,0)","v":0},"0600 - Myanmar",{"$f":"IFERROR(VLOOKUP(ROWS($L$2:L16),J:K,2,0),\"\")","v":""},{"$nulls":12},"0060P00000 - BADGHIS WESTERN",null," within 30 days 1 % cash discount",{"$nulls":5},"025 Aruba",{"$nulls":7},{"$f":"IF(ISNUMBER(SEARCH('INSTITUTIONAL VENDOR'!$C$35,AP17)),MAX($AO$7:AO16)+1,0)","v":0},"027 Australia",{"$f":"IFERROR(VLOOKUP(ROWS(AQ$7:$AQ16),AO:AP,2,0),\"\")","v":""},"052 Botswana","051 Bolivia","Yes",null,null,999]
["… Select",null,{"$f":"IF(ISNUMBER(SEARCH('INSTITUTIONAL VENDOR'!$E$12,D18)),MAX($C$1:C17)+1,0)","v":0},"052 Botswana",{"$f":"IFERROR(VLOOKUP(ROWS($E$1:E17),C:D,2,0),\"\")","v":""},{"$f":"IF(ISNUMBER(SEARCH('INSTITUTIONAL VENDOR'!$C$31,G18)),MAX($F$2:F17)+1,0)","v":0},"BHD Bahrain Dinar",{"$f":"IFERROR(VLOOKUP(ROWS($H$2:H17),F:G,2,0),\"\")","v":""},"Vendor account group",{"$f":"IF(ISNUMBER(SEARCH('INSTITUTIONAL VENDOR'!$C$6,K18)),MAX($J$2:J17)+1,0)","v":0},"0610 - Burundi",{"$f":"IFERROR(VLOOKUP(ROWS($L$2:L17),J:K,2,0),\"\")","v":""},{"$nulls":12},"0060Q00000 - FARAHWESTERN",null," within 60 days Due net",{"$nulls":5},"026 Armenia",{"$nulls":7},{"$f":"IF(ISNUMBER(SEARCH('INSTITUTIONAL VENDOR'!$C$35,AP18)),MAX($AO$7:AO17)+1,0)","v":0},"030 Austria",{"$f":"IFERROR(VLOOKUP(ROWS(AQ$7:$AQ17),AO:AP,2,0),\"\")","v":""},"053 Bosnia-Herz.","052 Botswana","Yes",null,"Contact person's E-mail Address  ",999]
[1000,null,{"$f":"IF(ISNUMBER(SEARCH('INSTITUTIONAL VENDOR'!$E$12,D19)),MAX($C$1:C18)+1,0)","v":0},"053 Bosnia-Herz.",{"$f":"IFERROR(VLOOKUP(ROWS($E$1:E18),C:D,2,0),\"\")","v":""},{"$f":"IF(ISNUMBER(SEARCH('INSTITUTIONAL VENDOR'!$C$31,G19)),MAX($F$2:F18)+1,0)","v":0},"BIF Burundi Franc",{"$f":"IFERROR(VLOOKUP(ROWS($H$2:H18),F:G,2,0),\"\")","v":""},"… Select",{"$f":"IF(ISNUMBER(SEARCH('INSTITUTIONAL VENDOR'!$C$6,K19)),MAX($J$2:J18)+1,0)","v":0},"0630 - Belarus",{"$f":"IFERROR(VLOOKUP(ROWS($L$2:L18),J:K,2,0),\"\")","v":""},{"$nulls":12},"0060R00000 - GHOR WESTERN",null,"0005 within 10 days 2 % cash discount",{"$nulls":5},"027 Australia",{"$nulls":7},{"$f":"IF(ISNUMBER(SEARCH('INSTITUTIONAL VENDOR'!$C$35,AP19)),MAX($AO$7:AO18)+1,0)","v":0},"031 Azerbaijan",{"$f":"IFERROR(VLOOKUP(ROWS(AQ$7:$AQ18),AO:AP,2,0),\"\")","v":""},"054 Brazil","053 Bosnia-Herz.","Yes",null,"E-mail Address (Payment advice)  ",999]
[2000,null,{"$f":"IF(ISNUMBER(SEARCH('INSTITUTIONAL VENDOR'!$E$12,D20)),MAX($C$1:C19)+1,0)","v":0},"054 Brazil",{"$f":"IFERROR(VLOOKUP(ROWS($E$1:E19),C:D,2,0),\"\")","v":""},{"$f":"IF(ISNUMBER(SEARCH('INSTITUTIONAL VENDOR'!$C$31,G20)),MAX($F$2:F19)+1,0)","v":0},"BMD Bermudan Dollar",{"$f":"IFERROR(VLOOKUP(ROWS($H$2:H19),F:G,2,0),\"\")","v":""},"Local Destinations (ZLC  - ‘L’),",{"$f":"IF(ISNUMBER(SEARCH('INSTITUTIONAL VENDOR'!$C$6,K20)),MAX($J$2:J19)+1,0)","v":0},"0660 - Cambodia",{"$f":"IFERROR(VLOOKUP(ROWS($L$2:L19),J:K,2,0),\"\")","v":""},{"$nulls":12},"0090A00000 - ALBANIA",null," within 30 days 1 % cash discount",{"$nulls":5},"030 Austria",{"$nulls":7},{"$f":"IF(ISNUMBER(SEARCH('INSTITUTIONAL VENDOR'!$C$35,AP20)),MAX($AO$7:AO19)+1,0)","v":0},"042 Barbados",{"$f":"IFERROR(VLOOKUP(ROWS(AQ$7:$AQ19),AO:AP,2,0),\"\")","v":""},"057 Bulgaria","054 Brazil","Yes",null,"WEB Site",999]
[null,null,{"$f":"IF(ISNUMBER(SEARCH('INSTITUTIONAL VENDOR'!$E$12,D21)),MAX($C$1:C20)+1,0)","v":0},"057 Bulgaria",{"$f":"IFERROR(VLOOKUP(ROWS($E$1:E20),C:D,2,0),\"\")","v":""},{"$f":"IF(ISNUMBER(SEARCH('INSTITUTIONAL VENDOR'!$C$31,G21)),MAX($F$2:F20)+1,0)","v":0},"BND Brunei Dollar",{"$f":"IFERROR(VLOOKUP(ROWS($H$2:H20),F:G,2,0),\"\")","v":""},"Governments (ZGV – ‘G’),",{"$f":"IF(ISNUMBER(SEARCH('INSTITUTIONAL VENDOR'!$C$6,K21)),MAX($J$2:J20)+1,0)","v":0},"0690 - Republic of Cameroon",{"$f":"IFERROR(VLOOKUP(ROWS($L$2:L20),J:K,2,0),\"\")","v":""},{"$nulls":12},"0090B00000 - TIRANA ALBANIA",null," within 50 days Due net",{"$nulls":5},"031 Azerbaijan",{"$nulls":7},{"$f":"IF(ISNUMBER(SEARCH('INSTITUTIONAL VENDOR'!$C$35,AP21)),MAX($AO$7:AO20)+1,0)","v":0},"048 Belgium",{"$f":"IFERROR(VLOOKUP(ROWS(AQ$7:$AQ20),AO:AP,2,0),\"\")","v":""},"060 Myanmar","057 Bulgaria","Yes",null,"Company Name",999]
[null,null,{"$f":"IF(ISNUMBER(SEARCH('INSTITUTIONAL VENDOR'!$E$12,D22)),MAX($C$1:C21)+1,0)","v":0},"060 Myanmar",{"$f":"IFERROR(VLOOKUP(ROWS($E$1:E21),C:D,2,0),\"\")","v":""},{"$f":"IF(ISNUMBER(SEARCH('INSTITUTIONAL VENDOR'!$C$31,G22)),MAX($F$2:F21)+1,0)","v":0},"BOB Boliviano",{"$f":"IFERROR(VLOOKUP(ROWS($H$2:H21),F:G,2,0),\"\")","v":""},"Inter-governmental Agencies (ZOI – ‘I’),",{"$f":"IF(ISNUMBER(SEARCH('INSTITUTIONAL VENDOR'!$C$6,K22)),MAX($J$2:J21)+1,0)","v":0},"0750 - Central African Republic",{"$f":"IFERROR(VLOOKUP(ROWS($L$2:L21),J:K,2,0),\"\")","v":""},{"$nulls":12},"0120A00000 - ALGERIA",null,"0006 Before End of the month 4 % cash discount",{"$nulls":5},"042 Barbados",{"$nulls":7},{"$f":"IF(ISNUMBER(SEARCH('INSTITUTIONAL VENDOR'!$C$35,AP22)),MAX($AO$7:AO21)+1,0)","v":0},"049 Bhutan",{"$f":"IFERROR(VLOOKUP(ROWS(AQ$7:$AQ21),AO:AP,2,0),\"\")","v":""},"061 Burundi","060 Myanmar","Yes",null,"Search Term",999]
[null,null,{"$f":"IF(ISNUMBER(SEARCH('INSTITUTIONAL VENDOR'!$E$12,D23)),MAX($C$1:C22)+1,0)","v":0},"061 Burundi",{"$f":"IFERROR(VLOOKUP(ROWS($E$1:E22),C:D,2,0),\"\")","v":""},{"$f":"IF(ISNUMBER(SEARCH('INSTITUTIONAL VENDOR'!$C$31,G23)),MAX($F$2:F22)+1,0)","v":0},"BRL Brazilian Real",{"$f":"IFERROR(VLOOKUP(ROWS($H$2:H22),F:G,2,0),\"\")","v":""},"National Committees (ZNC) – ‘C’),",{"$f":"IF(ISNUMBER(SEARCH('INSTITUTIONAL VENDOR'!$C$6,K23)),MAX($J$2:J22)+1,0)","v":0},"0780 - Sri Lanka",{"$f":"IFERROR(VLOOKUP(ROWS($L$2:L22),J:K,2,0),\"\")","v":""},{"$nulls":12},"0120B00000 - ALGIERS ALGERIA",null," Before 15 of the next month ;; 2 % cash discount",{"$nulls":5},"048 Belgium",{"$nulls":7},{"$f":"IF(ISNUMBER(SEARCH('INSTITUTIONAL VENDOR'!$C$35,AP23)),MAX($AO$7:AO22)+1,0)","v":0},"051 Bolivia",{"$f":"IFERROR(VLOOKUP(ROWS(AQ$7:$AQ22),AO:AP,2,0),\"\")","v":""},"063 Belarus","061 Burundi","Yes",null,"Zip / Postal code",999]
[0,"Request Type (Create/Update/Unblock/Block) must be provided to submit the request!",{"$f":"IF(ISNUMBER(SEARCH('INSTITUTIONAL VENDOR'!$E$12,D24)),MAX($C$1:C23)+1,0)","v":0},"063 Belarus",{"$f":"IFERROR(VLOOKUP(ROWS($E$1:E23),C:D,2,0),\"\")","v":""},{"$f":"IF(ISNUMBER(SEARCH('INSTITUTIONAL VENDOR'!$C$31,G24)),MAX($F$2:F23)+1,0)","v":0},"BSD Bahamian Dollar",{"$f":"IFERROR(VLOOKUP(ROWS($H$2:H23),F:G,2,0),\"\")","v":""},"Non-governmental Organizations (ZNG – ‘N’)",{"$f":"IF(ISNUMBER(SEARCH('INSTITUTIONAL VENDOR'!$C$6,K24)),MAX($J$2:J23)+1,0)","v":0},"0810 - Chad",{"$f":"IFERROR(VLOOKUP(ROWS($L$2:L23),J:K,2,0),\"\")","v":""},{"$nulls":12},"0240A00000 - ARGENTINA",null," Before 15 in 2 months Due net",{"$nulls":5},"049 Bhutan",{"$nulls":7},{"$f":"IF(ISNUMBER(SEARCH('INSTITUTIONAL VENDOR'!$C$35,AP24)),MAX($AO$7:AO23)+1,0)","v":0},"052 Botswana",{"$f":"IFERROR(VLOOKUP(ROWS(AQ$7:$AQ23),AO:AP,2,0),\"\")","v":""},"066 Cambodia","063 Belarus","Yes",null,"Country",999]
["Create ","There are mandatory fields missing for the creation request.\nComplete the fields in red background before submission!",{"$f":"IF(ISNUMBER(SEARCH('INSTITUTIONAL VENDOR'!$E$12,D25)),MAX($C$1:C24)+1,0)","v":0},"066 Cambodia",{"$f":"IFERROR(VLOOKUP(ROWS($E$1:E24),C:D,2,0),\"\")","v":""},{"$f":"IF(ISNUMBER(SEARCH('INSTITUTIONAL VENDOR'!$C$31,G25)),MAX($F$2:F24)+1,0)","v":0},"BTN Bhutanese Ngultrum",{"$f":"IFERROR(VLOOKUP(ROWS($H$2:H24),F:G,2,0),\"\")","v":""},"United Nations System (ZUN – ‘U’),",{"$f":"IF(ISNUMBER(SEARCH('INSTITUTIONAL VENDOR'!$C$6,K25)),MAX($J$2:J24)+1,0)","v":0},"0840 - Chile",{"$f":"IFERROR(VLOOKUP(ROWS($L$2:L24),J:K,2,0),\"\")","v":""},{"$nulls":12},"0240B00000 - BUENOS AIRES AR",null,"0007 within 14 days 4 % cash discount",{"$nulls":5},"051 Bolivia",{"$nulls":7},{"$f":"IF(ISNUMBER(SEARCH('INSTITUTIONAL VENDOR'!$C$35,AP25)),MAX($AO$7:AO24)+1,0)","v":0},"053 Bosnia-Herz.",{"$f":"IFERROR(VLOOKUP(ROWS(AQ$7:$AQ24),AO:AP,2,0),\"\")","v":""},"069 Cameroon","066 Cambodia","Yes",null,"Region",999]
["Update","There are mandatory fields missing for the update request.\nProvide the missing vendor number and all mandatory information that must be updated or missing in the vendor before submission!",{"$f":"IF(ISNUMBER(SEARCH('INSTITUTIONAL VENDOR'!$E$12,D26)),MAX($C$1:C25)+1,0)","v":0},"069 Cameroon",{"$f":"IFERROR(VLOOKUP(ROWS($E$1:E25),C:D,2,0),\"\")","v":""},{"$f":"IF(ISNUMBER(SEARCH('INSTITUTIONAL VENDOR'!$C$31,G26)),MAX($F$2:F25)+1,0)","v":0},"BWP Botswana Pula",{"$f":"IFERROR(VLOOKUP(ROWS($H$2:H25),F:G,2,0),\"\")","v":""},"Field Offices -non SLU/SLN  (ZFO – ‘F’),",{"$f":"IF(ISNUMBER(SEARCH('INSTITUTIONAL VENDOR'!$C$6,K26)),MAX($J$2:J25)+1,0)","v":0},"0860 - China",{"$f":"IFERROR(VLOOKUP(ROWS($L$2:L25),J:K,2,0),\"\")","v":""},{"$nulls":12},"0240C00000 - SOUTHERN CONE HUB AR",null," within 30 days 2 % cash discount",{"$nulls":5},"052 Botswana",{"$nulls":7},{"$f":"IF(ISNUMBER(SEARCH('INSTITUTIONAL VENDOR'!$C$35,AP26)),MAX($AO$7:AO25)+1,0)","v":0},"054 Brazil",{"$f":"IFERROR(VLOOKUP(ROWS(AQ$7:$AQ25),AO:AP,2,0),\"\")","v":""},"071 Canary Islands","069 Cameroon","Yes",null,"TAX ID #",999]
["Block","Provide the vendor number to be blocked and the reason for action in the fields in red background!",{"$f":"IF(ISNUMBER(SEARCH('INSTITUTIONAL VENDOR'!$E$12,D27)),MAX($C$1:C26)+1,0)","v":0},"071 Canary Islands",{"$f":"IFERROR(VLOOKUP(ROWS($E$1:E26),C:D,2,0),\"\")","v":""},{"$f":"IF(ISNUMBER(SEARCH('INSTITUTIONAL VENDOR'!$C$31,G27)),MAX($F$2:F26)+1,0)","v":0},"BYN New Belarusian Ruble",{"$f":"IFERROR(VLOOKUP(ROWS($H$2:H26),F:G,2,0),\"\")","v":""},"Field Offices -SLU/SLN only (ZFU – ‘Z’),",{"$f":"IF(ISNUMBER(SEARCH('INSTITUTIONAL VENDOR'!$C$6,K27)),MAX($J$2:J26)+1,0)","v":0},"0930 - Colombia",{"$f":"IFERROR(VLOOKUP(ROWS($L$2:L26),J:K,2,0),\"\")","v":""},"0001 Sales Org. 001",null,"0001 Government",null,null,"000 Allocation number",{"$nulls":6},"0260A00000 - ARMENIA",null," within 60 days Due net",{"$nulls":5},"053 Bosnia and Herzegovina",{"$nulls":7},{"$f":"IF(ISNUMBER(SEARCH('INSTITUTIONAL VENDOR'!$C$35,AP27)),MAX($AO$7:AO26)+1,0)","v":0},"057 Bulgaria",{"$f":"IFERROR(VLOOKUP(ROWS(AQ$7:$AQ26),AO:AP,2,0),\"\")","v":""},"072 Canada","071 Canary Islands","No",null,"Account Type",999]
["Unblock","Provide the vendor number to be unblocked and all mandatory information that must be updated or missing in the vendor before submission!",{"$f":"IF(ISNUMBER(SEARCH('INSTITUTIONAL VENDOR'!$E$12,D28)),MAX($C$1:C27)+1,0)","v":0},"072 Canada",{"$f":"IFERROR(VLOOKUP(ROWS($E$1:E27),C:D,2,0),\"\")","v":""},{"$f":"IF(ISNUMBER(SEARCH('INSTITUTIONAL VENDOR'!$C$31,G28)),MAX($F$2:F27)+1,0)","v":0},"BZD Belize Dollar",{"$f":"IFERROR(VLOOKUP(ROWS($H$2:H27),F:G,2,0),\"\")","v":""},"Individuals –Others  (ZIN – ‘O’),",{"$f":"IF(ISNUMBER(SEARCH('INSTITUTIONAL VENDOR'!$C$6,K28)),MAX($J$2:J27)+1,0)","v":0},"0990 - Democratic Republic of Congo",{"$f":"IFERROR(VLOOKUP(ROWS($L$2:L27),J:K,2,0),\"\")","v":""},"1000 UNICEF",null,"0002 Non-Governmental Org",null,null,"001 Posting date",null,null,"1400110 Contribution receivable - Government",null,null,null,"0260B00000 - YEREVAN ARMENIA",null,"0008 Payable immediately Due net",{"$nulls":5},"054 Brazil",{"$nulls":7},{"$f":"IF(ISNUMBER(SEARCH('INSTITUTIONAL VENDOR'!$C$35,AP28)),MAX($AO$7:AO27)+1,0)","v":0},"060 Myanmar",{"$f":"IFERROR(VLOOKUP(ROWS(AQ$7:$AQ27),AO:AP,2,0),\"\")","v":""},"075 Central Afr.Rep","072 Canada","No",null,"Vendor's Bank Account Number",999]
["Mark for deletion",null,{"$f":"IF(ISNUMBER(SEARCH('INSTITUTIONAL VENDOR'!$E$12,D29)),MAX($C$1:C28)+1,0)","v":0},"075 Central Afr.Rep",{"$f":"IFERROR(VLOOKUP(ROWS($E$1:E28),C:D,2,0),\"\")","v":""},{"$f":"IF(ISNUMBER(SEARCH('INSTITUTIONAL VENDOR'!$C$31,G29)),MAX($F$2:F28)+1,0)","v":0},"CAD Canadian Dollar",{"$f":"IFERROR(VLOOKUP(ROWS($H$2:H28),F:G,2,0),\"\")","v":""},"Joint Ventures – Worldwide (ZJT – ‘J’),",{"$f":"IF(ISNUMBER(SEARCH('INSTITUTIONAL VENDOR'!$C$6,K29)),MAX($J$2:J28)+1,0)","v":0},"1020 - Costa Rica",{"$f":"IFERROR(VLOOKUP(ROWS($L$2:L28),J:K,2,0),\"\")","v":""},"2000 PFP-GR, Geneva",null,"0003 Permanent Mission",null,null,"002 Doc.no., fiscal year",null,null,"1400120 Contribution Receivable (Int-gov Org.)",null,null,null,"0310A00000 - AZERBAIJAN",null," Baseline date on End of the month",{"$nulls":5},"057 Bulgaria",{"$nulls":7},{"$f":"IF(ISNUMBER(SEARCH('INSTITUTIONAL VENDOR'!$C$35,AP29)),MAX($AO$7:AO28)+1,0)","v":0},"061 Burundi",{"$f":"IFERROR(VLOOKUP(ROWS(AQ$7:$AQ28),AO:AP,2,0),\"\")","v":""},"078 Sri Lanka","075 Central Afr.Rep","Yes",null,"IBAN",999]
["Unmark for deletion",null,{"$f":"IF(ISNUMBER(SEARCH('INSTITUTIONAL VENDOR'!$E$12,D30)),MAX($C$1:C29)+1,0)","v":0},"078 Sri Lanka",{"$f":"IFERROR(VLOOKUP(ROWS($E$1:E29),C:D,2,0),\"\")","v":""},{"$f":"IF(ISNUMBER(SEARCH('INSTITUTIONAL VENDOR'!$C$31,G30)),MAX($F$2:F29)+1,0)","v":0},"CDF Franc Congolais",{"$f":"IFERROR(VLOOKUP(ROWS($H$2:H29),F:G,2,0),\"\")","v":""},"Country Office - Guest Houses (ZNH – ‘GH’),",{"$f":"IF(ISNUMBER(SEARCH('INSTITUTIONAL VENDOR'!$C$6,K30)),MAX($J$2:J29)+1,0)","v":0},"1030 - Croatia",{"$f":"IFERROR(VLOOKUP(ROWS($L$2:L29),J:K,2,0),\"\")","v":""},"2100 PFP-GR, New York",null,"0004 Private Organization",null,null,"003 Document date",null,null,"1400130 Contribution Receivable (NGO)",null,null,null,"0310B00000 - BAKU AZERBAIJAN",null,"0009 For Invoicing up to 15 of Month",{"$nulls":5},"060 Myanmar",{"$nulls":7},{"$f":"IF(ISNUMBER(SEARCH('INSTITUTIONAL VENDOR'!$C$35,AP30)),MAX($AO$7:AO29)+1,0)","v":0},"063 Belarus",{"$f":"IFERROR(VLOOKUP(ROWS(AQ$7:$AQ29),AO:AP,2,0),\"\")","v":""},"081 Chad","078 Sri Lanka","Yes",null,"Bank Account Currency ",999]
["… Select",null,{"$f":"IF(ISNUMBER(SEARCH('INSTITUTIONAL VENDOR'!$E$12,D31)),MAX($C$1:C30)+1,0)","v":0},"081 Chad",{"$f":"IFERROR(VLOOKUP(ROWS($E$1:E30),C:D,2,0),\"\")","v":""},{"$f":"IF(ISNUMBER(SEARCH('INSTITUTIONAL VENDOR'!$C$31,G31)),MAX($F$2:F30)+1,0)","v":0},"CHF Swiss Franc",{"$f":"IFERROR(VLOOKUP(ROWS($H$2:H30),F:G,2,0),\"\")","v":""},"Staff members (ZSM – ‘S’) (non-payroll bank information, block/unblock)",{"$f":"IF(ISNUMBER(SEARCH('INSTITUTIONAL VENDOR'!$C$6,K31)),MAX($J$2:J30)+1,0)","v":0},"1050 - Cuba",{"$f":"IFERROR(VLOOKUP(ROWS($L$2:L30),J:K,2,0),\"\")","v":""},"2200 PFP, SF & ERR",null,"0005 UN Secretariat",null,null,"004 Branch account",null,null,"1400140 Contribution Receivable (Nat. Comms.)",null,null,null,"0420A00000 - BARBADOS - MCP",null," Before 15 of the next month ;; 2.125 % cash disc",{"$nulls":5},"061 Burundi",{"$nulls":7},{"$f":"IF(ISNUMBER(SEARCH('INSTITUTIONAL VENDOR'!$C$35,AP31)),MAX($AO$7:AO30)+1,0)","v":0},"066 Cambodia",{"$f":"IFERROR(VLOOKUP(ROWS(AQ$7:$AQ30),AO:AP,2,0),\"\")","v":""},"084 Chile","081 Chad","Yes",null,"Name of Bank",999]
["Yes",null,{"$f":"IF(ISNUMBER(SEARCH('INSTITUTIONAL VENDOR'!$E$12,D32)),MAX($C$1:C31)+1,0)","v":0},"084 Chile",{"$f":"IFERROR(VLOOKUP(ROWS($E$1:E31),C:D,2,0),\"\")","v":""},{"$f":"IF(ISNUMBER(SEARCH('INSTITUTIONAL VENDOR'!$C$31,G32)),MAX($F$2:F31)+1,0)","v":0},"CLP Chilean Peso",{"$f":"IFERROR(VLOOKUP(ROWS($H$2:H31),F:G,2,0),\"\")","v":""},"One time customers (ZOT – ‘PO’),",{"$f":"IF(ISNUMBER(SEARCH('INSTITUTIONAL VENDOR'!$C$6,K32)),MAX($J$2:J31)+1,0)","v":0},"1170 - Benin",{"$f":"IFERROR(VLOOKUP(ROWS($L$2:L31),J:K,2,0),\"\")","v":""},null,null,"0006 Other UN Organizatio",null,null,"005 Loc.currency amount",null,null,"1400150 Contribution Receivable (UN Agencies)",null,null,null,"0420B00000 - BRIDGETOWN BARBADOS",null," Before End of the next month ;; Due net",{"$nulls":5},"063 Belarus",{"$nulls":7},{"$f":"IF(ISNUMBER(SEARCH('INSTITUTIONAL VENDOR'!$C$35,AP32)),MAX($AO$7:AO31)+1,0)","v":0},"069 Cameroon",{"$f":"IFERROR(VLOOKUP(ROWS(AQ$7:$AQ31),AO:AP,2,0),\"\")","v":""},"086 China","084 Chile","Yes",null,"Bank key",999]
["No",null,{"$f":"IF(ISNUMBER(SEARCH('INSTITUTIONAL VENDOR'!$E$12,D33)),MAX($C$1:C32)+1,0)","v":0},"086 China",{"$f":"IFERROR(VLOOKUP(ROWS($E$1:E32),C:D,2,0),\"\")","v":""},{"$f":"IF(ISNUMBER(SEARCH('INSTITUTIONAL VENDOR'!$C$31,G33)),MAX($F$2:F32)+1,0)","v":0},"CNY Chinese Yuan Renminbi",{"$f":"IFERROR(VLOOKUP(ROWS($H$2:H32),F:G,2,0),\"\")","v":""},null,{"$f":"IF(ISNUMBER(SEARCH('INSTITUTIONAL VENDOR'!$C$6,K33)),MAX($J$2:J32)+1,0)","v":0},"1200 - Denmark",{"$f":"IFERROR(VLOOKUP(ROWS($L$2:L32),J:K,2,0),\"\")","v":""},"01 Distribtn Channel 01",null,"0007 Self Employed",null,null,"006 Doc.currency amount",null,null,"1400160 Contribution Receivable (FO-PSFR)",null,null,null,"0420C00000 - PORT OF SPAIN TT",null," For Invoicing up to End  of Month",{"$nulls":5},"066 Cambodia",{"$nulls":7},{"$f":"IF(ISNUMBER(SEARCH('INSTITUTIONAL VENDOR'!$C$35,AP33)),MAX($AO$7:AO32)+1,0)","v":0},"071 Canary Islands",{"$f":"IFERROR(VLOOKUP(ROWS(AQ$7:$AQ32),AO:AP,2,0),\"\")","v":""},"093 Colombia","086 China","Yes",null,"Bank Country",999]
[null,null,{"$f":"IF(ISNUMBER(SEARCH('INSTITUTIONAL VENDOR'!$E$12,D34)),MAX($C$1:C33)+1,0)","v":0},"093 Colombia",{"$f":"IFERROR(VLOOKUP(ROWS($E$1:E33),C:D,2,0),\"\")","v":""},{"$f":"IF(ISNUMBER(SEARCH('INSTITUTIONAL VENDOR'!$C$31,G34)),MAX($F$2:F33)+1,0)","v":0},"COP Colombian Peso",{"$f":"IFERROR(VLOOKUP(ROWS($H$2:H33),F:G,2,0),\"\")","v":""},"Vendor account group",{"$f":"IF(ISNUMBER(SEARCH('INSTITUTIONAL VENDOR'!$C$6,K34)),MAX($J$2:J33)+1,0)","v":0},"1260 - Dominican Republic",{"$f":"IFERROR(VLOOKUP(ROWS($L$2:L33),J:K,2,0),\"\")","v":""},"10 UNICEF Programmes",null,"0008 Global Corp. Donors",null,null,"007 Bill/exch.due date",null,null,"1400161 Adjustment to Contribution Receivable (FO-PSFR)",null,null,null,"0490A00000 - BHUTAN",null," Before End of the next month ;; 2.125 % cash dis",{"$nulls":5},"069 Cameroon",{"$nulls":7},{"$f":"IF(ISNUMBER(SEARCH('INSTITUTIONAL VENDOR'!$C$35,AP34)),MAX($AO$7:AO33)+1,0)","v":0},"072 Canada",{"$f":"IFERROR(VLOOKUP(ROWS(AQ$7:$AQ33),AO:AP,2,0),\"\")","v":""},"099 Congo, Dem. Rep","093 Colombia","Yes",null,"Additional Instructions or Remarks ",999]
["… Select",null,{"$f":"IF(ISNUMBER(SEARCH('INSTITUTIONAL VENDOR'!$E$12,D35)),MAX($C$1:C34)+1,0)","v":0},"099 Congo, Dem. Rep",{"$f":"IFERROR(VLOOKUP(ROWS($E$1:E34),C:D,2,0),\"\")","v":""},{"$f":"IF(ISNUMBER(SEARCH('INSTITUTIONAL VENDOR'!$C$31,G35)),MAX($F$2:F34)+1,0)","v":0},"CRC Costa Rica Colon",{"$f":"IFERROR(VLOOKUP(ROWS($H$2:H34),F:G,2,0),\"\")","v":""},"… Select",{"$f":"IF(ISNUMBER(SEARCH('INSTITUTIONAL VENDOR'!$C$6,K35)),MAX($J$2:J34)+1,0)","v":0},"1350 - Ecuador",{"$f":"IFERROR(VLOOKUP(ROWS($L$2:L34),J:K,2,0),\"\")","v":""},"11 UNICEF Proc. Service",null,"0009 Exec. Board Member",null,null,"008 Cost center",null,null,"1420110 Contributions In-Kind Receivable (Government)",null,null,null,"0490B00000 - THIMPHU BHUTAN",null," Before 15 in 2 months Due net",{"$nulls":5},"072 Canada",{"$nulls":7},{"$f":"IF(ISNUMBER(SEARCH('INSTITUTIONAL VENDOR'!$C$35,AP35)),MAX($AO$7:AO34)+1,0)","v":0},"075 Central Afr.Rep",{"$f":"IFERROR(VLOOKUP(ROWS(AQ$7:$AQ34),AO:AP,2,0),\"\")","v":""},"102 Costa Rica","099 Congo, Dem. Rep","Yes",null,"Partner Type",999]
["UNICEF Ambassador",null,{"$f":"IF(ISNUMBER(SEARCH('INSTITUTIONAL VENDOR'!$E$12,D36)),MAX($C$1:C35)+1,0)","v":0},"102 Costa Rica",{"$f":"IFERROR(VLOOKUP(ROWS($E$1:E35),C:D,2,0),\"\")","v":""},{"$f":"IF(ISNUMBER(SEARCH('INSTITUTIONAL VENDOR'!$C$31,G36)),MAX($F$2:F35)+1,0)","v":0},"CUC Cuban Peso",{"$f":"IFERROR(VLOOKUP(ROWS($H$2:H35),F:G,2,0),\"\")","v":""},"ZFWD Forwarders",{"$f":"IF(ISNUMBER(SEARCH('INSTITUTIONAL VENDOR'!$C$6,K36)),MAX($J$2:J35)+1,0)","v":0},"1380 - El Salvador",{"$f":"IFERROR(VLOOKUP(ROWS($L$2:L35),J:K,2,0),\"\")","v":""},"20 PFP",null,"Z100 WCARO",null,null,"009 External doc.number",null,null,"1420120 Contributions In-Kind Receivable (Int-gov Org)",null,null,null,"0510A00000 - BOLIVIA",null,"0010 Payable immediately Due net",{"$nulls":5},"075 Central African Republic",{"$nulls":7},{"$f":"IF(ISNUMBER(SEARCH('INSTITUTIONAL VENDOR'!$C$35,AP36)),MAX($AO$7:AO35)+1,0)","v":0},"078 Sri Lanka",{"$f":"IFERROR(VLOOKUP(ROWS(AQ$7:$AQ35),AO:AP,2,0),\"\")","v":""},"103 Croatia","102 Costa Rica","Yes",null,"Civil Society Organization Type (if it is CSO)",999]
["Indiv Contractors",null,{"$f":"IF(ISNUMBER(SEARCH('INSTITUTIONAL VENDOR'!$E$12,D37)),MAX($C$1:C36)+1,0)","v":0},"103 Croatia",{"$f":"IFERROR(VLOOKUP(ROWS($E$1:E36),C:D,2,0),\"\")","v":""},{"$f":"IF(ISNUMBER(SEARCH('INSTITUTIONAL VENDOR'!$C$31,G37)),MAX($F$2:F36)+1,0)","v":0},"CVE Cape Verde Escudo",{"$f":"IFERROR(VLOOKUP(ROWS($H$2:H36),F:G,2,0),\"\")","v":""},"ZVEN Vendors -SD",{"$f":"IF(ISNUMBER(SEARCH('INSTITUTIONAL VENDOR'!$C$6,K37)),MAX($J$2:J36)+1,0)","v":0},"1390 - Equatorial Guinea",{"$f":"IFERROR(VLOOKUP(ROWS($L$2:L36),J:K,2,0),\"\")","v":""},null,null,"Z150 ESARO",null,null,"010 Purchase order no.",null,null,"1420130 Contributions In-Kind Receivable (NGO)",null,null,null,"0510B00000 - LA PAZ BOLIVIA",null," Baseline date on 10 of next month",{"$nulls":5},"078 Sri Lanka",{"$nulls":7},{"$f":"IF(ISNUMBER(SEARCH('INSTITUTIONAL VENDOR'!$C$35,AP37)),MAX($AO$7:AO36)+1,0)","v":0},"081 Chad",{"$f":"IFERROR(VLOOKUP(ROWS(AQ$7:$AQ36),AO:AP,2,0),\"\")","v":""},"105 Cuba","103 Croatia","Yes",null,"Name of Parent Organisation",999]
["Inst Contractors",null,{"$f":"IF(ISNUMBER(SEARCH('INSTITUTIONAL VENDOR'!$E$12,D38)),MAX($C$1:C37)+1,0)","v":0},"105 Cuba",{"$f":"IFERROR(VLOOKUP(ROWS($E$1:E37),C:D,2,0),\"\")","v":""},{"$f":"IF(ISNUMBER(SEARCH('INSTITUTIONAL VENDOR'!$C$31,G38)),MAX($F$2:F37)+1,0)","v":0},"CZK Czech Koruna",{"$f":"IFERROR(VLOOKUP(ROWS($H$2:H37),F:G,2,0),\"\")","v":""},null,{"$f":"IF(ISNUMBER(SEARCH('INSTITUTIONAL VENDOR'!$C$6,K38)),MAX($J$2:J37)+1,0)","v":0},"1410 - Ethiopia",{"$f":"IFERROR(VLOOKUP(ROWS($L$2:L37),J:K,2,0),\"\")","v":""},"01 Product Division 01",null,"Z200 EAPRO",null,null,"011 Plant number",null,null,"1420140 Contributions In-Kind Receivable (Nat Comms)",null,null,null,"0510C00000 - COCHABAMBA",null,"0011 within 10 days 3 % cash discount",{"$nulls":5},"081 Chad",{"$nulls":7},{"$f":"IF(ISNUMBER(SEARCH('INSTITUTIONAL VENDOR'!$C$35,AP38)),MAX($AO$7:AO37)+1,0)","v":0},"084 Chile",{"$f":"IFERROR(VLOOKUP(ROWS(AQ$7:$AQ37),AO:AP,2,0),\"\")","v":""},"111 Cyprus","105 Cuba","Yes",null,"Date of (PSEA) Assessment",999]
["External Auditors",null,{"$f":"IF(ISNUMBER(SEARCH('INSTITUTIONAL VENDOR'!$E$12,D39)),MAX($C$1:C38)+1,0)","v":0},"111 Cyprus",{"$f":"IFERROR(VLOOKUP(ROWS($E$1:E38),C:D,2,0),\"\")","v":""},{"$f":"IF(ISNUMBER(SEARCH('INSTITUTIONAL VENDOR'!$C$31,G39)),MAX($F$2:F38)+1,0)","v":0},"DJF Djibouti Franc",{"$f":"IFERROR(VLOOKUP(ROWS($H$2:H38),F:G,2,0),\"\")","v":""},null,{"$f":"IF(ISNUMBER(SEARCH('INSTITUTIONAL VENDOR'!$C$6,K39)),MAX($J$2:J38)+1,0)","v":0},"1420 - Eritrea",{"$f":"IFERROR(VLOOKUP(ROWS($L$2:L38),J:K,2,0),\"\")","v":""},"10 UNICEF stock items",null,"Z250 ROSA",null,null,"012 Vendor number",null,null,"1420150 Contributions In-Kind Receivable (UN Agencies)",null,null,null,"0510D00000 - SUCRE BOLIVIA",null,"0012 Payable immediately Due net",{"$nulls":5},"084 Chile",{"$nulls":7},{"$f":"IF(ISNUMBER(SEARCH('INSTITUTIONAL VENDOR'!$C$35,AP39)),MAX($AO$7:AO38)+1,0)","v":0},"086 China",{"$f":"IFERROR(VLOOKUP(ROWS(AQ$7:$AQ38),AO:AP,2,0),\"\")","v":""},"113 Czech Republic","111 Cyprus","Yes",null,"Risk Rating of (PSEA) Assessment",999]
["UNICEF Exec Board",null,{"$f":"IF(ISNUMBER(SEARCH('INSTITUTIONAL VENDOR'!$E$12,D40)),MAX($C$1:C39)+1,0)","v":0},"113 Czech Republic",{"$f":"IFERROR(VLOOKUP(ROWS($E$1:E39),C:D,2,0),\"\")","v":""},{"$f":"IF(ISNUMBER(SEARCH('INSTITUTIONAL VENDOR'!$C$31,G40)),MAX($F$2:F39)+1,0)","v":0},"DKK Danish Krone",{"$f":"IFERROR(VLOOKUP(ROWS($H$2:H39),F:G,2,0),\"\")","v":""},null,{"$f":"IF(ISNUMBER(SEARCH('INSTITUTIONAL VENDOR'!$C$6,K40)),MAX($J$2:J39)+1,0)","v":0},"1430 - Fiji (Pacific Islands)",{"$f":"IFERROR(VLOOKUP(ROWS($L$2:L39),J:K,2,0),\"\")","v":""},"11 UNICEF non-stk items",null,"Z300 MENA",null,null,"014 Purchase order",null,null,"1420160 Contributions In-Kind Receivable (PSFR)",null,null,null,"0520A00000 - BOTSWANA",null," Baseline date on 11 of next month",{"$nulls":5},"086 China",{"$nulls":7},{"$f":"IF(ISNUMBER(SEARCH('INSTITUTIONAL VENDOR'!$C$35,AP40)),MAX($AO$7:AO39)+1,0)","v":0},"093 Colombia",{"$f":"IFERROR(VLOOKUP(ROWS(AQ$7:$AQ39),AO:AP,2,0),\"\")","v":""},"117 Benin","113 Czech Republic","No",null,"Date of Assessment",999]
["Gov. Counterparts",null,{"$f":"IF(ISNUMBER(SEARCH('INSTITUTIONAL VENDOR'!$E$12,D41)),MAX($C$1:C40)+1,0)","v":0},"117 Benin",{"$f":"IFERROR(VLOOKUP(ROWS($E$1:E40),C:D,2,0),\"\")","v":""},{"$f":"IF(ISNUMBER(SEARCH('INSTITUTIONAL VENDOR'!$C$31,G41)),MAX($F$2:F40)+1,0)","v":0},"DOP Dominican Peso",{"$f":"IFERROR(VLOOKUP(ROWS($H$2:H40),F:G,2,0),\"\")","v":""},null,{"$f":"IF(ISNUMBER(SEARCH('INSTITUTIONAL VENDOR'!$C$6,K41)),MAX($J$2:J40)+1,0)","v":0},"1530 - Gabon",{"$f":"IFERROR(VLOOKUP(ROWS($L$2:L40),J:K,2,0),\"\")","v":""},"12 Unicef PS ResRelBill",null,"Z350 TACRO",null,null,"015 Personnel number",null,null,"1420260 Contributions In-Kind Receivable (PSFR)",null,null,null,"0520B00000 - GABORONE BOTSWANA",null,"0014 within 10 days 5 % cash discount",{"$nulls":5},"093 Colombia",{"$nulls":7},{"$f":"IF(ISNUMBER(SEARCH('INSTITUTIONAL VENDOR'!$C$35,AP41)),MAX($AO$7:AO40)+1,0)","v":0},"099 Congo, Dem. Rep",{"$f":"IFERROR(VLOOKUP(ROWS(AQ$7:$AQ40),AO:AP,2,0),\"\")","v":""},"120 Denmark","117 Benin","Yes",null,"Date of Positive Assessment",999]
["Internship",null,{"$f":"IF(ISNUMBER(SEARCH('INSTITUTIONAL VENDOR'!$E$12,D42)),MAX($C$1:C41)+1,0)","v":0},"120 Denmark",{"$f":"IFERROR(VLOOKUP(ROWS($E$1:E41),C:D,2,0),\"\")","v":""},{"$f":"IF(ISNUMBER(SEARCH('INSTITUTIONAL VENDOR'!$C$31,G42)),MAX($F$2:F41)+1,0)","v":0},"DZD Algerian Dinar",{"$f":"IFERROR(VLOOKUP(ROWS($H$2:H41),F:G,2,0),\"\")","v":""},null,{"$f":"IF(ISNUMBER(SEARCH('INSTITUTIONAL VENDOR'!$C$6,K42)),MAX($J$2:J41)+1,0)","v":0},"1560 - Gambia",{"$f":"IFERROR(VLOOKUP(ROWS($L$2:L41),J:K,2,0),\"\")","v":""},"21 Cards & Products",null,"Z400 CEE/NIS",null,null,"016 Settlement period",null,null,"1500110 Advances (Salary)",null,null,null,"0530A00000 - BOSNIA HERZEGOVINA",null,"0015 within 10 days 3 % cash discount",{"$nulls":5},"099 Congo, Dem. Rep.",{"$nulls":7},{"$f":"IF(ISNUMBER(SEARCH('INSTITUTIONAL VENDOR'!$C$35,AP42)),MAX($AO$7:AO41)+1,0)","v":0},"102 Costa Rica",{"$f":"IFERROR(VLOOKUP(ROWS(AQ$7:$AQ41),AO:AP,2,0),\"\")","v":""},"126 Dominican Rep.","120 Denmark","No",null,"Type of Assessment",999]
["Partners",null,{"$f":"IF(ISNUMBER(SEARCH('INSTITUTIONAL VENDOR'!$E$12,D43)),MAX($C$1:C42)+1,0)","v":0},"126 Dominican Rep.",{"$f":"IFERROR(VLOOKUP(ROWS($E$1:E42),C:D,2,0),\"\")","v":""},{"$f":"IF(ISNUMBER(SEARCH('INSTITUTIONAL VENDOR'!$C$31,G43)),MAX($F$2:F42)+1,0)","v":0},"EGP Egyptian Pound",{"$f":"IFERROR(VLOOKUP(ROWS($H$2:H42),F:G,2,0),\"\")","v":""},null,{"$f":"IF(ISNUMBER(SEARCH('INSTITUTIONAL VENDOR'!$C$6,K43)),MAX($J$2:J42)+1,0)","v":0},"1600 - Georgia",{"$f":"IFERROR(VLOOKUP(ROWS($L$2:L42),J:K,2,0),\"\")","v":""},"22 Promotion",null,"Z500 North America  (ODA)",null,null,"017 Settl.per., pers.no.",null,null,"1500120 Special Authorized Staff Advances",null,null,null,"0530B00000 - SARAJEVO BA",null," within 15 days 2 % cash discount",{"$nulls":5},"102 Costa Rica",{"$nulls":7},{"$f":"IF(ISNUMBER(SEARCH('INSTITUTIONAL VENDOR'!$C$35,AP43)),MAX($AO$7:AO42)+1,0)","v":0},"103 Croatia",{"$f":"IFERROR(VLOOKUP(ROWS(AQ$7:$AQ42),AO:AP,2,0),\"\")","v":""},"135 Ecuador","126 Dominican Rep.","Yes",null,"Risk Rating ",999]
["Other UN Agency Staff",null,{"$f":"IF(ISNUMBER(SEARCH('INSTITUTIONAL VENDOR'!$E$12,D44)),MAX($C$1:C43)+1,0)","v":0},"135 Ecuador",{"$f":"IFERROR(VLOOKUP(ROWS($E$1:E43),C:D,2,0),\"\")","v":""},{"$f":"IF(ISNUMBER(SEARCH('INSTITUTIONAL VENDOR'!$C$31,G44)),MAX($F$2:F43)+1,0)","v":0},"ERN Eritrean Nakfa",{"$f":"IFERROR(VLOOKUP(ROWS($H$2:H43),F:G,2,0),\"\")","v":""},null,{"$f":"IF(ISNUMBER(SEARCH('INSTITUTIONAL VENDOR'!$C$6,K44)),MAX($J$2:J43)+1,0)","v":0},"1620 - Ghana",{"$f":"IFERROR(VLOOKUP(ROWS($L$2:L43),J:K,2,0),\"\")","v":""},"23 Fund Raising",null,"Z550 Pacific        (ODA)",null,null,"018 Asset number",null,null,"1500130 Staff Rental Advance",null,null,null,"0530C00000 - BANJA LUKA",null," within 20 days Due net",{"$nulls":5},"103 Croatia",{"$nulls":7},{"$f":"IF(ISNUMBER(SEARCH('INSTITUTIONAL VENDOR'!$C$35,AP44)),MAX($AO$7:AO43)+1,0)","v":0},"105 Cuba",{"$f":"IFERROR(VLOOKUP(ROWS(AQ$7:$AQ43),AO:AP,2,0),\"\")","v":""},"138 El Salvador","135 Ecuador","Yes",null,"Permitted Payee Vendor Number",999]
["UN Volunteers",null,{"$f":"IF(ISNUMBER(SEARCH('INSTITUTIONAL VENDOR'!$E$12,D45)),MAX($C$1:C44)+1,0)","v":0},"138 El Salvador",{"$f":"IFERROR(VLOOKUP(ROWS($E$1:E44),C:D,2,0),\"\")","v":""},{"$f":"IF(ISNUMBER(SEARCH('INSTITUTIONAL VENDOR'!$C$31,G45)),MAX($F$2:F44)+1,0)","v":0},"ETB Ethiopian Birr",{"$f":"IFERROR(VLOOKUP(ROWS($H$2:H44),F:G,2,0),\"\")","v":""},null,{"$f":"IF(ISNUMBER(SEARCH('INSTITUTIONAL VENDOR'!$C$6,K45)),MAX($J$2:J44)+1,0)","v":0},"1680 - Guatemala",{"$f":"IFERROR(VLOOKUP(ROWS($L$2:L44),J:K,2,0),\"\")","v":""},"24 Fund Raising ERR",null,"Z600 Western Europe (ODA)",null,null,"021 Segment text",null,null,"1500190 Other staff receivables",null,null,null,"0540A00000 - BRAZIL",null,"0016 within 14 days 3 % cash discount",{"$nulls":5},"105 Cuba",{"$nulls":7},{"$f":"IF(ISNUMBER(SEARCH('INSTITUTIONAL VENDOR'!$C$35,AP45)),MAX($AO$7:AO44)+1,0)","v":0},"111 Cyprus",{"$f":"IFERROR(VLOOKUP(ROWS(AQ$7:$AQ44),AO:AP,2,0),\"\")","v":""},"139 Equatorial Guin","138 El Salvador","Yes",null,"House Bank",999]
["Volunteers",null,{"$f":"IF(ISNUMBER(SEARCH('INSTITUTIONAL VENDOR'!$E$12,D46)),MAX($C$1:C45)+1,0)","v":0},"139 Equatorial Guin",{"$f":"IFERROR(VLOOKUP(ROWS($E$1:E45),C:D,2,0),\"\")","v":""},{"$f":"IF(ISNUMBER(SEARCH('INSTITUTIONAL VENDOR'!$C$31,G46)),MAX($F$2:F45)+1,0)","v":0},"EUR Euro",{"$f":"IFERROR(VLOOKUP(ROWS($H$2:H45),F:G,2,0),\"\")","v":""},null,{"$f":"IF(ISNUMBER(SEARCH('INSTITUTIONAL VENDOR'!$C$6,K46)),MAX($J$2:J45)+1,0)","v":0},"1770 - Guinea",{"$f":"IFERROR(VLOOKUP(ROWS($L$2:L45),J:K,2,0),\"\")","v":""},"90 UNICEF Products",null,"Z650 Nordic Region  (ODA)",null,null,"022 One-time name / city",null,null,"1510110 Receivables (Product Sales)",null,null,null,"0540B00000 - BRASILIA BRAZIL",null," within 20 days 2 % cash discount",{"$nulls":5},"111 Cyprus",{"$nulls":7},{"$f":"IF(ISNUMBER(SEARCH('INSTITUTIONAL VENDOR'!$C$35,AP46)),MAX($AO$7:AO45)+1,0)","v":0},"113 Czech Republic",{"$f":"IFERROR(VLOOKUP(ROWS(AQ$7:$AQ45),AO:AP,2,0),\"\")","v":""},"140 Estonia","139 Equatorial Guin","Yes",null,"Payment method",999]
[null,null,{"$f":"IF(ISNUMBER(SEARCH('INSTITUTIONAL VENDOR'!$E$12,D47)),MAX($C$1:C46)+1,0)","v":0},"140 Estonia",{"$f":"IFERROR(VLOOKUP(ROWS($E$1:E46),C:D,2,0),\"\")","v":""},{"$f":"IF(ISNUMBER(SEARCH('INSTITUTIONAL VENDOR'!$C$31,G47)),MAX($F$2:F46)+1,0)","v":0},"FJD Fiji Dollar",{"$f":"IFERROR(VLOOKUP(ROWS($H$2:H46),F:G,2,0),\"\")","v":""},null,{"$f":"IF(ISNUMBER(SEARCH('INSTITUTIONAL VENDOR'!$C$6,K47)),MAX($J$2:J46)+1,0)","v":0},"1800 - Guyana",{"$f":"IFERROR(VLOOKUP(ROWS($L$2:L46),J:K,2,0),\"\")","v":""},null,null,"Z998 Multinational",null,null,"023 One-time city / name",null,null,"1510130 Prod.sales - Natcom & FO's",null,null,null,"0540C00000 - BELEM",null," within 30 days Due net",{"$nulls":5},"113 Czech Republic",{"$nulls":7},{"$f":"IF(ISNUMBER(SEARCH('INSTITUTIONAL VENDOR'!$C$35,AP47)),MAX($AO$7:AO46)+1,0)","v":0},"117 Benin",{"$f":"IFERROR(VLOOKUP(ROWS(AQ$7:$AQ46),AO:AP,2,0),\"\")","v":""},"141 Ethiopia","140 Estonia","No",null,"Planned Annual Expenditure (USD) - optional",999]
[null,null,{"$f":"IF(ISNUMBER(SEARCH('INSTITUTIONAL VENDOR'!$E$12,D48)),MAX($C$1:C47)+1,0)","v":0},"141 Ethiopia",{"$f":"IFERROR(VLOOKUP(ROWS($E$1:E47),C:D,2,0),\"\")","v":""},{"$f":"IF(ISNUMBER(SEARCH('INSTITUTIONAL VENDOR'!$C$31,G48)),MAX($F$2:F47)+1,0)","v":0},"GBP Pound Sterling",{"$f":"IFERROR(VLOOKUP(ROWS($H$2:H47),F:G,2,0),\"\")","v":""},null,{"$f":"IF(ISNUMBER(SEARCH('INSTITUTIONAL VENDOR'!$C$6,K48)),MAX($J$2:J47)+1,0)","v":0},"1830 - Haiti",{"$f":"IFERROR(VLOOKUP(ROWS($L$2:L47),J:K,2,0),\"\")","v":""},"Payment terms",null,"Z999 UN System",null,null,"024 Document header text",null,null,"1510140 Licensing Receivables - Natcoms & Others",null,null,null,"0540D00000 - FORTALEZA",null,"0017 Payable in 3 partial amounts",{"$nulls":5},"117 Benin",{"$nulls":7},{"$f":"IF(ISNUMBER(SEARCH('INSTITUTIONAL VENDOR'!$C$35,AP48)),MAX($AO$7:AO47)+1,0)","v":0},"120 Denmark",{"$f":"IFERROR(VLOOKUP(ROWS(AQ$7:$AQ47),AO:AP,2,0),\"\")","v":""},"142 Eritrea","141 Ethiopia","Yes",null,"Additional Instructions or Remarks ",999]
["… Select",null,{"$f":"IF(ISNUMBER(SEARCH('INSTITUTIONAL VENDOR'!$E$12,D49)),MAX($C$1:C48)+1,0)","v":0},"142 Eritrea",{"$f":"IFERROR(VLOOKUP(ROWS($E$1:E48),C:D,2,0),\"\")","v":""},{"$f":"IF(ISNUMBER(SEARCH('INSTITUTIONAL VENDOR'!$C$31,G49)),MAX($F$2:F48)+1,0)","v":0},"GEL Georgian Lari",{"$f":"IFERROR(VLOOKUP(ROWS($H$2:H48),F:G,2,0),\"\")","v":""},null,{"$f":"IF(ISNUMBER(SEARCH('INSTITUTIONAL VENDOR'!$C$6,K49)),MAX($J$2:J48)+1,0)","v":0},"1860 - Honduras",{"$f":"IFERROR(VLOOKUP(ROWS($L$2:L48),J:K,2,0),\"\")","v":""},"… Select",null,"ZHQ Staff - Headquarters",null,null,"025 CPU date",null,null,"1510160 Licensing Receivables - FO PSFR",null,null,null,"0540E00000 - MANAUS",null," 1 installment: 30.000 % with payment term 0001",{"$nulls":5},"120 Denmark",{"$nulls":7},{"$f":"IF(ISNUMBER(SEARCH('INSTITUTIONAL VENDOR'!$C$35,AP49)),MAX($AO$7:AO48)+1,0)","v":0},"126 Dominican Rep.",{"$f":"IFERROR(VLOOKUP(ROWS(AQ$7:$AQ48),AO:AP,2,0),\"\")","v":""},"143 Fiji","142 Eritrea","Yes"]
["Corporate Contract",null,{"$f":"IF(ISNUMBER(SEARCH('INSTITUTIONAL VENDOR'!$E$12,D50)),MAX($C$1:C49)+1,0)","v":0},"143 Fiji",{"$f":"IFERROR(VLOOKUP(ROWS($E$1:E49),C:D,2,0),\"\")","v":""},{"$f":"IF(ISNUMBER(SEARCH('INSTITUTIONAL VENDOR'!$C$31,G50)),MAX($F$2:F49)+1,0)","v":0},"GHS Ghana Cedi (new)",{"$f":"IFERROR(VLOOKUP(ROWS($H$2:H49),F:G,2,0),\"\")","v":""},null,{"$f":"IF(ISNUMBER(SEARCH('INSTITUTIONAL VENDOR'!$C$6,K50)),MAX($J$2:J49)+1,0)","v":0},"1950 - Global Shared Services Center",{"$f":"IFERROR(VLOOKUP(ROWS($L$2:L49),J:K,2,0),\"\")","v":""},"0001 Payable immediately Due net",null,"ZLC  Staff - Local",null,null,"026 Pmnt per.bslne date",null,null,"1520610 Receivables (Procurement Services)",null,null,null,"0540F00000 - RECIFE",null," 2 installment: 40.000 % with payment term 0001",{"$nulls":5},"126 Dominican Republic",{"$nulls":7},{"$f":"IF(ISNUMBER(SEARCH('INSTITUTIONAL VENDOR'!$C$35,AP50)),MAX($AO$7:AO49)+1,0)","v":0},"135 Ecuador",{"$f":"IFERROR(VLOOKUP(ROWS(AQ$7:$AQ49),AO:AP,2,0),\"\")","v":""},"144 Finland","143 Fiji","Yes"]
["Long term agreement",null,{"$f":"IF(ISNUMBER(SEARCH('INSTITUTIONAL VENDOR'!$E$12,D51)),MAX($C$1:C50)+1,0)","v":0},"144 Finland",{"$f":"IFERROR(VLOOKUP(ROWS($E$1:E50),C:D,2,0),\"\")","v":""},{"$f":"IF(ISNUMBER(SEARCH('INSTITUTIONAL VENDOR'!$C$31,G51)),MAX($F$2:F50)+1,0)","v":0},"GIP Gibraltar Pound",{"$f":"IFERROR(VLOOKUP(ROWS($H$2:H50),F:G,2,0),\"\")","v":""},null,{"$f":"IF(ISNUMBER(SEARCH('INSTITUTIONAL VENDOR'!$C$6,K51)),MAX($J$2:J50)+1,0)","v":0},"2040 - India",{"$f":"IFERROR(VLOOKUP(ROWS($L$2:L50),J:K,2,0),\"\")","v":""},"Z120 Within 30 days Due net",{"$nulls":4},"027 Value date",null,null,"1520810 Receivables (UN Agencies)",null,null,null,"0540G00000 - SALVADOR",null," 3 installment: 30.000 % with payment term 0001",{"$nulls":5},"135 Ecuador",{"$nulls":7},{"$f":"IF(ISNUMBER(SEARCH('INSTITUTIONAL VENDOR'!$C$35,AP51)),MAX($AO$7:AO50)+1,0)","v":0},"138 El Salvador",{"$f":"IFERROR(VLOOKUP(ROWS(AQ$7:$AQ50),AO:AP,2,0),\"\")","v":""},"147 France","144 Finland","No"]
["Low value procurement",null,{"$f":"IF(ISNUMBER(SEARCH('INSTITUTIONAL VENDOR'!$E$12,D52)),MAX($C$1:C51)+1,0)","v":0},"147 France",{"$f":"IFERROR(VLOOKUP(ROWS($E$1:E51),C:D,2,0),\"\")","v":""},{"$f":"IF(ISNUMBER(SEARCH('INSTITUTIONAL VENDOR'!$C$31,G52)),MAX($F$2:F51)+1,0)","v":0},"GMD Gambian Dalasi",{"$f":"IFERROR(VLOOKUP(ROWS($H$2:H51),F:G,2,0),\"\")","v":""},null,{"$f":"IF(ISNUMBER(SEARCH('INSTITUTIONAL VENDOR'!$C$6,K52)),MAX($J$2:J51)+1,0)","v":0},"2070 - Indonesia",{"$f":"IFERROR(VLOOKUP(ROWS($L$2:L51),J:K,2,0),\"\")","v":""},"Z000 Up-front payment",{"$nulls":4},"028 Asset number",null,null,"1520910 Receivables (Miscellaneous)",null,null,null,"0540H00000 - SAO LUIS",null,"Y000 Payment due in 30 days",{"$nulls":5},"138 El Salvador",{"$nulls":7},{"$f":"IF(ISNUMBER(SEARCH('INSTITUTIONAL VENDOR'!$C$35,AP52)),MAX($AO$7:AO51)+1,0)","v":0},"139 Equatorial Guin",{"$f":"IFERROR(VLOOKUP(ROWS(AQ$7:$AQ51),AO:AP,2,0),\"\")","v":""},"153 Gabon","147 France","No"]
["Signing an SSFA / PCA",null,{"$f":"IF(ISNUMBER(SEARCH('INSTITUTIONAL VENDOR'!$E$12,D53)),MAX($C$1:C52)+1,0)","v":0},"153 Gabon",{"$f":"IFERROR(VLOOKUP(ROWS($E$1:E52),C:D,2,0),\"\")","v":""},{"$f":"IF(ISNUMBER(SEARCH('INSTITUTIONAL VENDOR'!$C$31,G53)),MAX($F$2:F52)+1,0)","v":0},"GNF Guinean Franc",{"$f":"IFERROR(VLOOKUP(ROWS($H$2:H52),F:G,2,0),\"\")","v":""},null,{"$f":"IF(ISNUMBER(SEARCH('INSTITUTIONAL VENDOR'!$C$6,K53)),MAX($J$2:J52)+1,0)","v":0},"2100 - Iran",{"$f":"IFERROR(VLOOKUP(ROWS($L$2:L52),J:K,2,0),\"\")","v":""},"Z002 (4) equal quarterly payments",null,"PRIV",null,null,"029 Pstng month, vendor",null,null,"1550110 Prepaid Travel",null,null,null,"0540I00000 - SAO PAULO",null,"Y001 within 29 days 2 % cash discount",{"$nulls":5},"139 Equatorial Guinea",{"$nulls":7},{"$f":"IF(ISNUMBER(SEARCH('INSTITUTIONAL VENDOR'!$C$35,AP53)),MAX($AO$7:AO52)+1,0)","v":0},"140 Estonia",{"$f":"IFERROR(VLOOKUP(ROWS(AQ$7:$AQ52),AO:AP,2,0),\"\")","v":""},"156 Gambia","153 Gabon","Yes"]
["Internet / Telephone Service Provider",null,{"$f":"IF(ISNUMBER(SEARCH('INSTITUTIONAL VENDOR'!$E$12,D54)),MAX($C$1:C53)+1,0)","v":0},"156 Gambia",{"$f":"IFERROR(VLOOKUP(ROWS($E$1:E53),C:D,2,0),\"\")","v":""},{"$f":"IF(ISNUMBER(SEARCH('INSTITUTIONAL VENDOR'!$C$31,G54)),MAX($F$2:F53)+1,0)","v":0},"GTQ Guatemalan Quetzal",{"$f":"IFERROR(VLOOKUP(ROWS($H$2:H53),F:G,2,0),\"\")","v":""},null,{"$f":"IF(ISNUMBER(SEARCH('INSTITUTIONAL VENDOR'!$C$6,K54)),MAX($J$2:J53)+1,0)","v":0},"2130 - Iraq",{"$f":"IFERROR(VLOOKUP(ROWS($L$2:L53),J:K,2,0),\"\")","v":""},"Z003 Reimbursement of expenses",null,"PUBL",null,null,"031 Customer number",null,null,"1550120 Prepaid Education grant",null,null,null,"0540J00000 - RIO DE JANEIRO BR",null," within 30 days Due net",{"$nulls":5},"140 Estonia",{"$nulls":7},{"$f":"IF(ISNUMBER(SEARCH('INSTITUTIONAL VENDOR'!$C$35,AP54)),MAX($AO$7:AO53)+1,0)","v":0},"141 Ethiopia",{"$f":"IFERROR(VLOOKUP(ROWS(AQ$7:$AQ53),AO:AP,2,0),\"\")","v":""},"160 Georgia","156 Gambia","Yes"]
["Bidding",null,{"$f":"IF(ISNUMBER(SEARCH('INSTITUTIONAL VENDOR'!$E$12,D55)),MAX($C$1:C54)+1,0)","v":0},"160 Georgia",{"$f":"IFERROR(VLOOKUP(ROWS($E$1:E54),C:D,2,0),\"\")","v":""},{"$f":"IF(ISNUMBER(SEARCH('INSTITUTIONAL VENDOR'!$C$31,G55)),MAX($F$2:F54)+1,0)","v":0},"GYD Guyanese Dollar",{"$f":"IFERROR(VLOOKUP(ROWS($H$2:H54),F:G,2,0),\"\")","v":""},null,{"$f":"IF(ISNUMBER(SEARCH('INSTITUTIONAL VENDOR'!$C$6,K55)),MAX($J$2:J54)+1,0)","v":0},"2220 - Office of Research, Italy",{"$f":"IFERROR(VLOOKUP(ROWS($L$2:L54),J:K,2,0),\"\")","v":""},"Z004 (2) six-months payment",{"$nulls":4},"032 Pstng yr,month,curr.",null,null,"2200110 Reconciliation (Procurement Services)",null,null,null,"0570A00000 - BULGARIA",null,"Y002 within 30 days Due net",{"$nulls":5},"141 Ethiopia",{"$nulls":7},{"$f":"IF(ISNUMBER(SEARCH('INSTITUTIONAL VENDOR'!$C$35,AP55)),MAX($AO$7:AO54)+1,0)","v":0},"142 Eritrea",{"$f":"IFERROR(VLOOKUP(ROWS(AQ$7:$AQ54),AO:AP,2,0),\"\")","v":""},"162 Ghana","160 Georgia","Yes"]
["Other (please provide detailed explanation under Additional Instructions or Remarks)",null,{"$f":"IF(ISNUMBER(SEARCH('INSTITUTIONAL VENDOR'!$E$12,D56)),MAX($C$1:C55)+1,0)","v":0},"162 Ghana",{"$f":"IFERROR(VLOOKUP(ROWS($E$1:E55),C:D,2,0),\"\")","v":""},{"$f":"IF(ISNUMBER(SEARCH('INSTITUTIONAL VENDOR'!$C$31,G56)),MAX($F$2:F55)+1,0)","v":0},"HKD Hong Kong Dollar",{"$f":"IFERROR(VLOOKUP(ROWS($H$2:H55),F:G,2,0),\"\")","v":""},null,{"$f":"IF(ISNUMBER(SEARCH('INSTITUTIONAL VENDOR'!$C$6,K56)),MAX($J$2:J55)+1,0)","v":0},"2250 - Cote D'Ivoire",{"$f":"IFERROR(VLOOKUP(ROWS($L$2:L55),J:K,2,0),\"\")","v":""},"Z005 ECHO: (2) instalments",{"$nulls":4},"033 Cost center",null,null,"2200120 Reconciliation (Japanese Special Account)",null,null,null,"0570B00000 - SOFIA BULGARIA",null,"Y005 within 12 days 2 % cash discount",{"$nulls":5},"142 Eritrea",{"$nulls":7},{"$f":"IF(ISNUMBER(SEARCH('INSTITUTIONAL VENDOR'!$C$35,AP56)),MAX($AO$7:AO55)+1,0)","v":0},"143 Fiji",{"$f":"IFERROR(VLOOKUP(ROWS(AQ$7:$AQ55),AO:AP,2,0),\"\")","v":""},"163 Gibraltar","162 Ghana","Yes"]
[null,null,{"$f":"IF(ISNUMBER(SEARCH('INSTITUTIONAL VENDOR'!$E$12,D57)),MAX($C$1:C56)+1,0)","v":0},"163 Gibraltar",{"$f":"IFERROR(VLOOKUP(ROWS($E$1:E56),C:D,2,0),\"\")","v":""},{"$f":"IF(ISNUMBER(SEARCH('INSTITUTIONAL VENDOR'!$C$31,G57)),MAX($F$2:F56)+1,0)","v":0},"HNL Honduran Lempira",{"$f":"IFERROR(VLOOKUP(ROWS($H$2:H56),F:G,2,0),\"\")","v":""},null,{"$f":"IF(ISNUMBER(SEARCH('INSTITUTIONAL VENDOR'!$C$6,K57)),MAX($J$2:J56)+1,0)","v":0},"2280 - Jamaica",{"$f":"IFERROR(VLOOKUP(ROWS($L$2:L56),J:K,2,0),\"\")","v":""},"Z006 ECHO (80% advance)",{"$nulls":4},"034 Month, cost center",null,null,"2200190 Reconciliation (Other Trust Accounts)",null,null,null,"0600A00000 - MYANMAR",null," within 30 days Due net",{"$nulls":5},"143 Fiji",{"$nulls":7},{"$f":"IF(ISNUMBER(SEARCH('INSTITUTIONAL VENDOR'!$C$35,AP57)),MAX($AO$7:AO56)+1,0)","v":0},"144 Finland",{"$f":"IFERROR(VLOOKUP(ROWS(AQ$7:$AQ56),AO:AP,2,0),\"\")","v":""},"165 Greece","163 Gibraltar","Yes"]
["… Select",null,{"$f":"IF(ISNUMBER(SEARCH('INSTITUTIONAL VENDOR'!$E$12,D58)),MAX($C$1:C57)+1,0)","v":0},"165 Greece",{"$f":"IFERROR(VLOOKUP(ROWS($E$1:E57),C:D,2,0),\"\")","v":""},{"$f":"IF(ISNUMBER(SEARCH('INSTITUTIONAL VENDOR'!$C$31,G58)),MAX($F$2:F57)+1,0)","v":0},"HRK Croatian Kuna",{"$f":"IFERROR(VLOOKUP(ROWS($H$2:H57),F:G,2,0),\"\")","v":""},null,{"$f":"IF(ISNUMBER(SEARCH('INSTITUTIONAL VENDOR'!$C$6,K58)),MAX($J$2:J57)+1,0)","v":0},"2340 - Jordan",{"$f":"IFERROR(VLOOKUP(ROWS($L$2:L57),J:K,2,0),\"\")","v":""},"Z010 Automatic payment block;pay immediately - NY",{"$nulls":4},"036 Order",null,null,"2310110 SAP HR Iwop pension/insurance pre-payments",null,null,null,"0600B00000 - YANGON MYANMAR",null,"Y010 Payment due in 10 days(Without discount)",{"$nulls":5},"144 Finland",{"$nulls":7},{"$f":"IF(ISNUMBER(SEARCH('INSTITUTIONAL VENDOR'!$C$35,AP58)),MAX($AO$7:AO57)+1,0)","v":0},"147 France",{"$f":"IFERROR(VLOOKUP(ROWS(AQ$7:$AQ57),AO:AP,2,0),\"\")","v":""},"168 Guatemala","165 Greece","Yes"]
["Inactive, vendor won't be used anymore.",null,{"$f":"IF(ISNUMBER(SEARCH('INSTITUTIONAL VENDOR'!$E$12,D59)),MAX($C$1:C58)+1,0)","v":0},"168 Guatemala",{"$f":"IFERROR(VLOOKUP(ROWS($E$1:E58),C:D,2,0),\"\")","v":""},{"$f":"IF(ISNUMBER(SEARCH('INSTITUTIONAL VENDOR'!$C$31,G59)),MAX($F$2:F58)+1,0)","v":0},"HTG Haitian Gourde",{"$f":"IFERROR(VLOOKUP(ROWS($H$2:H58),F:G,2,0),\"\")","v":""},null,{"$f":"IF(ISNUMBER(SEARCH('INSTITUTIONAL VENDOR'!$C$6,K59)),MAX($J$2:J58)+1,0)","v":0},"234R - MENA, Jordan",{"$f":"IFERROR(VLOOKUP(ROWS($L$2:L58),J:K,2,0),\"\")","v":""},"Z020 Within 30 days Due net - NY",{"$nulls":4},"037 Currency key",null,null,"2520110 Unapplied Contributions Receipts",null,null,null,"0600C00000 - KALAY",null,"Y020 Payment due in 20 days(Without discount)",{"$nulls":5},"147 France",{"$nulls":7},{"$f":"IF(ISNUMBER(SEARCH('INSTITUTIONAL VENDOR'!$C$35,AP59)),MAX($AO$7:AO58)+1,0)","v":0},"153 Gabon",{"$f":"IFERROR(VLOOKUP(ROWS(AQ$7:$AQ58),AO:AP,2,0),\"\")","v":""},"177 Guinea","168 Guatemala","Yes"]
["Ethical (financial): Clarify further in comments!",null,{"$f":"IF(ISNUMBER(SEARCH('INSTITUTIONAL VENDOR'!$E$12,D60)),MAX($C$1:C59)+1,0)","v":0},"177 Guinea",{"$f":"IFERROR(VLOOKUP(ROWS($E$1:E59),C:D,2,0),\"\")","v":""},{"$f":"IF(ISNUMBER(SEARCH('INSTITUTIONAL VENDOR'!$C$31,G60)),MAX($F$2:F59)+1,0)","v":0},"HUF Hungarian Forint",{"$f":"IFERROR(VLOOKUP(ROWS($H$2:H59),F:G,2,0),\"\")","v":""},null,{"$f":"IF(ISNUMBER(SEARCH('INSTITUTIONAL VENDOR'!$C$6,K60)),MAX($J$2:J59)+1,0)","v":0},"2390 - Kazakhstan",{"$f":"IFERROR(VLOOKUP(ROWS($L$2:L59),J:K,2,0),\"\")","v":""},"Z110 Automatic payment block;pay immediately - CPH",{"$nulls":4},"039 Project number",null,null,"2520112 PSFR Unapp ORR Cont Receipts",null,null,null,"0600D00000 - KENGTUNG",null,"Y100 Payment due in 30 days",{"$nulls":5},"153 Gabon",{"$nulls":7},{"$f":"IF(ISNUMBER(SEARCH('INSTITUTIONAL VENDOR'!$C$35,AP60)),MAX($AO$7:AO59)+1,0)","v":0},"156 Gambia",{"$f":"IFERROR(VLOOKUP(ROWS(AQ$7:$AQ59),AO:AP,2,0),\"\")","v":""},"180 Guyana","177 Guinea","Yes"]
["Ethical (compliance): Clarify further in comments!",null,{"$f":"IF(ISNUMBER(SEARCH('INSTITUTIONAL VENDOR'!$E$12,D61)),MAX($C$1:C60)+1,0)","v":0},"180 Guyana",{"$f":"IFERROR(VLOOKUP(ROWS($E$1:E60),C:D,2,0),\"\")","v":""},{"$f":"IF(ISNUMBER(SEARCH('INSTITUTIONAL VENDOR'!$C$31,G61)),MAX($F$2:F60)+1,0)","v":0},"IDR Indonesian Rupiah",{"$f":"IFERROR(VLOOKUP(ROWS($H$2:H60),F:G,2,0),\"\")","v":""},null,{"$f":"IF(ISNUMBER(SEARCH('INSTITUTIONAL VENDOR'!$C$6,K61)),MAX($J$2:J60)+1,0)","v":0},"2400 - Kenya",{"$f":"IFERROR(VLOOKUP(ROWS($L$2:L60),J:K,2,0),\"\")","v":""},"Z121 3% 15 days, Within 30 days Due net",{"$nulls":4},"055 Fiscal year, month",null,null,"2520120 Unapplied Contributions-in-Kind",null,null,null,"0600E00000 - MANDALAY",null,"Y101 within 29 days 2 % cash discount",{"$nulls":5},"156 Gambia",{"$nulls":7},{"$f":"IF(ISNUMBER(SEARCH('INSTITUTIONAL VENDOR'!$C$35,AP61)),MAX($AO$7:AO60)+1,0)","v":0},"160 Georgia",{"$f":"IFERROR(VLOOKUP(ROWS(AQ$7:$AQ60),AO:AP,2,0),\"\")","v":""},"183 Haiti","180 Guyana","Yes"]
["Duplication: Provide other number in comments!",null,{"$f":"IF(ISNUMBER(SEARCH('INSTITUTIONAL VENDOR'!$E$12,D62)),MAX($C$1:C61)+1,0)","v":0},"183 Haiti",{"$f":"IFERROR(VLOOKUP(ROWS($E$1:E61),C:D,2,0),\"\")","v":""},{"$f":"IF(ISNUMBER(SEARCH('INSTITUTIONAL VENDOR'!$C$31,G62)),MAX($F$2:F61)+1,0)","v":0},"ILS Israeli Shekel",{"$f":"IFERROR(VLOOKUP(ROWS($H$2:H61),F:G,2,0),\"\")","v":""},null,{"$f":"IF(ISNUMBER(SEARCH('INSTITUTIONAL VENDOR'!$C$6,K62)),MAX($J$2:J61)+1,0)","v":0},"240B - Office of Global Innovation",{"$f":"IFERROR(VLOOKUP(ROWS($L$2:L61),J:K,2,0),\"\")","v":""},"Z122 Within 10 days 3 % cash discount",{"$nulls":4},"060 Test0",null,null,"2520130 Cash Advances from Donors",null,null,null,"0600F00000 - MAWLAMYINE",null," within 30 days Due net",{"$nulls":5},"160 Georgia",{"$nulls":7},{"$f":"IF(ISNUMBER(SEARCH('INSTITUTIONAL VENDOR'!$C$35,AP62)),MAX($AO$7:AO61)+1,0)","v":0},"162 Ghana",{"$f":"IFERROR(VLOOKUP(ROWS(AQ$7:$AQ61),AO:AP,2,0),\"\")","v":""},"186 Honduras","183 Haiti","Yes"]
["Other: Clarify further in comments!",null,{"$f":"IF(ISNUMBER(SEARCH('INSTITUTIONAL VENDOR'!$E$12,D63)),MAX($C$1:C62)+1,0)","v":0},"186 Honduras",{"$f":"IFERROR(VLOOKUP(ROWS($E$1:E62),C:D,2,0),\"\")","v":""},{"$f":"IF(ISNUMBER(SEARCH('INSTITUTIONAL VENDOR'!$C$31,G63)),MAX($F$2:F62)+1,0)","v":0},"INR Indian Rupee",{"$f":"IFERROR(VLOOKUP(ROWS($H$2:H62),F:G,2,0),\"\")","v":""},null,{"$f":"IF(ISNUMBER(SEARCH('INSTITUTIONAL VENDOR'!$C$6,K63)),MAX($J$2:J62)+1,0)","v":0},"240R - ESARO, Kenya",{"$f":"IFERROR(VLOOKUP(ROWS($L$2:L62),J:K,2,0),\"\")","v":""},"Z123 Within 15 days 2.5% cash discount",{"$nulls":4},"061 Test1",null,null,"2530110 Funds to be Returned",null,null,null,"0600G00000 - MYEIK",null,"Y104 within 7 days 0.5 % cash discount",{"$nulls":5},"162 Ghana",{"$nulls":7},{"$f":"IF(ISNUMBER(SEARCH('INSTITUTIONAL VENDOR'!$C$35,AP63)),MAX($AO$7:AO62)+1,0)","v":0},"163 Gibraltar",{"$f":"IFERROR(VLOOKUP(ROWS(AQ$7:$AQ62),AO:AP,2,0),\"\")","v":""},"195 Hungary","186 Honduras","Yes"]
[null,null,{"$f":"IF(ISNUMBER(SEARCH('INSTITUTIONAL VENDOR'!$E$12,D64)),MAX($C$1:C63)+1,0)","v":0},"195 Hungary",{"$f":"IFERROR(VLOOKUP(ROWS($E$1:E63),C:D,2,0),\"\")","v":""},{"$f":"IF(ISNUMBER(SEARCH('INSTITUTIONAL VENDOR'!$C$31,G64)),MAX($F$2:F63)+1,0)","v":0},"IQD Iraqui Dinar",{"$f":"IFERROR(VLOOKUP(ROWS($H$2:H63),F:G,2,0),\"\")","v":""},null,{"$f":"IF(ISNUMBER(SEARCH('INSTITUTIONAL VENDOR'!$C$6,K64)),MAX($J$2:J63)+1,0)","v":0},"2450 - Republic of Kyrgyzstan",{"$f":"IFERROR(VLOOKUP(ROWS($L$2:L63),J:K,2,0),\"\")","v":""},"Z124 Within 20 days 2% cash discount",{"$nulls":4},"065 Test5",{"$nulls":6},"0600H00000 - MYITKYINA",null," within 30 days Due net",{"$nulls":5},"165 Greece",{"$nulls":7},{"$f":"IF(ISNUMBER(SEARCH('INSTITUTIONAL VENDOR'!$C$35,AP64)),MAX($AO$7:AO63)+1,0)","v":0},"165 Greece",{"$f":"IFERROR(VLOOKUP(ROWS(AQ$7:$AQ63),AO:AP,2,0),\"\")","v":""},"198 Iceland","195 Hungary","No"]
[null,null,{"$f":"IF(ISNUMBER(SEARCH('INSTITUTIONAL VENDOR'!$E$12,D65)),MAX($C$1:C64)+1,0)","v":0},"198 Iceland",{"$f":"IFERROR(VLOOKUP(ROWS($E$1:E64),C:D,2,0),\"\")","v":""},{"$f":"IF(ISNUMBER(SEARCH('INSTITUTIONAL VENDOR'!$C$31,G65)),MAX($F$2:F64)+1,0)","v":0},"IRR Iranian Rial",{"$f":"IFERROR(VLOOKUP(ROWS($H$2:H64),F:G,2,0),\"\")","v":""},null,{"$f":"IF(ISNUMBER(SEARCH('INSTITUTIONAL VENDOR'!$C$6,K65)),MAX($J$2:J64)+1,0)","v":0},"2460 - Lao People's Dem Rep.",{"$f":"IFERROR(VLOOKUP(ROWS($L$2:L64),J:K,2,0),\"\")","v":""},"Z125 10 days 3%, 15 days 2.5%, 30 days net",{"$nulls":4},"101 Cash discnt clearing",{"$nulls":6},"0600I00000 - TAUNGGYI",null,"Y105 within 7 days 0.7 % cash discount",{"$nulls":5},"168 Guatemala",{"$nulls":7},{"$f":"IF(ISNUMBER(SEARCH('INSTITUTIONAL VENDOR'!$C$35,AP65)),MAX($AO$7:AO64)+1,0)","v":0},"168 Guatemala",{"$f":"IFERROR(VLOOKUP(ROWS(AQ$7:$AQ64),AO:AP,2,0),\"\")","v":""},"204 India","198 Iceland","No"]
[null,null,{"$f":"IF(ISNUMBER(SEARCH('INSTITUTIONAL VENDOR'!$E$12,D66)),MAX($C$1:C65)+1,0)","v":0},"204 India",{"$f":"IFERROR(VLOOKUP(ROWS($E$1:E65),C:D,2,0),\"\")","v":""},{"$f":"IF(ISNUMBER(SEARCH('INSTITUTIONAL VENDOR'!$C$31,G66)),MAX($F$2:F65)+1,0)","v":0},"ISK Iceland Krona",{"$f":"IFERROR(VLOOKUP(ROWS($H$2:H65),F:G,2,0),\"\")","v":""},null,{"$f":"IF(ISNUMBER(SEARCH('INSTITUTIONAL VENDOR'!$C$6,K66)),MAX($J$2:J65)+1,0)","v":0},"2490 - Lebanon",{"$f":"IFERROR(VLOOKUP(ROWS($L$2:L65),J:K,2,0),\"\")","v":""},"Z126 15 days 2.5%, 20 days 2%, 30 days net",{"$nulls":4},"Z01 WBS Element",null,null,"0001 Four-level dunning notice, every two weeks",null,null,null,"0600J00000 - MAUNGDAW",null," within 30 days Due net",{"$nulls":5},"177 Guinea",{"$nulls":7},{"$f":"IF(ISNUMBER(SEARCH('INSTITUTIONAL VENDOR'!$C$35,AP66)),MAX($AO$7:AO65)+1,0)","v":0},"177 Guinea",{"$f":"IFERROR(VLOOKUP(ROWS(AQ$7:$AQ65),AO:AP,2,0),\"\")","v":""},"207 Indonesia","204 India","Yes"]
[null,null,{"$f":"IF(ISNUMBER(SEARCH('INSTITUTIONAL VENDOR'!$E$12,D67)),MAX($C$1:C66)+1,0)","v":0},"207 Indonesia",{"$f":"IFERROR(VLOOKUP(ROWS($E$1:E66),C:D,2,0),\"\")","v":""},{"$f":"IF(ISNUMBER(SEARCH('INSTITUTIONAL VENDOR'!$C$31,G67)),MAX($F$2:F66)+1,0)","v":0},"JMD Jamaican Dollar",{"$f":"IFERROR(VLOOKUP(ROWS($H$2:H66),F:G,2,0),\"\")","v":""},null,{"$f":"IF(ISNUMBER(SEARCH('INSTITUTIONAL VENDOR'!$C$6,K67)),MAX($J$2:J66)+1,0)","v":0},"2520 - Lesotho",{"$f":"IFERROR(VLOOKUP(ROWS($L$2:L66),J:K,2,0),\"\")","v":""},"Z127 10 days 3%, 20 days 2%, 30 days net",{"$nulls":4},"Z02 Reference Number",null,null,"0003 Payment reminder, every two weeks",null,null,null,"0600K00000 - LASHIO",null,"Y106 within 10 days 1 % cash discount",{"$nulls":5},"180 Guyana",{"$nulls":7},{"$f":"IF(ISNUMBER(SEARCH('INSTITUTIONAL VENDOR'!$C$35,AP67)),MAX($AO$7:AO66)+1,0)","v":0},"180 Guyana",{"$f":"IFERROR(VLOOKUP(ROWS(AQ$7:$AQ66),AO:AP,2,0),\"\")","v":""},"210 Iran","207 Indonesia","Yes"]
[null,null,{"$f":"IF(ISNUMBER(SEARCH('INSTITUTIONAL VENDOR'!$E$12,D68)),MAX($C$1:C67)+1,0)","v":0},"210 Iran",{"$f":"IFERROR(VLOOKUP(ROWS($E$1:E67),C:D,2,0),\"\")","v":""},{"$f":"IF(ISNUMBER(SEARCH('INSTITUTIONAL VENDOR'!$C$31,G68)),MAX($F$2:F67)+1,0)","v":0},"JOD Jordanian Dinar",{"$f":"IFERROR(VLOOKUP(ROWS($H$2:H67),F:G,2,0),\"\")","v":""},null,{"$f":"IF(ISNUMBER(SEARCH('INSTITUTIONAL VENDOR'!$C$6,K68)),MAX($J$2:J67)+1,0)","v":0},"2550 - Liberia",{"$f":"IFERROR(VLOOKUP(ROWS($L$2:L67),J:K,2,0),\"\")","v":""},"Z910 30 days net (direct disbursement by partner)",{"$nulls":4},"Z03 Material Number",null,null,"Z001 Contrib/Sp. Accts. (BAs: GR/SF/ERR/SA), Cust Grp G/I/N/O/U",null,null,null,"0600L00000 - HAKHA MYANMAR",null," within 30 days Due net",{"$nulls":5},"183 Haiti",{"$nulls":7},{"$f":"IF(ISNUMBER(SEARCH('INSTITUTIONAL VENDOR'!$C$35,AP68)),MAX($AO$7:AO67)+1,0)","v":0},"183 Haiti",{"$f":"IFERROR(VLOOKUP(ROWS(AQ$7:$AQ67),AO:AP,2,0),\"\")","v":""},"213 Iraq","210 Iran","Yes"]
[null,null,{"$f":"IF(ISNUMBER(SEARCH('INSTITUTIONAL VENDOR'!$E$12,D69)),MAX($C$1:C68)+1,0)","v":0},"213 Iraq",{"$f":"IFERROR(VLOOKUP(ROWS($E$1:E68),C:D,2,0),\"\")","v":""},{"$f":"IF(ISNUMBER(SEARCH('INSTITUTIONAL VENDOR'!$C$31,G69)),MAX($F$2:F68)+1,0)","v":0},"JPY Japanese Yen",{"$f":"IFERROR(VLOOKUP(ROWS($H$2:H68),F:G,2,0),\"\")","v":""},null,{"$f":"IF(ISNUMBER(SEARCH('INSTITUTIONAL VENDOR'!$C$6,K69)),MAX($J$2:J68)+1,0)","v":0},"2580 - Libya",{"$f":"IFERROR(VLOOKUP(ROWS($L$2:L68),J:K,2,0),\"\")","v":""},"Z911 Donations - Not for disbursement",{"$nulls":4},"Z05 Fund",null,null,"Z002 Private sector (BAs GR/SF/ER) Cust. groups C/F",null,null,null,"0600M00000 - DAWEI MYANMAR",null,"Y107 within 10 days 1.5 % cash discount",{"$nulls":5},"186 Honduras",{"$nulls":7},{"$f":"IF(ISNUMBER(SEARCH('INSTITUTIONAL VENDOR'!$C$35,AP69)),MAX($AO$7:AO68)+1,0)","v":0},"186 Honduras",{"$f":"IFERROR(VLOOKUP(ROWS(AQ$7:$AQ68),AO:AP,2,0),\"\")","v":""},"216 Ireland","213 Iraq","Yes"]
[null,null,{"$f":"IF(ISNUMBER(SEARCH('INSTITUTIONAL VENDOR'!$E$12,D70)),MAX($C$1:C69)+1,0)","v":0},"216 Ireland",{"$f":"IFERROR(VLOOKUP(ROWS($E$1:E69),C:D,2,0),\"\")","v":""},{"$f":"IF(ISNUMBER(SEARCH('INSTITUTIONAL VENDOR'!$C$31,G70)),MAX($F$2:F69)+1,0)","v":0},"KES Kenyan Shilling",{"$f":"IFERROR(VLOOKUP(ROWS($H$2:H69),F:G,2,0),\"\")","v":""},null,{"$f":"IF(ISNUMBER(SEARCH('INSTITUTIONAL VENDOR'!$C$6,K70)),MAX($J$2:J69)+1,0)","v":0},"2660 - North Macedonia",{"$f":"IFERROR(VLOOKUP(ROWS($L$2:L69),J:K,2,0),\"\")","v":""},"Z913 Prepaid",{"$nulls":4},"Z06 Doc.no. L/Item,F/yr",{"$nulls":6},"0610A00000 - BURUNDI",null," within 30 days Due net",{"$nulls":5},"195 Hungary",{"$nulls":7},{"$f":"IF(ISNUMBER(SEARCH('INSTITUTIONAL VENDOR'!$C$35,AP70)),MAX($AO$7:AO69)+1,0)","v":0},"195 Hungary",{"$f":"IFERROR(VLOOKUP(ROWS(AQ$7:$AQ69),AO:AP,2,0),\"\")","v":""},"219 Israel","216 Ireland","No"]
[null,null,{"$f":"IF(ISNUMBER(SEARCH('INSTITUTIONAL VENDOR'!$E$12,D71)),MAX($C$1:C70)+1,0)","v":0},"219 Israel",{"$f":"IFERROR(VLOOKUP(ROWS($E$1:E70),C:D,2,0),\"\")","v":""},{"$f":"IF(ISNUMBER(SEARCH('INSTITUTIONAL VENDOR'!$C$31,G71)),MAX($F$2:F70)+1,0)","v":0},"KGS Kyrgyzstan Som",{"$f":"IFERROR(VLOOKUP(ROWS($H$2:H70),F:G,2,0),\"\")","v":""},null,{"$f":"IF(ISNUMBER(SEARCH('INSTITUTIONAL VENDOR'!$C$6,K71)),MAX($J$2:J70)+1,0)","v":0},"2670 - Madagascar",{"$f":"IFERROR(VLOOKUP(ROWS($L$2:L70),J:K,2,0),\"\")","v":""},"Z914 For Pre-payments",{"$nulls":4},"Z31 Funds recd/Customer",null,null,"A1 Chief Field Accounts",null,null,null,"0610B00000 - BUJUMBURA BURUNDI",null,"Y108 within 10 days 2 % cash discount",{"$nulls":5},"198 Iceland",{"$nulls":7},{"$f":"IF(ISNUMBER(SEARCH('INSTITUTIONAL VENDOR'!$C$35,AP71)),MAX($AO$7:AO70)+1,0)","v":0},"198 Iceland",{"$f":"IFERROR(VLOOKUP(ROWS(AQ$7:$AQ70),AO:AP,2,0),\"\")","v":""},"222 Italy","219 Israel","No"]
[null,null,{"$f":"IF(ISNUMBER(SEARCH('INSTITUTIONAL VENDOR'!$E$12,D72)),MAX($C$1:C71)+1,0)","v":0},"222 Italy",{"$f":"IFERROR(VLOOKUP(ROWS($E$1:E71),C:D,2,0),\"\")","v":""},{"$f":"IF(ISNUMBER(SEARCH('INSTITUTIONAL VENDOR'!$C$31,G72)),MAX($F$2:F71)+1,0)","v":0},"KHR Cambodian Riel",{"$f":"IFERROR(VLOOKUP(ROWS($H$2:H71),F:G,2,0),\"\")","v":""},null,{"$f":"IF(ISNUMBER(SEARCH('INSTITUTIONAL VENDOR'!$C$6,K72)),MAX($J$2:J71)+1,0)","v":0},"2690 - Malawi",{"$f":"IFERROR(VLOOKUP(ROWS($L$2:L71),J:K,2,0),\"\")","v":""},"Z915 30 days net (direct disbursement by KfW)",{"$nulls":7},"A2 Accounts Officer",null,null,null,"0610C00000 - GITEGA",null," within 30 days Due net",{"$nulls":5},"204 India",{"$nulls":7},{"$f":"IF(ISNUMBER(SEARCH('INSTITUTIONAL VENDOR'!$C$35,AP72)),MAX($AO$7:AO71)+1,0)","v":0},"204 India",{"$f":"IFERROR(VLOOKUP(ROWS(AQ$7:$AQ71),AO:AP,2,0),\"\")","v":""},"225 Cote d'Ivoire","222 Italy","No"]
[null,null,{"$f":"IF(ISNUMBER(SEARCH('INSTITUTIONAL VENDOR'!$E$12,D73)),MAX($C$1:C72)+1,0)","v":0},"225 Cote d'Ivoire",{"$f":"IFERROR(VLOOKUP(ROWS($E$1:E72),C:D,2,0),\"\")","v":""},{"$f":"IF(ISNUMBER(SEARCH('INSTITUTIONAL VENDOR'!$C$31,G73)),MAX($F$2:F72)+1,0)","v":0},"KMF Comoros Franc",{"$f":"IFERROR(VLOOKUP(ROWS($H$2:H72),F:G,2,0),\"\")","v":""},null,{"$f":"IF(ISNUMBER(SEARCH('INSTITUTIONAL VENDOR'!$C$6,K73)),MAX($J$2:J72)+1,0)","v":0},"2700 - Malaysia",{"$f":"IFERROR(VLOOKUP(ROWS($L$2:L72),J:K,2,0),\"\")","v":""},"0002 within 14 days 3 % cash discount",{"$nulls":7},"A3 Accounts Officer",null,null,null,"0630A00000 - BELARUS",null,"Y109 within 10 days 3 % cash discount",{"$nulls":5},"207 Indonesia",{"$nulls":7},{"$f":"IF(ISNUMBER(SEARCH('INSTITUTIONAL VENDOR'!$C$35,AP73)),MAX($AO$7:AO72)+1,0)","v":0},"207 Indonesia",{"$f":"IFERROR(VLOOKUP(ROWS(AQ$7:$AQ72),AO:AP,2,0),\"\")","v":""},"228 Jamaica","225 Cote d'Ivoire","Yes"]
[null,null,{"$f":"IF(ISNUMBER(SEARCH('INSTITUTIONAL VENDOR'!$E$12,D74)),MAX($C$1:C73)+1,0)","v":0},"228 Jamaica",{"$f":"IFERROR(VLOOKUP(ROWS($E$1:E73),C:D,2,0),\"\")","v":""},{"$f":"IF(ISNUMBER(SEARCH('INSTITUTIONAL VENDOR'!$C$31,G74)),MAX($F$2:F73)+1,0)","v":0},"KPW01 KPW",{"$f":"IFERROR(VLOOKUP(ROWS($H$2:H73),F:G,2,0),\"\")","v":""},null,{"$f":"IF(ISNUMBER(SEARCH('INSTITUTIONAL VENDOR'!$C$6,K74)),MAX($J$2:J73)+1,0)","v":0},"2740 - Maldives",{"$f":"IFERROR(VLOOKUP(ROWS($L$2:L73),J:K,2,0),\"\")","v":""}," within 30 days 2 % cash discount",{"$nulls":7},"C0 Chief Contributions Unit",null,null,null,"0630B00000 - MINSK BELARUS",null," within 30 days Due net",{"$nulls":5},"210 Iran",{"$nulls":7},{"$f":"IF(ISNUMBER(SEARCH('INSTITUTIONAL VENDOR'!$C$35,AP74)),MAX($AO$7:AO73)+1,0)","v":0},"210 Iran",{"$f":"IFERROR(VLOOKUP(ROWS(AQ$7:$AQ73),AO:AP,2,0),\"\")","v":""},"231 Japan","228 Jamaica","Yes"]
[null,null,{"$f":"IF(ISNUMBER(SEARCH('INSTITUTIONAL VENDOR'!$E$12,D75)),MAX($C$1:C74)+1,0)","v":0},"231 Japan",{"$f":"IFERROR(VLOOKUP(ROWS($E$1:E74),C:D,2,0),\"\")","v":""},{"$f":"IF(ISNUMBER(SEARCH('INSTITUTIONAL VENDOR'!$C$31,G75)),MAX($F$2:F74)+1,0)","v":0},"KRW South Korean Won",{"$f":"IFERROR(VLOOKUP(ROWS($H$2:H74),F:G,2,0),\"\")","v":""},null,{"$f":"IF(ISNUMBER(SEARCH('INSTITUTIONAL VENDOR'!$C$6,K75)),MAX($J$2:J74)+1,0)","v":0},"2760 - Mali",{"$f":"IFERROR(VLOOKUP(ROWS($L$2:L74),J:K,2,0),\"\")","v":""}," within 45 days Due net",{"$nulls":7},"C1 Contributions Team 1",null,null,null,"0660A00000 - CAMBODIA",null,"Y110 within 15 days 0.5 % cash discount",{"$nulls":5},"213 Iraq",{"$nulls":7},{"$f":"IF(ISNUMBER(SEARCH('INSTITUTIONAL VENDOR'!$C$35,AP75)),MAX($AO$7:AO74)+1,0)","v":0},"213 Iraq",{"$f":"IFERROR(VLOOKUP(ROWS(AQ$7:$AQ74),AO:AP,2,0),\"\")","v":""},"234 Jordan","231 Japan","No"]
[null,null,{"$f":"IF(ISNUMBER(SEARCH('INSTITUTIONAL VENDOR'!$E$12,D76)),MAX($C$1:C75)+1,0)","v":0},"234 Jordan",{"$f":"IFERROR(VLOOKUP(ROWS($E$1:E75),C:D,2,0),\"\")","v":""},{"$f":"IF(ISNUMBER(SEARCH('INSTITUTIONAL VENDOR'!$C$31,G76)),MAX($F$2:F75)+1,0)","v":0},"KWD Kuwaiti Dinar",{"$f":"IFERROR(VLOOKUP(ROWS($H$2:H75),F:G,2,0),\"\")","v":""},null,{"$f":"IF(ISNUMBER(SEARCH('INSTITUTIONAL VENDOR'!$C$6,K76)),MAX($J$2:J75)+1,0)","v":0},"2820 - Mauritania",{"$f":"IFERROR(VLOOKUP(ROWS($L$2:L75),J:K,2,0),\"\")","v":""},"0003 For incoming invoices until 15 of the month",{"$nulls":7},"C2 Contributions Team 2",null,null,null,"0660B00000 - PHNOM PENH CAMBODIA",null," within 30 days Due net",{"$nulls":5},"216 Ireland",{"$nulls":7},{"$f":"IF(ISNUMBER(SEARCH('INSTITUTIONAL VENDOR'!$C$35,AP76)),MAX($AO$7:AO75)+1,0)","v":0},"216 Ireland",{"$f":"IFERROR(VLOOKUP(ROWS(AQ$7:$AQ75),AO:AP,2,0),\"\")","v":""},"239 Kazakhstan","234 Jordan","Yes"]
[null,null,{"$f":"IF(ISNUMBER(SEARCH('INSTITUTIONAL VENDOR'!$E$12,D77)),MAX($C$1:C76)+1,0)","v":0},"239 Kazakhstan",{"$f":"IFERROR(VLOOKUP(ROWS($E$1:E76),C:D,2,0),\"\")","v":""},{"$f":"IF(ISNUMBER(SEARCH('INSTITUTIONAL VENDOR'!$C$31,G77)),MAX($F$2:F76)+1,0)","v":0},"KYD Cayman Dollar",{"$f":"IFERROR(VLOOKUP(ROWS($H$2:H76),F:G,2,0),\"\")","v":""},null,{"$f":"IF(ISNUMBER(SEARCH('INSTITUTIONAL VENDOR'!$C$6,K77)),MAX($J$2:J76)+1,0)","v":0},"2850 - Mexico",{"$f":"IFERROR(VLOOKUP(ROWS($L$2:L76),J:K,2,0),\"\")","v":""}," within 14 days 2 % cash discount",{"$nulls":7},"C3 Contributions Team 3",null,null,null,"0660C00000 - BATTAMBANG",null,"Y111 within 15 days 0.55 % cash discount",{"$nulls":5},"219 Israel",{"$nulls":7},{"$f":"IF(ISNUMBER(SEARCH('INSTITUTIONAL VENDOR'!$C$35,AP77)),MAX($AO$7:AO76)+1,0)","v":0},"219 Israel",{"$f":"IFERROR(VLOOKUP(ROWS(AQ$7:$AQ76),AO:AP,2,0),\"\")","v":""},"240 Kenya","239 Kazakhstan","Yes"]
[null,null,{"$f":"IF(ISNUMBER(SEARCH('INSTITUTIONAL VENDOR'!$E$12,D78)),MAX($C$1:C77)+1,0)","v":0},"240 Kenya",{"$f":"IFERROR(VLOOKUP(ROWS($E$1:E77),C:D,2,0),\"\")","v":""},{"$f":"IF(ISNUMBER(SEARCH('INSTITUTIONAL VENDOR'!$C$31,G78)),MAX($F$2:F77)+1,0)","v":0},"KZT Kazakhstani Tenge",{"$f":"IFERROR(VLOOKUP(ROWS($H$2:H77),F:G,2,0),\"\")","v":""},null,{"$f":"IF(ISNUMBER(SEARCH('INSTITUTIONAL VENDOR'!$C$6,K78)),MAX($J$2:J77)+1,0)","v":0},"2880 - Mongolia",{"$f":"IFERROR(VLOOKUP(ROWS($L$2:L77),J:K,2,0),\"\")","v":""}," within 30 days 1.5 % cash discount",{"$nulls":7},"D1 Comptroller",null,null,null,"0660D00000 - PREAH SIHANOUK",null," within 30 days Due net",{"$nulls":5},"222 Italy",{"$nulls":7},{"$f":"IF(ISNUMBER(SEARCH('INSTITUTIONAL VENDOR'!$C$35,AP78)),MAX($AO$7:AO77)+1,0)","v":0},"222 Italy",{"$f":"IFERROR(VLOOKUP(ROWS(AQ$7:$AQ77),AO:AP,2,0),\"\")","v":""},"243 Kuwait","240 Kenya","Yes"]
[null,null,{"$f":"IF(ISNUMBER(SEARCH('INSTITUTIONAL VENDOR'!$E$12,D79)),MAX($C$1:C78)+1,0)","v":0},"243 Kuwait",{"$f":"IFERROR(VLOOKUP(ROWS($E$1:E78),C:D,2,0),\"\")","v":""},{"$f":"IF(ISNUMBER(SEARCH('INSTITUTIONAL VENDOR'!$C$31,G79)),MAX($F$2:F78)+1,0)","v":0},"LAK Laotian Kip",{"$f":"IFERROR(VLOOKUP(ROWS($H$2:H78),F:G,2,0),\"\")","v":""},null,{"$f":"IF(ISNUMBER(SEARCH('INSTITUTIONAL VENDOR'!$C$6,K79)),MAX($J$2:J78)+1,0)","v":0},"2910 - Morocco",{"$f":"IFERROR(VLOOKUP(ROWS($L$2:L78),J:K,2,0),\"\")","v":""}," within 45 days Due net",{"$nulls":7},"D2 DFAM/Deputy Director, Accts",null,null,null,"0660E00000 - SIEM REAP",null,"Y112 within 15 days 0.6 % cash discount",{"$nulls":5},"225 Cote d'Ivoire",{"$nulls":7},{"$f":"IF(ISNUMBER(SEARCH('INSTITUTIONAL VENDOR'!$C$35,AP79)),MAX($AO$7:AO78)+1,0)","v":0},"225 Cote d'Ivoire",{"$f":"IFERROR(VLOOKUP(ROWS(AQ$7:$AQ78),AO:AP,2,0),\"\")","v":""},"245 Kyrgyzstan","243 Kuwait","Yes"]
[null,null,{"$f":"IF(ISNUMBER(SEARCH('INSTITUTIONAL VENDOR'!$E$12,D80)),MAX($C$1:C79)+1,0)","v":0},"245 Kyrgyzstan",{"$f":"IFERROR(VLOOKUP(ROWS($E$1:E79),C:D,2,0),\"\")","v":""},{"$f":"IF(ISNUMBER(SEARCH('INSTITUTIONAL VENDOR'!$C$31,G80)),MAX($F$2:F79)+1,0)","v":0},"LBP Lebanese Pound",{"$f":"IFERROR(VLOOKUP(ROWS($H$2:H79),F:G,2,0),\"\")","v":""},null,{"$f":"IF(ISNUMBER(SEARCH('INSTITUTIONAL VENDOR'!$C$6,K80)),MAX($J$2:J79)+1,0)","v":0},"2970 - Nepal",{"$f":"IFERROR(VLOOKUP(ROWS($L$2:L79),J:K,2,0),\"\")","v":""}," Baseline date on 30 of the month",{"$nulls":7},"D3 DFAM/Deputy Director,Budget",null,null,null,"0660F00000 - KAMPONG CHAM",null," within 30 days Due net",{"$nulls":5},"228 Jamaica",{"$nulls":7},{"$f":"IF(ISNUMBER(SEARCH('INSTITUTIONAL VENDOR'!$C$35,AP80)),MAX($AO$7:AO79)+1,0)","v":0},"228 Jamaica",{"$f":"IFERROR(VLOOKUP(ROWS(AQ$7:$AQ79),AO:AP,2,0),\"\")","v":""},"246 Lao,Peo.Dem.Rep","245 Kyrgyzstan","Yes"]
[null,null,{"$f":"IF(ISNUMBER(SEARCH('INSTITUTIONAL VENDOR'!$E$12,D81)),MAX($C$1:C80)+1,0)","v":0},"246 Lao,Peo.Dem.Rep",{"$f":"IFERROR(VLOOKUP(ROWS($E$1:E80),C:D,2,0),\"\")","v":""},{"$f":"IF(ISNUMBER(SEARCH('INSTITUTIONAL VENDOR'!$C$31,G81)),MAX($F$2:F80)+1,0)","v":0},"LKR Sri Lankan Rupee",{"$f":"IFERROR(VLOOKUP(ROWS($H$2:H80),F:G,2,0),\"\")","v":""},null,{"$f":"IF(ISNUMBER(SEARCH('INSTITUTIONAL VENDOR'!$C$6,K81)),MAX($J$2:J80)+1,0)","v":0},"297R - ROSA, Nepal",{"$f":"IFERROR(VLOOKUP(ROWS($L$2:L80),J:K,2,0),\"\")","v":""}," For incoming invoices until End  of the month",{"$nulls":7},"D4 DFAM/Deputy Director,Finance",null,null,null,"0660G00000 - PHNOM PENH ZONE",null,"Y113 within 15 days 1 % cash discount",{"$nulls":5},"231 Japan",{"$nulls":7},{"$f":"IF(ISNUMBER(SEARCH('INSTITUTIONAL VENDOR'!$C$35,AP81)),MAX($AO$7:AO80)+1,0)","v":0},"231 Japan",{"$f":"IFERROR(VLOOKUP(ROWS(AQ$7:$AQ80),AO:AP,2,0),\"\")","v":""},"247 Latvia","246 Lao,Peo.Dem.Rep","Yes"]
[null,null,{"$f":"IF(ISNUMBER(SEARCH('INSTITUTIONAL VENDOR'!$E$12,D82)),MAX($C$1:C81)+1,0)","v":0},"247 Latvia",{"$f":"IFERROR(VLOOKUP(ROWS($E$1:E81),C:D,2,0),\"\")","v":""},{"$f":"IF(ISNUMBER(SEARCH('INSTITUTIONAL VENDOR'!$C$31,G82)),MAX($F$2:F81)+1,0)","v":0},"LRD Liberian Dollar",{"$f":"IFERROR(VLOOKUP(ROWS($H$2:H81),F:G,2,0),\"\")","v":""},null,{"$f":"IF(ISNUMBER(SEARCH('INSTITUTIONAL VENDOR'!$C$6,K82)),MAX($J$2:J81)+1,0)","v":0},"3120 - Nicaragua",{"$f":"IFERROR(VLOOKUP(ROWS($L$2:L81),J:K,2,0),\"\")","v":""}," within 14 days 2.125 % cash discount",{"$nulls":7},"E1 Vacant",null,null,null,"0690A00000 - REPUBLIC OF CAMEROON",null," within 30 days Due net",{"$nulls":5},"234 Jordan",{"$nulls":7},{"$f":"IF(ISNUMBER(SEARCH('INSTITUTIONAL VENDOR'!$C$35,AP82)),MAX($AO$7:AO81)+1,0)","v":0},"234 Jordan",{"$f":"IFERROR(VLOOKUP(ROWS(AQ$7:$AQ81),AO:AP,2,0),\"\")","v":""},"249 Lebanon","247 Latvia","No"]
[null,null,{"$f":"IF(ISNUMBER(SEARCH('INSTITUTIONAL VENDOR'!$E$12,D83)),MAX($C$1:C82)+1,0)","v":0},"249 Lebanon",{"$f":"IFERROR(VLOOKUP(ROWS($E$1:E82),C:D,2,0),\"\")","v":""},{"$f":"IF(ISNUMBER(SEARCH('INSTITUTIONAL VENDOR'!$C$31,G83)),MAX($F$2:F82)+1,0)","v":0},"LSL Lesotho Loti",{"$f":"IFERROR(VLOOKUP(ROWS($H$2:H82),F:G,2,0),\"\")","v":""},null,{"$f":"IF(ISNUMBER(SEARCH('INSTITUTIONAL VENDOR'!$C$6,K83)),MAX($J$2:J82)+1,0)","v":0},"3180 - Niger",{"$f":"IFERROR(VLOOKUP(ROWS($L$2:L82),J:K,2,0),\"\")","v":""}," within 30 days 1.5 % cash discount",{"$nulls":7},"E2 K. Hulshof",null,null,null,"0690B00000 - YAOUNDE CAMEROON",null,"Y114 within 15 days 2 % cash discount",{"$nulls":5},"239 Kazakhstan",{"$nulls":7},{"$f":"IF(ISNUMBER(SEARCH('INSTITUTIONAL VENDOR'!$C$35,AP83)),MAX($AO$7:AO82)+1,0)","v":0},"239 Kazakhstan",{"$f":"IFERROR(VLOOKUP(ROWS(AQ$7:$AQ82),AO:AP,2,0),\"\")","v":""},"252 Lesotho","249 Lebanon","Yes"]
[null,null,{"$f":"IF(ISNUMBER(SEARCH('INSTITUTIONAL VENDOR'!$E$12,D84)),MAX($C$1:C83)+1,0)","v":0},"252 Lesotho",{"$f":"IFERROR(VLOOKUP(ROWS($E$1:E83),C:D,2,0),\"\")","v":""},{"$f":"IF(ISNUMBER(SEARCH('INSTITUTIONAL VENDOR'!$C$31,G84)),MAX($F$2:F83)+1,0)","v":0},"LTL Lithuanian Lita",{"$f":"IFERROR(VLOOKUP(ROWS($H$2:H83),F:G,2,0),\"\")","v":""},null,{"$f":"IF(ISNUMBER(SEARCH('INSTITUTIONAL VENDOR'!$C$6,K84)),MAX($J$2:J83)+1,0)","v":0},"3210 - Nigeria",{"$f":"IFERROR(VLOOKUP(ROWS($L$2:L83),J:K,2,0),\"\")","v":""}," within 45 days Due net",{"$nulls":7},"F0 Funding Monitoring Officer",null,null,null,"0690C00000 - DOUALA",null," within 30 days Due net",{"$nulls":5},"240 Kenya",{"$nulls":7},{"$f":"IF(ISNUMBER(SEARCH('INSTITUTIONAL VENDOR'!$C$35,AP84)),MAX($AO$7:AO83)+1,0)","v":0},"240 Kenya",{"$f":"IFERROR(VLOOKUP(ROWS(AQ$7:$AQ83),AO:AP,2,0),\"\")","v":""},"255 Liberia","252 Lesotho","Yes"]
[null,null,{"$f":"IF(ISNUMBER(SEARCH('INSTITUTIONAL VENDOR'!$E$12,D85)),MAX($C$1:C84)+1,0)","v":0},"255 Liberia",{"$f":"IFERROR(VLOOKUP(ROWS($E$1:E84),C:D,2,0),\"\")","v":""},{"$f":"IF(ISNUMBER(SEARCH('INSTITUTIONAL VENDOR'!$C$31,G85)),MAX($F$2:F84)+1,0)","v":0},"LVL Lativian Lat",{"$f":"IFERROR(VLOOKUP(ROWS($H$2:H84),F:G,2,0),\"\")","v":""},null,{"$f":"IF(ISNUMBER(SEARCH('INSTITUTIONAL VENDOR'!$C$6,K85)),MAX($J$2:J84)+1,0)","v":0},"3300 - Pakistan",{"$f":"IFERROR(VLOOKUP(ROWS($L$2:L84),J:K,2,0),\"\")","v":""}," Baseline date on 15 of next month",{"$nulls":7},"F1 Funding Cluster No. 1",null,null,null,"0690D00000 - NGAOUNDERE",null,"Z000 Up-front payment",{"$nulls":5},"243 Kuwait",{"$nulls":7},{"$f":"IF(ISNUMBER(SEARCH('INSTITUTIONAL VENDOR'!$C$35,AP85)),MAX($AO$7:AO84)+1,0)","v":0},"243 Kuwait",{"$f":"IFERROR(VLOOKUP(ROWS(AQ$7:$AQ84),AO:AP,2,0),\"\")","v":""},"258 Libya","255 Liberia","Yes"]
[null,null,{"$f":"IF(ISNUMBER(SEARCH('INSTITUTIONAL VENDOR'!$E$12,D86)),MAX($C$1:C85)+1,0)","v":0},"258 Libya",{"$f":"IFERROR(VLOOKUP(ROWS($E$1:E85),C:D,2,0),\"\")","v":""},{"$f":"IF(ISNUMBER(SEARCH('INSTITUTIONAL VENDOR'!$C$31,G86)),MAX($F$2:F85)+1,0)","v":0},"LYD Libyan Dinar",{"$f":"IFERROR(VLOOKUP(ROWS($H$2:H85),F:G,2,0),\"\")","v":""},null,{"$f":"IF(ISNUMBER(SEARCH('INSTITUTIONAL VENDOR'!$C$6,K86)),MAX($J$2:J85)+1,0)","v":0},"3330 - Panama",{"$f":"IFERROR(VLOOKUP(ROWS($L$2:L85),J:K,2,0),\"\")","v":""},"0004 within 14 days 3 % cash discount",{"$nulls":7},"F2 Funding Cluster No. 2",null,null,null,"0690E00000 - BERTOUA",null,"Z001 PFP: Baseline equal to NC's fiscal year-end",{"$nulls":5},"245 Kyrgyzstan",{"$nulls":7},{"$f":"IF(ISNUMBER(SEARCH('INSTITUTIONAL VENDOR'!$C$35,AP86)),MAX($AO$7:AO85)+1,0)","v":0},"245 Kyrgyzstan",{"$f":"IFERROR(VLOOKUP(ROWS(AQ$7:$AQ85),AO:AP,2,0),\"\")","v":""},"260 Lithuania","258 Libya","Yes"]
[null,null,{"$f":"IF(ISNUMBER(SEARCH('INSTITUTIONAL VENDOR'!$E$12,D87)),MAX($C$1:C86)+1,0)","v":0},"260 Lithuania",{"$f":"IFERROR(VLOOKUP(ROWS($E$1:E86),C:D,2,0),\"\")","v":""},{"$f":"IF(ISNUMBER(SEARCH('INSTITUTIONAL VENDOR'!$C$31,G87)),MAX($F$2:F86)+1,0)","v":0},"MAD Moroccan Dirham",{"$f":"IFERROR(VLOOKUP(ROWS($H$2:H86),F:G,2,0),\"\")","v":""},null,{"$f":"IF(ISNUMBER(SEARCH('INSTITUTIONAL VENDOR'!$C$6,K87)),MAX($J$2:J86)+1,0)","v":0},"333R - LACRO, Panama",{"$f":"IFERROR(VLOOKUP(ROWS($L$2:L86),J:K,2,0),\"\")","v":""}," within 30 days 1 % cash discount",{"$nulls":7},"F3 Funding Cluster No. 3",null,null,null,"0690F00000 - GAROUA CAMEROON",null,"Z002 (4) equal quarterly payments",{"$nulls":5},"246 Lao, People's Dem. Rep.",{"$nulls":7},{"$f":"IF(ISNUMBER(SEARCH('INSTITUTIONAL VENDOR'!$C$35,AP87)),MAX($AO$7:AO86)+1,0)","v":0},"246 Lao,Peo.Dem.Rep",{"$f":"IFERROR(VLOOKUP(ROWS(AQ$7:$AQ86),AO:AP,2,0),\"\")","v":""},"264 Luxembourg","260 Lithuania","No"]
[null,null,{"$f":"IF(ISNUMBER(SEARCH('INSTITUTIONAL VENDOR'!$E$12,D88)),MAX($C$1:C87)+1,0)","v":0},"264 Luxembourg",{"$f":"IFERROR(VLOOKUP(ROWS($E$1:E87),C:D,2,0),\"\")","v":""},{"$f":"IF(ISNUMBER(SEARCH('INSTITUTIONAL VENDOR'!$C$31,G88)),MAX($F$2:F87)+1,0)","v":0},"MDL Moldavan Leu",{"$f":"IFERROR(VLOOKUP(ROWS($H$2:H87),F:G,2,0),\"\")","v":""},null,{"$f":"IF(ISNUMBER(SEARCH('INSTITUTIONAL VENDOR'!$C$6,K88)),MAX($J$2:J87)+1,0)","v":0},"3360 - Paraguay",{"$f":"IFERROR(VLOOKUP(ROWS($L$2:L87),J:K,2,0),\"\")","v":""}," within 60 days Due net",{"$nulls":7},"F4 Funding Cluster No. 4",null,null,null,"0690G00000 - MAROUA CAMEROON",null,"Z003 Reimbursement of expenses",{"$nulls":5},"247 Latvia",{"$nulls":7},{"$f":"IF(ISNUMBER(SEARCH('INSTITUTIONAL VENDOR'!$C$35,AP88)),MAX($AO$7:AO87)+1,0)","v":0},"247 Latvia",{"$f":"IFERROR(VLOOKUP(ROWS(AQ$7:$AQ87),AO:AP,2,0),\"\")","v":""},"266 Macedonia, TFYR","264 Luxembourg","No"]
[null,null,{"$f":"IF(ISNUMBER(SEARCH('INSTITUTIONAL VENDOR'!$E$12,D89)),MAX($C$1:C88)+1,0)","v":0},"266 Macedonia, TFYR",{"$f":"IFERROR(VLOOKUP(ROWS($E$1:E88),C:D,2,0),\"\")","v":""},{"$f":"IF(ISNUMBER(SEARCH('INSTITUTIONAL VENDOR'!$C$31,G89)),MAX($F$2:F88)+1,0)","v":0},"MGA Malagasy Ariary",{"$f":"IFERROR(VLOOKUP(ROWS($H$2:H88),F:G,2,0),\"\")","v":""},null,{"$f":"IF(ISNUMBER(SEARCH('INSTITUTIONAL VENDOR'!$C$6,K89)),MAX($J$2:J88)+1,0)","v":0},"3380 - Congo",{"$f":"IFERROR(VLOOKUP(ROWS($L$2:L88),J:K,2,0),\"\")","v":""},"0005 within 10 days 2 % cash discount",{"$nulls":7},"F5 Funding Cluster No. 5",null,null,null,"0750A00000 - CENTRAL AFRICAN REP.",null,"Z004 (2) six-months payment",{"$nulls":5},"249 Lebanon",{"$nulls":7},{"$f":"IF(ISNUMBER(SEARCH('INSTITUTIONAL VENDOR'!$C$35,AP89)),MAX($AO$7:AO88)+1,0)","v":0},"249 Lebanon",{"$f":"IFERROR(VLOOKUP(ROWS(AQ$7:$AQ88),AO:AP,2,0),\"\")","v":""},"267 Madagascar","266 Macedonia, TFYR","Yes"]
[null,null,{"$f":"IF(ISNUMBER(SEARCH('INSTITUTIONAL VENDOR'!$E$12,D90)),MAX($C$1:C89)+1,0)","v":0},"267 Madagascar",{"$f":"IFERROR(VLOOKUP(ROWS($E$1:E89),C:D,2,0),\"\")","v":""},{"$f":"IF(ISNUMBER(SEARCH('INSTITUTIONAL VENDOR'!$C$31,G90)),MAX($F$2:F89)+1,0)","v":0},"MKD Macedonian Denar",{"$f":"IFERROR(VLOOKUP(ROWS($H$2:H89),F:G,2,0),\"\")","v":""},null,{"$f":"IF(ISNUMBER(SEARCH('INSTITUTIONAL VENDOR'!$C$6,K90)),MAX($J$2:J89)+1,0)","v":0},"3390 - Peru",{"$f":"IFERROR(VLOOKUP(ROWS($L$2:L89),J:K,2,0),\"\")","v":""}," within 30 days 1 % cash discount",{"$nulls":7},"F6 Funding Cluster No. 6",null,null,null,"0750B00000 - BANGUI CAR",null,"Z005 ECHO: (2) instalments",{"$nulls":5},"252 Lesotho",{"$nulls":7},{"$f":"IF(ISNUMBER(SEARCH('INSTITUTIONAL VENDOR'!$C$35,AP90)),MAX($AO$7:AO89)+1,0)","v":0},"252 Lesotho",{"$f":"IFERROR(VLOOKUP(ROWS(AQ$7:$AQ89),AO:AP,2,0),\"\")","v":""},"269 Malawi","267 Madagascar","Yes"]
[null,null,{"$f":"IF(ISNUMBER(SEARCH('INSTITUTIONAL VENDOR'!$E$12,D91)),MAX($C$1:C90)+1,0)","v":0},"269 Malawi",{"$f":"IFERROR(VLOOKUP(ROWS($E$1:E90),C:D,2,0),\"\")","v":""},{"$f":"IF(ISNUMBER(SEARCH('INSTITUTIONAL VENDOR'!$C$31,G91)),MAX($F$2:F90)+1,0)","v":0},"MMK Myanmar Kyat",{"$f":"IFERROR(VLOOKUP(ROWS($H$2:H90),F:G,2,0),\"\")","v":""},null,{"$f":"IF(ISNUMBER(SEARCH('INSTITUTIONAL VENDOR'!$C$6,K91)),MAX($J$2:J90)+1,0)","v":0},"3420 - Philippines",{"$f":"IFERROR(VLOOKUP(ROWS($L$2:L90),J:K,2,0),\"\")","v":""}," within 50 days Due net",{"$nulls":7},"F7 Deputy Director, PFO",null,null,null,"0750C00000 - BOSSANGOA CAR",null,"Z006 ECHO (80% advance)",{"$nulls":5},"255 Liberia",{"$nulls":7},{"$f":"IF(ISNUMBER(SEARCH('INSTITUTIONAL VENDOR'!$C$35,AP91)),MAX($AO$7:AO90)+1,0)","v":0},"255 Liberia",{"$f":"IFERROR(VLOOKUP(ROWS(AQ$7:$AQ90),AO:AP,2,0),\"\")","v":""},"270 Malaysia","269 Malawi","Yes"]
[null,null,{"$f":"IF(ISNUMBER(SEARCH('INSTITUTIONAL VENDOR'!$E$12,D92)),MAX($C$1:C91)+1,0)","v":0},"270 Malaysia",{"$f":"IFERROR(VLOOKUP(ROWS($E$1:E91),C:D,2,0),\"\")","v":""},{"$f":"IF(ISNUMBER(SEARCH('INSTITUTIONAL VENDOR'!$C$31,G92)),MAX($F$2:F91)+1,0)","v":0},"MNT Mongolian Tugrik",{"$f":"IFERROR(VLOOKUP(ROWS($H$2:H91),F:G,2,0),\"\")","v":""},null,{"$f":"IF(ISNUMBER(SEARCH('INSTITUTIONAL VENDOR'!$C$6,K92)),MAX($J$2:J91)+1,0)","v":0},"3660 - Romania",{"$f":"IFERROR(VLOOKUP(ROWS($L$2:L91),J:K,2,0),\"\")","v":""},"0006 Before End of the month 4 % cash discount",{"$nulls":7},"F8 Director, PFO",null,null,null,"0750D00000 - KANGA BANDORO CAR",null,"Z007 Payment due in (3) months",{"$nulls":5},"258 Libyan Arab Jamahiriya",{"$nulls":7},{"$f":"IF(ISNUMBER(SEARCH('INSTITUTIONAL VENDOR'!$C$35,AP92)),MAX($AO$7:AO91)+1,0)","v":0},"258 Libya",{"$f":"IFERROR(VLOOKUP(ROWS(AQ$7:$AQ91),AO:AP,2,0),\"\")","v":""},"274 Maldives,Rep of","270 Malaysia","Yes"]
[null,null,{"$f":"IF(ISNUMBER(SEARCH('INSTITUTIONAL VENDOR'!$E$12,D93)),MAX($C$1:C92)+1,0)","v":0},"274 Maldives,Rep of",{"$f":"IFERROR(VLOOKUP(ROWS($E$1:E92),C:D,2,0),\"\")","v":""},{"$f":"IF(ISNUMBER(SEARCH('INSTITUTIONAL VENDOR'!$C$31,G93)),MAX($F$2:F92)+1,0)","v":0},"MOP Macao Pataca",{"$f":"IFERROR(VLOOKUP(ROWS($H$2:H92),F:G,2,0),\"\")","v":""},null,{"$f":"IF(ISNUMBER(SEARCH('INSTITUTIONAL VENDOR'!$C$6,K93)),MAX($J$2:J92)+1,0)","v":0},"3750 - Rwanda",{"$f":"IFERROR(VLOOKUP(ROWS($L$2:L92),J:K,2,0),\"\")","v":""}," Before 15 of the next month ;; 2 % cash discount",{"$nulls":7},"S1 Chief Operations, SD",null,null,null,"0750E00000 - BAMBARI CAR",null,"Z008 Payment due in (9) months",{"$nulls":5},"260 Lithuania",{"$nulls":7},{"$f":"IF(ISNUMBER(SEARCH('INSTITUTIONAL VENDOR'!$C$35,AP93)),MAX($AO$7:AO92)+1,0)","v":0},"260 Lithuania",{"$f":"IFERROR(VLOOKUP(ROWS(AQ$7:$AQ92),AO:AP,2,0),\"\")","v":""},"276 Mali","274 Maldives,Rep of","Yes"]
[null,null,{"$f":"IF(ISNUMBER(SEARCH('INSTITUTIONAL VENDOR'!$E$12,D94)),MAX($C$1:C93)+1,0)","v":0},"276 Mali",{"$f":"IFERROR(VLOOKUP(ROWS($E$1:E93),C:D,2,0),\"\")","v":""},{"$f":"IF(ISNUMBER(SEARCH('INSTITUTIONAL VENDOR'!$C$31,G94)),MAX($F$2:F93)+1,0)","v":0},"MRU Mauritanian Ouguiya",{"$f":"IFERROR(VLOOKUP(ROWS($H$2:H93),F:G,2,0),\"\")","v":""},null,{"$f":"IF(ISNUMBER(SEARCH('INSTITUTIONAL VENDOR'!$C$6,K94)),MAX($J$2:J93)+1,0)","v":0},"3780 - Saudi Arabia",{"$f":"IFERROR(VLOOKUP(ROWS($L$2:L93),J:K,2,0),\"\")","v":""}," Before 15 in 2 months Due net",{"$nulls":7},"S2 Finance Officer, SD",null,null,null,"0750F00000 - BOUAR CAR",null,"Z009 Payment due in (12) months",{"$nulls":5},"264 Luxembourg",{"$nulls":7},{"$f":"IF(ISNUMBER(SEARCH('INSTITUTIONAL VENDOR'!$C$35,AP94)),MAX($AO$7:AO93)+1,0)","v":0},"264 Luxembourg",{"$f":"IFERROR(VLOOKUP(ROWS(AQ$7:$AQ93),AO:AP,2,0),\"\")","v":""},"279 Malta","276 Mali","Yes"]
[null,null,{"$f":"IF(ISNUMBER(SEARCH('INSTITUTIONAL VENDOR'!$E$12,D95)),MAX($C$1:C94)+1,0)","v":0},"279 Malta",{"$f":"IFERROR(VLOOKUP(ROWS($E$1:E94),C:D,2,0),\"\")","v":""},{"$f":"IF(ISNUMBER(SEARCH('INSTITUTIONAL VENDOR'!$C$31,G95)),MAX($F$2:F94)+1,0)","v":0},"MUR Mauritius Rupee",{"$f":"IFERROR(VLOOKUP(ROWS($H$2:H94),F:G,2,0),\"\")","v":""},null,{"$f":"IF(ISNUMBER(SEARCH('INSTITUTIONAL VENDOR'!$C$6,K95)),MAX($J$2:J94)+1,0)","v":0},"3810 - Senegal",{"$f":"IFERROR(VLOOKUP(ROWS($L$2:L94),J:K,2,0),\"\")","v":""},"0007 within 14 days 4 % cash discount",{"$nulls":7},"S3 Finance Officer, SD",null,null,null,"0750G00000 - NDELE CAR",null,"Z010 Automatic payment block;pay immediately - NY",{"$nulls":5},"266 TFYR of Macedonia",{"$nulls":7},{"$f":"IF(ISNUMBER(SEARCH('INSTITUTIONAL VENDOR'!$C$35,AP95)),MAX($AO$7:AO94)+1,0)","v":0},"266 Macedonia, TFYR",{"$f":"IFERROR(VLOOKUP(ROWS(AQ$7:$AQ94),AO:AP,2,0),\"\")","v":""},"282 Mauritania","279 Malta","No"]
[null,null,{"$f":"IF(ISNUMBER(SEARCH('INSTITUTIONAL VENDOR'!$E$12,D96)),MAX($C$1:C95)+1,0)","v":0},"282 Mauritania",{"$f":"IFERROR(VLOOKUP(ROWS($E$1:E95),C:D,2,0),\"\")","v":""},{"$f":"IF(ISNUMBER(SEARCH('INSTITUTIONAL VENDOR'!$C$31,G96)),MAX($F$2:F95)+1,0)","v":0},"MVR Maldive Rufiyaa",{"$f":"IFERROR(VLOOKUP(ROWS($H$2:H95),F:G,2,0),\"\")","v":""},null,{"$f":"IF(ISNUMBER(SEARCH('INSTITUTIONAL VENDOR'!$C$6,K96)),MAX($J$2:J95)+1,0)","v":0},"381R - WCARO, Senegal",{"$f":"IFERROR(VLOOKUP(ROWS($L$2:L95),J:K,2,0),\"\")","v":""}," within 30 days 2 % cash discount",{"$nulls":7},"S4 Finance Officer, SD",null,null,null,"0750H00000 - ZEMIO CAR",null,"Z020 Within 30 days Due net - NY",{"$nulls":5},"267 Madagascar",{"$nulls":7},{"$f":"IF(ISNUMBER(SEARCH('INSTITUTIONAL VENDOR'!$C$35,AP96)),MAX($AO$7:AO95)+1,0)","v":0},"267 Madagascar",{"$f":"IFERROR(VLOOKUP(ROWS(AQ$7:$AQ95),AO:AP,2,0),\"\")","v":""},"283 Mauritius","282 Mauritania","Yes"]
[null,null,{"$f":"IF(ISNUMBER(SEARCH('INSTITUTIONAL VENDOR'!$E$12,D97)),MAX($C$1:C96)+1,0)","v":0},"283 Mauritius",{"$f":"IFERROR(VLOOKUP(ROWS($E$1:E96),C:D,2,0),\"\")","v":""},{"$f":"IF(ISNUMBER(SEARCH('INSTITUTIONAL VENDOR'!$C$31,G97)),MAX($F$2:F96)+1,0)","v":0},"MWK Malawi Kwacha",{"$f":"IFERROR(VLOOKUP(ROWS($H$2:H96),F:G,2,0),\"\")","v":""},null,{"$f":"IF(ISNUMBER(SEARCH('INSTITUTIONAL VENDOR'!$C$6,K97)),MAX($J$2:J96)+1,0)","v":0},"3900 - Sierra Leone",{"$f":"IFERROR(VLOOKUP(ROWS($L$2:L96),J:K,2,0),\"\")","v":""}," within 60 days Due net",{"$nulls":11},"0780A00000 - SRI LANKA",null,"Z110 Automatic payment block;pay immediately - CPH",{"$nulls":5},"269 Malawi",{"$nulls":7},{"$f":"IF(ISNUMBER(SEARCH('INSTITUTIONAL VENDOR'!$C$35,AP97)),MAX($AO$7:AO96)+1,0)","v":0},"269 Malawi",{"$f":"IFERROR(VLOOKUP(ROWS(AQ$7:$AQ96),AO:AP,2,0),\"\")","v":""},"285 Mexico","283 Mauritius","Yes"]
[null,null,{"$f":"IF(ISNUMBER(SEARCH('INSTITUTIONAL VENDOR'!$E$12,D98)),MAX($C$1:C97)+1,0)","v":0},"285 Mexico",{"$f":"IFERROR(VLOOKUP(ROWS($E$1:E97),C:D,2,0),\"\")","v":""},{"$f":"IF(ISNUMBER(SEARCH('INSTITUTIONAL VENDOR'!$C$31,G98)),MAX($F$2:F97)+1,0)","v":0},"MXN Mexican Peso",{"$f":"IFERROR(VLOOKUP(ROWS($H$2:H97),F:G,2,0),\"\")","v":""},null,{"$f":"IF(ISNUMBER(SEARCH('INSTITUTIONAL VENDOR'!$C$6,K98)),MAX($J$2:J97)+1,0)","v":0},"3920 - Somalia",{"$f":"IFERROR(VLOOKUP(ROWS($L$2:L97),J:K,2,0),\"\")","v":""},"0008 Payable immediately Due net",{"$nulls":7},"… Select",null,null,null,"0780B00000 - COLOMBO SRI LANKA",null,"Z120 Within 30 days Due net",{"$nulls":5},"270 Malaysia",{"$nulls":7},{"$f":"IF(ISNUMBER(SEARCH('INSTITUTIONAL VENDOR'!$C$35,AP98)),MAX($AO$7:AO97)+1,0)","v":0},"270 Malaysia",{"$f":"IFERROR(VLOOKUP(ROWS(AQ$7:$AQ97),AO:AP,2,0),\"\")","v":""},"288 Mongolia","285 Mexico","Yes"]
[null,null,{"$f":"IF(ISNUMBER(SEARCH('INSTITUTIONAL VENDOR'!$E$12,D99)),MAX($C$1:C98)+1,0)","v":0},"288 Mongolia",{"$f":"IFERROR(VLOOKUP(ROWS($E$1:E98),C:D,2,0),\"\")","v":""},{"$f":"IF(ISNUMBER(SEARCH('INSTITUTIONAL VENDOR'!$C$31,G99)),MAX($F$2:F98)+1,0)","v":0},"MYR Malaysian Ringgit",{"$f":"IFERROR(VLOOKUP(ROWS($H$2:H98),F:G,2,0),\"\")","v":""},null,{"$f":"IF(ISNUMBER(SEARCH('INSTITUTIONAL VENDOR'!$C$6,K99)),MAX($J$2:J98)+1,0)","v":0},"3930 - South Africa",{"$f":"IFERROR(VLOOKUP(ROWS($L$2:L98),J:K,2,0),\"\")","v":""}," Baseline date on End of the month",{"$nulls":7},"Full Time",null,null,null,"0780C00000 - BATTILCALOA",null,"Z121 3% 15 days, Within 30 days Due net",{"$nulls":5},"274 Maldives",{"$nulls":7},{"$f":"IF(ISNUMBER(SEARCH('INSTITUTIONAL VENDOR'!$C$35,AP99)),MAX($AO$7:AO98)+1,0)","v":0},"274 Maldives,Rep of",{"$f":"IFERROR(VLOOKUP(ROWS(AQ$7:$AQ98),AO:AP,2,0),\"\")","v":""},"291 Morocco","288 Mongolia","Yes"]
[null,null,{"$f":"IF(ISNUMBER(SEARCH('INSTITUTIONAL VENDOR'!$E$12,D100)),MAX($C$1:C99)+1,0)","v":0},"291 Morocco",{"$f":"IFERROR(VLOOKUP(ROWS($E$1:E99),C:D,2,0),\"\")","v":""},{"$f":"IF(ISNUMBER(SEARCH('INSTITUTIONAL VENDOR'!$C$31,G100)),MAX($F$2:F99)+1,0)","v":0},"MZN Mozambique Metical (new)",{"$f":"IFERROR(VLOOKUP(ROWS($H$2:H99),F:G,2,0),\"\")","v":""},null,{"$f":"IF(ISNUMBER(SEARCH('INSTITUTIONAL VENDOR'!$C$6,K100)),MAX($J$2:J99)+1,0)","v":0},"4020 - Sudan",{"$f":"IFERROR(VLOOKUP(ROWS($L$2:L99),J:K,2,0),\"\")","v":""},"0009 For incoming invoices until 15 of the month",{"$nulls":7},"Part Time",null,null,null,"0780D00000 - JAFFNA",null,"Z122 Within 10 days 3 % cash discount",{"$nulls":5},"276 Mali",{"$nulls":7},{"$f":"IF(ISNUMBER(SEARCH('INSTITUTIONAL VENDOR'!$C$35,AP100)),MAX($AO$7:AO99)+1,0)","v":0},"276 Mali",{"$f":"IFERROR(VLOOKUP(ROWS(AQ$7:$AQ99),AO:AP,2,0),\"\")","v":""},"297 Nepal","291 Morocco","Yes"]
[null,null,{"$f":"IF(ISNUMBER(SEARCH('INSTITUTIONAL VENDOR'!$E$12,D101)),MAX($C$1:C100)+1,0)","v":0},"297 Nepal",{"$f":"IFERROR(VLOOKUP(ROWS($E$1:E100),C:D,2,0),\"\")","v":""},{"$f":"IF(ISNUMBER(SEARCH('INSTITUTIONAL VENDOR'!$C$31,G101)),MAX($F$2:F100)+1,0)","v":0},"NAD Namibian dollar",{"$f":"IFERROR(VLOOKUP(ROWS($H$2:H100),F:G,2,0),\"\")","v":""},null,{"$f":"IF(ISNUMBER(SEARCH('INSTITUTIONAL VENDOR'!$C$6,K101)),MAX($J$2:J100)+1,0)","v":0},"4030 - Eswatini",{"$f":"IFERROR(VLOOKUP(ROWS($L$2:L100),J:K,2,0),\"\")","v":""}," Before 15 of the next month ;; 2.125 % cash disc",{"$nulls":11},"0780E00000 - VAVUNIYA",null,"Z123 Within 15 days 2.5% cash discount",{"$nulls":5},"279 Malta",{"$nulls":7},{"$f":"IF(ISNUMBER(SEARCH('INSTITUTIONAL VENDOR'!$C$35,AP101)),MAX($AO$7:AO100)+1,0)","v":0},"279 Malta",{"$f":"IFERROR(VLOOKUP(ROWS(AQ$7:$AQ100),AO:AP,2,0),\"\")","v":""},"300 Netherlands","297 Nepal","Yes"]
[null,null,{"$f":"IF(ISNUMBER(SEARCH('INSTITUTIONAL VENDOR'!$E$12,D102)),MAX($C$1:C101)+1,0)","v":0},"300 Netherlands",{"$f":"IFERROR(VLOOKUP(ROWS($E$1:E101),C:D,2,0),\"\")","v":""},{"$f":"IF(ISNUMBER(SEARCH('INSTITUTIONAL VENDOR'!$C$31,G102)),MAX($F$2:F101)+1,0)","v":0},"NGN Nigerian Naira",{"$f":"IFERROR(VLOOKUP(ROWS($H$2:H101),F:G,2,0),\"\")","v":""},null,{"$f":"IF(ISNUMBER(SEARCH('INSTITUTIONAL VENDOR'!$C$6,K102)),MAX($J$2:J101)+1,0)","v":0},"4040 - South Sudan",{"$f":"IFERROR(VLOOKUP(ROWS($L$2:L101),J:K,2,0),\"\")","v":""}," Before End of the next month ;; Due net",{"$nulls":11},"0780F00000 - KILINOCHCHI",null,"Z124 Within 20 days 2% cash discount",{"$nulls":5},"282 Mauritania",{"$nulls":7},{"$f":"IF(ISNUMBER(SEARCH('INSTITUTIONAL VENDOR'!$C$35,AP102)),MAX($AO$7:AO101)+1,0)","v":0},"282 Mauritania",{"$f":"IFERROR(VLOOKUP(ROWS(AQ$7:$AQ101),AO:AP,2,0),\"\")","v":""},"309 New Zealand","300 Netherlands","No"]
[null,null,{"$f":"IF(ISNUMBER(SEARCH('INSTITUTIONAL VENDOR'!$E$12,D103)),MAX($C$1:C102)+1,0)","v":0},"309 New Zealand",{"$f":"IFERROR(VLOOKUP(ROWS($E$1:E102),C:D,2,0),\"\")","v":""},{"$f":"IF(ISNUMBER(SEARCH('INSTITUTIONAL VENDOR'!$C$31,G103)),MAX($F$2:F102)+1,0)","v":0},"NIO Nicaraguan Cordoba Oro",{"$f":"IFERROR(VLOOKUP(ROWS($H$2:H102),F:G,2,0),\"\")","v":""},null,{"$f":"IF(ISNUMBER(SEARCH('INSTITUTIONAL VENDOR'!$C$6,K103)),MAX($J$2:J102)+1,0)","v":0},"4140 - Syria",{"$f":"IFERROR(VLOOKUP(ROWS($L$2:L102),J:K,2,0),\"\")","v":""}," For incoming invoices until End  of the month",{"$nulls":11},"0810A00000 - CHAD",null,"Z125 10 days 3%, 15 days 2.5%, 30 days net",{"$nulls":5},"283 Mauritius",{"$nulls":7},{"$f":"IF(ISNUMBER(SEARCH('INSTITUTIONAL VENDOR'!$C$35,AP103)),MAX($AO$7:AO102)+1,0)","v":0},"283 Mauritius",{"$f":"IFERROR(VLOOKUP(ROWS(AQ$7:$AQ102),AO:AP,2,0),\"\")","v":""},"312 Nicaragua","309 New Zealand","Yes"]
[null,null,{"$f":"IF(ISNUMBER(SEARCH('INSTITUTIONAL VENDOR'!$E$12,D104)),MAX($C$1:C103)+1,0)","v":0},"312 Nicaragua",{"$f":"IFERROR(VLOOKUP(ROWS($E$1:E103),C:D,2,0),\"\")","v":""},{"$f":"IF(ISNUMBER(SEARCH('INSTITUTIONAL VENDOR'!$C$31,G104)),MAX($F$2:F103)+1,0)","v":0},"NOK Norwegian Krone",{"$f":"IFERROR(VLOOKUP(ROWS($H$2:H103),F:G,2,0),\"\")","v":""},null,{"$f":"IF(ISNUMBER(SEARCH('INSTITUTIONAL VENDOR'!$C$6,K104)),MAX($J$2:J103)+1,0)","v":0},"4150 - Tajikistan",{"$f":"IFERROR(VLOOKUP(ROWS($L$2:L103),J:K,2,0),\"\")","v":""}," Before End of the next month ;; 2.125 % cash dis",{"$nulls":11},"0810B00000 - N'DJAMENA CHAD",null,"Z126 15 days 2.5%, 20 days 2%, 30 days net",{"$nulls":5},"285 Mexico",{"$nulls":7},{"$f":"IF(ISNUMBER(SEARCH('INSTITUTIONAL VENDOR'!$C$35,AP104)),MAX($AO$7:AO103)+1,0)","v":0},"285 Mexico",{"$f":"IFERROR(VLOOKUP(ROWS(AQ$7:$AQ103),AO:AP,2,0),\"\")","v":""},"318 Niger","312 Nicaragua","Yes"]
[null,null,{"$f":"IF(ISNUMBER(SEARCH('INSTITUTIONAL VENDOR'!$E$12,D105)),MAX($C$1:C104)+1,0)","v":0},"318 Niger",{"$f":"IFERROR(VLOOKUP(ROWS($E$1:E104),C:D,2,0),\"\")","v":""},{"$f":"IF(ISNUMBER(SEARCH('INSTITUTIONAL VENDOR'!$C$31,G105)),MAX($F$2:F104)+1,0)","v":0},"NPR Nepalese Rupee",{"$f":"IFERROR(VLOOKUP(ROWS($H$2:H104),F:G,2,0),\"\")","v":""},null,{"$f":"IF(ISNUMBER(SEARCH('INSTITUTIONAL VENDOR'!$C$6,K105)),MAX($J$2:J104)+1,0)","v":0},"4200 - Thailand",{"$f":"IFERROR(VLOOKUP(ROWS($L$2:L104),J:K,2,0),\"\")","v":""}," Before 15 in 2 months Due net",{"$nulls":11},"0810C00000 - ABECHE",null,"Z127 10 days 3%, 20 days 2%, 30 days net",{"$nulls":5},"288 Mongolia",{"$nulls":7},{"$f":"IF(ISNUMBER(SEARCH('INSTITUTIONAL VENDOR'!$C$35,AP105)),MAX($AO$7:AO104)+1,0)","v":0},"288 Mongolia",{"$f":"IFERROR(VLOOKUP(ROWS(AQ$7:$AQ104),AO:AP,2,0),\"\")","v":""},"321 Nigeria","318 Niger","Yes"]
[null,null,{"$f":"IF(ISNUMBER(SEARCH('INSTITUTIONAL VENDOR'!$E$12,D106)),MAX($C$1:C105)+1,0)","v":0},"321 Nigeria",{"$f":"IFERROR(VLOOKUP(ROWS($E$1:E105),C:D,2,0),\"\")","v":""},{"$f":"IF(ISNUMBER(SEARCH('INSTITUTIONAL VENDOR'!$C$31,G106)),MAX($F$2:F105)+1,0)","v":0},"NZD New Zealand Dollar",{"$f":"IFERROR(VLOOKUP(ROWS($H$2:H105),F:G,2,0),\"\")","v":""},null,{"$f":"IF(ISNUMBER(SEARCH('INSTITUTIONAL VENDOR'!$C$6,K106)),MAX($J$2:J105)+1,0)","v":0},"420R - EAPRO, Thailand",{"$f":"IFERROR(VLOOKUP(ROWS($L$2:L105),J:K,2,0),\"\")","v":""},"0010 Payable immediately Due net",{"$nulls":11},"0810D00000 - MOUNDOU",null,"Z901 Payable immediately Due net",{"$nulls":5},"291 Morocco",{"$nulls":7},{"$f":"IF(ISNUMBER(SEARCH('INSTITUTIONAL VENDOR'!$C$35,AP106)),MAX($AO$7:AO105)+1,0)","v":0},"291 Morocco",{"$f":"IFERROR(VLOOKUP(ROWS(AQ$7:$AQ105),AO:AP,2,0),\"\")","v":""},"324 Norway","321 Nigeria","Yes"]
[null,null,{"$f":"IF(ISNUMBER(SEARCH('INSTITUTIONAL VENDOR'!$E$12,D107)),MAX($C$1:C106)+1,0)","v":0},"324 Norway",{"$f":"IFERROR(VLOOKUP(ROWS($E$1:E106),C:D,2,0),\"\")","v":""},{"$f":"IF(ISNUMBER(SEARCH('INSTITUTIONAL VENDOR'!$C$31,G107)),MAX($F$2:F106)+1,0)","v":0},"OMR Omani Rial",{"$f":"IFERROR(VLOOKUP(ROWS($H$2:H106),F:G,2,0),\"\")","v":""},null,{"$f":"IF(ISNUMBER(SEARCH('INSTITUTIONAL VENDOR'!$C$6,K107)),MAX($J$2:J106)+1,0)","v":0},"4230 - Togo",{"$f":"IFERROR(VLOOKUP(ROWS($L$2:L106),J:K,2,0),\"\")","v":""}," Baseline date on 10 of next month",{"$nulls":11},"0810E00000 - MONGO",null,"Z902 Upon receipt of invoice",{"$nulls":5},"297 Nepal",{"$nulls":7},{"$f":"IF(ISNUMBER(SEARCH('INSTITUTIONAL VENDOR'!$C$35,AP107)),MAX($AO$7:AO106)+1,0)","v":0},"297 Nepal",{"$f":"IFERROR(VLOOKUP(ROWS(AQ$7:$AQ106),AO:AP,2,0),\"\")","v":""},"330 Pakistan","324 Norway","No"]
[null,null,{"$f":"IF(ISNUMBER(SEARCH('INSTITUTIONAL VENDOR'!$E$12,D108)),MAX($C$1:C107)+1,0)","v":0},"330 Pakistan",{"$f":"IFERROR(VLOOKUP(ROWS($E$1:E107),C:D,2,0),\"\")","v":""},{"$f":"IF(ISNUMBER(SEARCH('INSTITUTIONAL VENDOR'!$C$31,G108)),MAX($F$2:F107)+1,0)","v":0},"PAB Panamanian Balboa",{"$f":"IFERROR(VLOOKUP(ROWS($H$2:H107),F:G,2,0),\"\")","v":""},null,{"$f":"IF(ISNUMBER(SEARCH('INSTITUTIONAL VENDOR'!$C$6,K108)),MAX($J$2:J107)+1,0)","v":0},"4320 - Tunisia",{"$f":"IFERROR(VLOOKUP(ROWS($L$2:L107),J:K,2,0),\"\")","v":""},"0011 within 10 days 3 % cash discount",{"$nulls":7},"… Select",null,null,null,"0810F00000 - MAO",null,"Z903 Due 10 days after receipt of invoice",{"$nulls":5},"300 Netherlands",{"$nulls":7},{"$f":"IF(ISNUMBER(SEARCH('INSTITUTIONAL VENDOR'!$C$35,AP108)),MAX($AO$7:AO107)+1,0)","v":0},"300 Netherlands",{"$f":"IFERROR(VLOOKUP(ROWS(AQ$7:$AQ107),AO:AP,2,0),\"\")","v":""},"333 Panama","330 Pakistan","Yes"]
[null,null,{"$f":"IF(ISNUMBER(SEARCH('INSTITUTIONAL VENDOR'!$E$12,D109)),MAX($C$1:C108)+1,0)","v":0},"333 Panama",{"$f":"IFERROR(VLOOKUP(ROWS($E$1:E108),C:D,2,0),\"\")","v":""},{"$f":"IF(ISNUMBER(SEARCH('INSTITUTIONAL VENDOR'!$C$31,G109)),MAX($F$2:F108)+1,0)","v":0},"PEN Peruvian Nuevo Sol",{"$f":"IFERROR(VLOOKUP(ROWS($H$2:H108),F:G,2,0),\"\")","v":""},null,{"$f":"IF(ISNUMBER(SEARCH('INSTITUTIONAL VENDOR'!$C$6,K109)),MAX($J$2:J108)+1,0)","v":0},"4350 - Turkey",{"$f":"IFERROR(VLOOKUP(ROWS($L$2:L108),J:K,2,0),\"\")","v":""},"0012 Payable immediately Due net",{"$nulls":7},"OnPrem",null,null,null,"0810G00000 - SAHR CHAD",null,"Z904 Due 30 days after receipt of invoice",{"$nulls":5},"309 New Zealand",{"$nulls":7},{"$f":"IF(ISNUMBER(SEARCH('INSTITUTIONAL VENDOR'!$C$35,AP109)),MAX($AO$7:AO108)+1,0)","v":0},"309 New Zealand",{"$f":"IFERROR(VLOOKUP(ROWS(AQ$7:$AQ108),AO:AP,2,0),\"\")","v":""},"336 Paraguay","333 Panama","Yes"]
[null,null,{"$f":"IF(ISNUMBER(SEARCH('INSTITUTIONAL VENDOR'!$E$12,D110)),MAX($C$1:C109)+1,0)","v":0},"336 Paraguay",{"$f":"IFERROR(VLOOKUP(ROWS($E$1:E109),C:D,2,0),\"\")","v":""},{"$f":"IF(ISNUMBER(SEARCH('INSTITUTIONAL VENDOR'!$C$31,G110)),MAX($F$2:F109)+1,0)","v":0},"PGK Papua New Guinea Kina",{"$f":"IFERROR(VLOOKUP(ROWS($H$2:H109),F:G,2,0),\"\")","v":""},null,{"$f":"IF(ISNUMBER(SEARCH('INSTITUTIONAL VENDOR'!$C$6,K110)),MAX($J$2:J109)+1,0)","v":0},"4360 - Rep. of Turkmenistan",{"$f":"IFERROR(VLOOKUP(ROWS($L$2:L109),J:K,2,0),\"\")","v":""}," Baseline date on 11 of next month",{"$nulls":7},"OffPrem",null,null,null,"0840A00000 - CHILE",null,"Z909 Reduce FO budget on billing",{"$nulls":5},"312 Nicaragua",{"$nulls":7},{"$f":"IF(ISNUMBER(SEARCH('INSTITUTIONAL VENDOR'!$C$35,AP110)),MAX($AO$7:AO109)+1,0)","v":0},"312 Nicaragua",{"$f":"IFERROR(VLOOKUP(ROWS(AQ$7:$AQ109),AO:AP,2,0),\"\")","v":""},"338 Congo","336 Paraguay","Yes"]
[null,null,{"$f":"IF(ISNUMBER(SEARCH('INSTITUTIONAL VENDOR'!$E$12,D111)),MAX($C$1:C110)+1,0)","v":0},"338 Congo",{"$f":"IFERROR(VLOOKUP(ROWS($E$1:E110),C:D,2,0),\"\")","v":""},{"$f":"IF(ISNUMBER(SEARCH('INSTITUTIONAL VENDOR'!$C$31,G111)),MAX($F$2:F110)+1,0)","v":0},"PHP Philippine Peso",{"$f":"IFERROR(VLOOKUP(ROWS($H$2:H110),F:G,2,0),\"\")","v":""},null,{"$f":"IF(ISNUMBER(SEARCH('INSTITUTIONAL VENDOR'!$C$6,K111)),MAX($J$2:J110)+1,0)","v":0},"4380 - Uganda",{"$f":"IFERROR(VLOOKUP(ROWS($L$2:L110),J:K,2,0),\"\")","v":""},"0014 within 10 days 5 % cash discount",{"$nulls":11},"0840B00000 - SANTIAGO CHILE",{"$nulls":7},"318 Niger",{"$nulls":7},{"$f":"IF(ISNUMBER(SEARCH('INSTITUTIONAL VENDOR'!$C$35,AP111)),MAX($AO$7:AO110)+1,0)","v":0},"318 Niger",{"$f":"IFERROR(VLOOKUP(ROWS(AQ$7:$AQ110),AO:AP,2,0),\"\")","v":""},"339 Peru","338 Congo","Yes"]
[null,null,{"$f":"IF(ISNUMBER(SEARCH('INSTITUTIONAL VENDOR'!$E$12,D112)),MAX($C$1:C111)+1,0)","v":0},"339 Peru",{"$f":"IFERROR(VLOOKUP(ROWS($E$1:E111),C:D,2,0),\"\")","v":""},{"$f":"IF(ISNUMBER(SEARCH('INSTITUTIONAL VENDOR'!$C$31,G112)),MAX($F$2:F111)+1,0)","v":0},"PKR Pakistani Rupee",{"$f":"IFERROR(VLOOKUP(ROWS($H$2:H111),F:G,2,0),\"\")","v":""},null,{"$f":"IF(ISNUMBER(SEARCH('INSTITUTIONAL VENDOR'!$C$6,K112)),MAX($J$2:J111)+1,0)","v":1},"4410 - Ukraine",{"$f":"IFERROR(VLOOKUP(ROWS($L$2:L111),J:K,2,0),\"\")","v":""},"0015 within 10 days 3 % cash discount",{"$nulls":11},"0860A00000 - CHINA",{"$nulls":7},"321 Nigeria",{"$nulls":7},{"$f":"IF(ISNUMBER(SEARCH('INSTITUTIONAL VENDOR'!$C$35,AP112)),MAX($AO$7:AO111)+1,0)","v":0},"321 Nigeria",{"$f":"IFERROR(VLOOKUP(ROWS(AQ$7:$AQ111),AO:AP,2,0),\"\")","v":""},"342 Philippines","339 Peru","Yes"]
[null,null,{"$f":"IF(ISNUMBER(SEARCH('INSTITUTIONAL VENDOR'!$E$12,D113)),MAX($C$1:C112)+1,0)","v":0},"342 Philippines",{"$f":"IFERROR(VLOOKUP(ROWS($E$1:E112),C:D,2,0),\"\")","v":""},{"$f":"IF(ISNUMBER(SEARCH('INSTITUTIONAL VENDOR'!$C$31,G113)),MAX($F$2:F112)+1,0)","v":0},"PLN Poland Zloty",{"$f":"IFERROR(VLOOKUP(ROWS($H$2:H112),F:G,2,0),\"\")","v":""},null,{"$f":"IF(ISNUMBER(SEARCH('INSTITUTIONAL VENDOR'!$C$6,K113)),MAX($J$2:J112)+1,0)","v":0},"4500 - Egypt",{"$f":"IFERROR(VLOOKUP(ROWS($L$2:L112),J:K,2,0),\"\")","v":""}," within 15 days 2 % cash discount",{"$nulls":11},"0860B00000 - BEIJING CHINA",{"$nulls":7},"324 Norway",{"$nulls":7},{"$f":"IF(ISNUMBER(SEARCH('INSTITUTIONAL VENDOR'!$C$35,AP113)),MAX($AO$7:AO112)+1,0)","v":0},"324 Norway",{"$f":"IFERROR(VLOOKUP(ROWS(AQ$7:$AQ112),AO:AP,2,0),\"\")","v":""},"345 Poland","342 Philippines","Yes"]
[null,null,{"$f":"IF(ISNUMBER(SEARCH('INSTITUTIONAL VENDOR'!$E$12,D114)),MAX($C$1:C113)+1,0)","v":0},"345 Poland",{"$f":"IFERROR(VLOOKUP(ROWS($E$1:E113),C:D,2,0),\"\")","v":""},{"$f":"IF(ISNUMBER(SEARCH('INSTITUTIONAL VENDOR'!$C$31,G114)),MAX($F$2:F113)+1,0)","v":0},"PYG Paraguayan Guarani",{"$f":"IFERROR(VLOOKUP(ROWS($H$2:H113),F:G,2,0),\"\")","v":""},null,{"$f":"IF(ISNUMBER(SEARCH('INSTITUTIONAL VENDOR'!$C$6,K114)),MAX($J$2:J113)+1,0)","v":0},"4550 - United Rep. of Tanzania",{"$f":"IFERROR(VLOOKUP(ROWS($L$2:L113),J:K,2,0),\"\")","v":""}," within 20 days Due net",{"$nulls":11},"0860C00000 - SHANGHAI",{"$nulls":7},"330 Pakistan",{"$nulls":7},{"$f":"IF(ISNUMBER(SEARCH('INSTITUTIONAL VENDOR'!$C$35,AP114)),MAX($AO$7:AO113)+1,0)","v":0},"330 Pakistan",{"$f":"IFERROR(VLOOKUP(ROWS(AQ$7:$AQ113),AO:AP,2,0),\"\")","v":""},"348 Portugal","345 Poland","No"]
[null,null,{"$f":"IF(ISNUMBER(SEARCH('INSTITUTIONAL VENDOR'!$E$12,D115)),MAX($C$1:C114)+1,0)","v":0},"348 Portugal",{"$f":"IFERROR(VLOOKUP(ROWS($E$1:E114),C:D,2,0),\"\")","v":""},{"$f":"IF(ISNUMBER(SEARCH('INSTITUTIONAL VENDOR'!$C$31,G115)),MAX($F$2:F114)+1,0)","v":0},"QAR Qatari Rial",{"$f":"IFERROR(VLOOKUP(ROWS($H$2:H114),F:G,2,0),\"\")","v":""},null,{"$f":"IF(ISNUMBER(SEARCH('INSTITUTIONAL VENDOR'!$C$6,K115)),MAX($J$2:J114)+1,0)","v":0},"456B - Executive Director's Office",{"$f":"IFERROR(VLOOKUP(ROWS($L$2:L114),J:K,2,0),\"\")","v":""},"0016 within 14 days 3 % cash discount",{"$nulls":11},"0930A00000 - COLOMBIA",{"$nulls":7},"333 Panama",{"$nulls":7},{"$f":"IF(ISNUMBER(SEARCH('INSTITUTIONAL VENDOR'!$C$35,AP115)),MAX($AO$7:AO114)+1,0)","v":0},"333 Panama",{"$f":"IFERROR(VLOOKUP(ROWS(AQ$7:$AQ114),AO:AP,2,0),\"\")","v":""},"366 Romania","348 Portugal","No"]
[null,null,{"$f":"IF(ISNUMBER(SEARCH('INSTITUTIONAL VENDOR'!$E$12,D116)),MAX($C$1:C115)+1,0)","v":0},"366 Romania",{"$f":"IFERROR(VLOOKUP(ROWS($E$1:E115),C:D,2,0),\"\")","v":""},{"$f":"IF(ISNUMBER(SEARCH('INSTITUTIONAL VENDOR'!$C$31,G116)),MAX($F$2:F115)+1,0)","v":0},"RON New Romanian Leu",{"$f":"IFERROR(VLOOKUP(ROWS($H$2:H115),F:G,2,0),\"\")","v":""},null,{"$f":"IF(ISNUMBER(SEARCH('INSTITUTIONAL VENDOR'!$C$6,K116)),MAX($J$2:J115)+1,0)","v":0},"456C - Analysis,Planning & Monitoring",{"$f":"IFERROR(VLOOKUP(ROWS($L$2:L115),J:K,2,0),\"\")","v":""}," within 20 days 2 % cash discount",{"$nulls":11},"0930B00000 - BOGOTA COLOMBIA",{"$nulls":7},"336 Paraguay",{"$nulls":7},{"$f":"IF(ISNUMBER(SEARCH('INSTITUTIONAL VENDOR'!$C$35,AP116)),MAX($AO$7:AO115)+1,0)","v":0},"336 Paraguay",{"$f":"IFERROR(VLOOKUP(ROWS(AQ$7:$AQ115),AO:AP,2,0),\"\")","v":""},"370 Russian Fed.","366 Romania","Yes"]
[null,null,{"$f":"IF(ISNUMBER(SEARCH('INSTITUTIONAL VENDOR'!$E$12,D117)),MAX($C$1:C116)+1,0)","v":0},"370 Russian Fed.",{"$f":"IFERROR(VLOOKUP(ROWS($E$1:E116),C:D,2,0),\"\")","v":""},{"$f":"IF(ISNUMBER(SEARCH('INSTITUTIONAL VENDOR'!$C$31,G117)),MAX($F$2:F116)+1,0)","v":0},"RSD Serbia Dinar",{"$f":"IFERROR(VLOOKUP(ROWS($H$2:H116),F:G,2,0),\"\")","v":""},null,{"$f":"IF(ISNUMBER(SEARCH('INSTITUTIONAL VENDOR'!$C$6,K117)),MAX($J$2:J116)+1,0)","v":0},"456D - Programme Division",{"$f":"IFERROR(VLOOKUP(ROWS($L$2:L116),J:K,2,0),\"\")","v":""}," within 30 days Due net",{"$nulls":11},"0930C00000 - PASTO",{"$nulls":7},"338 Congo",{"$nulls":7},{"$f":"IF(ISNUMBER(SEARCH('INSTITUTIONAL VENDOR'!$C$35,AP117)),MAX($AO$7:AO116)+1,0)","v":0},"338 Congo",{"$f":"IFERROR(VLOOKUP(ROWS(AQ$7:$AQ116),AO:AP,2,0),\"\")","v":""},"375 Rwanda","370 Russian Fed.","Yes"]
[null,null,{"$f":"IF(ISNUMBER(SEARCH('INSTITUTIONAL VENDOR'!$E$12,D118)),MAX($C$1:C117)+1,0)","v":0},"375 Rwanda",{"$f":"IFERROR(VLOOKUP(ROWS($E$1:E117),C:D,2,0),\"\")","v":""},{"$f":"IF(ISNUMBER(SEARCH('INSTITUTIONAL VENDOR'!$C$31,G118)),MAX($F$2:F117)+1,0)","v":0},"RUB Russian Rouble",{"$f":"IFERROR(VLOOKUP(ROWS($H$2:H117),F:G,2,0),\"\")","v":""},null,{"$f":"IF(ISNUMBER(SEARCH('INSTITUTIONAL VENDOR'!$C$6,K118)),MAX($J$2:J117)+1,0)","v":0},"456F - Office of Emergency Prog.",{"$f":"IFERROR(VLOOKUP(ROWS($L$2:L117),J:K,2,0),\"\")","v":""},"0017 Payable in 3 partial amounts",{"$nulls":11},"0930D00000 - QUIBDO",{"$nulls":7},"339 Peru",{"$nulls":7},{"$f":"IF(ISNUMBER(SEARCH('INSTITUTIONAL VENDOR'!$C$35,AP118)),MAX($AO$7:AO117)+1,0)","v":0},"339 Peru",{"$f":"IFERROR(VLOOKUP(ROWS(AQ$7:$AQ117),AO:AP,2,0),\"\")","v":""},"378 Saudi Arabia","375 Rwanda","Yes"]
[null,null,{"$f":"IF(ISNUMBER(SEARCH('INSTITUTIONAL VENDOR'!$E$12,D119)),MAX($C$1:C118)+1,0)","v":0},"378 Saudi Arabia",{"$f":"IFERROR(VLOOKUP(ROWS($E$1:E118),C:D,2,0),\"\")","v":""},{"$f":"IF(ISNUMBER(SEARCH('INSTITUTIONAL VENDOR'!$C$31,G119)),MAX($F$2:F118)+1,0)","v":0},"RWF Rwanda Franc",{"$f":"IFERROR(VLOOKUP(ROWS($H$2:H118),F:G,2,0),\"\")","v":""},null,{"$f":"IF(ISNUMBER(SEARCH('INSTITUTIONAL VENDOR'!$C$6,K119)),MAX($J$2:J118)+1,0)","v":0},"456G - Division of Communication",{"$f":"IFERROR(VLOOKUP(ROWS($L$2:L118),J:K,2,0),\"\")","v":""}," 1 installment: 30.000 % with payment term 0001",{"$nulls":11},"0930E00000 - SINSELEJO",{"$nulls":7},"342 Philippines",{"$nulls":7},{"$f":"IF(ISNUMBER(SEARCH('INSTITUTIONAL VENDOR'!$C$35,AP119)),MAX($AO$7:AO118)+1,0)","v":0},"342 Philippines",{"$f":"IFERROR(VLOOKUP(ROWS(AQ$7:$AQ118),AO:AP,2,0),\"\")","v":""},"381 Senegal","378 Saudi Arabia","Yes"]
[null,null,{"$f":"IF(ISNUMBER(SEARCH('INSTITUTIONAL VENDOR'!$E$12,D120)),MAX($C$1:C119)+1,0)","v":0},"381 Senegal",{"$f":"IFERROR(VLOOKUP(ROWS($E$1:E119),C:D,2,0),\"\")","v":""},{"$f":"IF(ISNUMBER(SEARCH('INSTITUTIONAL VENDOR'!$C$31,G120)),MAX($F$2:F119)+1,0)","v":0},"SAR Saudi Riyal",{"$f":"IFERROR(VLOOKUP(ROWS($H$2:H119),F:G,2,0),\"\")","v":""},null,{"$f":"IF(ISNUMBER(SEARCH('INSTITUTIONAL VENDOR'!$C$6,K120)),MAX($J$2:J119)+1,0)","v":0},"456H - Gov. & Multilateral Affairs",{"$f":"IFERROR(VLOOKUP(ROWS($L$2:L119),J:K,2,0),\"\")","v":""}," 2 installment: 40.000 % with payment term 0001",{"$nulls":11},"0930F00000 - CALI",{"$nulls":7},"345 Poland",{"$nulls":7},{"$f":"IF(ISNUMBER(SEARCH('INSTITUTIONAL VENDOR'!$C$35,AP120)),MAX($AO$7:AO119)+1,0)","v":0},"345 Poland",{"$f":"IFERROR(VLOOKUP(ROWS(AQ$7:$AQ119),AO:AP,2,0),\"\")","v":""},"390 Sierra Leone","381 Senegal","Yes"]
[null,null,{"$f":"IF(ISNUMBER(SEARCH('INSTITUTIONAL VENDOR'!$E$12,D121)),MAX($C$1:C120)+1,0)","v":0},"390 Sierra Leone",{"$f":"IFERROR(VLOOKUP(ROWS($E$1:E120),C:D,2,0),\"\")","v":""},{"$f":"IF(ISNUMBER(SEARCH('INSTITUTIONAL VENDOR'!$C$31,G121)),MAX($F$2:F120)+1,0)","v":0},"SBD Solomon Islands Dollar",{"$f":"IFERROR(VLOOKUP(ROWS($H$2:H120),F:G,2,0),\"\")","v":""},null,{"$f":"IF(ISNUMBER(SEARCH('INSTITUTIONAL VENDOR'!$C$6,K121)),MAX($J$2:J120)+1,0)","v":0},"456I - Public Partnerships Division",{"$f":"IFERROR(VLOOKUP(ROWS($L$2:L120),J:K,2,0),\"\")","v":""}," 3 installment: 30.000 % with payment term 0001",{"$nulls":11},"0990A00000 - DR CONGO",{"$nulls":7},"348 Portugal",{"$nulls":7},{"$f":"IF(ISNUMBER(SEARCH('INSTITUTIONAL VENDOR'!$C$35,AP121)),MAX($AO$7:AO120)+1,0)","v":0},"348 Portugal",{"$f":"IFERROR(VLOOKUP(ROWS(AQ$7:$AQ120),AO:AP,2,0),\"\")","v":""},"391 Singapore","390 Sierra Leone","Yes"]
[null,null,{"$f":"IF(ISNUMBER(SEARCH('INSTITUTIONAL VENDOR'!$E$12,D122)),MAX($C$1:C121)+1,0)","v":0},"391 Singapore",{"$f":"IFERROR(VLOOKUP(ROWS($E$1:E121),C:D,2,0),\"\")","v":""},{"$f":"IF(ISNUMBER(SEARCH('INSTITUTIONAL VENDOR'!$C$31,G122)),MAX($F$2:F121)+1,0)","v":0},"SCR Seychelles Rupee",{"$f":"IFERROR(VLOOKUP(ROWS($H$2:H121),F:G,2,0),\"\")","v":""},null,{"$f":"IF(ISNUMBER(SEARCH('INSTITUTIONAL VENDOR'!$C$6,K122)),MAX($J$2:J121)+1,0)","v":0},"456J - Div. of Finance & Admin Mgmt",{"$f":"IFERROR(VLOOKUP(ROWS($L$2:L121),J:K,2,0),\"\")","v":""},"Y000 Payment due in 30 days",{"$nulls":11},"0990B00000 - KINSHASA DRC",{"$nulls":7},"366 Romania",{"$nulls":7},{"$f":"IF(ISNUMBER(SEARCH('INSTITUTIONAL VENDOR'!$C$35,AP122)),MAX($AO$7:AO121)+1,0)","v":0},"366 Romania",{"$f":"IFERROR(VLOOKUP(ROWS(AQ$7:$AQ121),AO:AP,2,0),\"\")","v":""},"392 Somalia","391 Singapore","Yes"]
[null,null,{"$f":"IF(ISNUMBER(SEARCH('INSTITUTIONAL VENDOR'!$E$12,D123)),MAX($C$1:C122)+1,0)","v":0},"392 Somalia",{"$f":"IFERROR(VLOOKUP(ROWS($E$1:E122),C:D,2,0),\"\")","v":""},{"$f":"IF(ISNUMBER(SEARCH('INSTITUTIONAL VENDOR'!$C$31,G123)),MAX($F$2:F122)+1,0)","v":0},"SDG Sudanese Pound (new)",{"$f":"IFERROR(VLOOKUP(ROWS($H$2:H122),F:G,2,0),\"\")","v":""},null,{"$f":"IF(ISNUMBER(SEARCH('INSTITUTIONAL VENDOR'!$C$6,K123)),MAX($J$2:J122)+1,0)","v":0},"456K - Division of Human Resources",{"$f":"IFERROR(VLOOKUP(ROWS($L$2:L122),J:K,2,0),\"\")","v":""},"Y001 within 29 days 2 % cash discount",{"$nulls":11},"0990B10000 - PROVINCE KINSHASA",{"$nulls":7},"370 Russian Federation",{"$nulls":7},{"$f":"IF(ISNUMBER(SEARCH('INSTITUTIONAL VENDOR'!$C$35,AP123)),MAX($AO$7:AO122)+1,0)","v":0},"370 Russian Fed.",{"$f":"IFERROR(VLOOKUP(ROWS(AQ$7:$AQ122),AO:AP,2,0),\"\")","v":""},"393 South Africa","392 Somalia","Yes"]
[null,null,{"$f":"IF(ISNUMBER(SEARCH('INSTITUTIONAL VENDOR'!$E$12,D124)),MAX($C$1:C123)+1,0)","v":0},"393 South Africa",{"$f":"IFERROR(VLOOKUP(ROWS($E$1:E123),C:D,2,0),\"\")","v":""},{"$f":"IF(ISNUMBER(SEARCH('INSTITUTIONAL VENDOR'!$C$31,G124)),MAX($F$2:F123)+1,0)","v":0},"SEK Swedish Krona",{"$f":"IFERROR(VLOOKUP(ROWS($H$2:H123),F:G,2,0),\"\")","v":""},null,{"$f":"IF(ISNUMBER(SEARCH('INSTITUTIONAL VENDOR'!$C$6,K124)),MAX($J$2:J123)+1,0)","v":0},"456L - Info & Comm Technology Div",{"$f":"IFERROR(VLOOKUP(ROWS($L$2:L123),J:K,2,0),\"\")","v":""}," within 30 days Due net",{"$nulls":11},"0990B20000 - OUEST KINSHASA",{"$nulls":7},"375 Rwanda",{"$nulls":7},{"$f":"IF(ISNUMBER(SEARCH('INSTITUTIONAL VENDOR'!$C$35,AP124)),MAX($AO$7:AO123)+1,0)","v":0},"375 Rwanda",{"$f":"IFERROR(VLOOKUP(ROWS(AQ$7:$AQ123),AO:AP,2,0),\"\")","v":""},"394 Slovenia","393 South Africa","Yes"]
[null,null,{"$f":"IF(ISNUMBER(SEARCH('INSTITUTIONAL VENDOR'!$E$12,D125)),MAX($C$1:C124)+1,0)","v":0},"394 Slovenia",{"$f":"IFERROR(VLOOKUP(ROWS($E$1:E124),C:D,2,0),\"\")","v":""},{"$f":"IF(ISNUMBER(SEARCH('INSTITUTIONAL VENDOR'!$C$31,G125)),MAX($F$2:F124)+1,0)","v":0},"SGD Singapore Dollar",{"$f":"IFERROR(VLOOKUP(ROWS($H$2:H124),F:G,2,0),\"\")","v":""},null,{"$f":"IF(ISNUMBER(SEARCH('INSTITUTIONAL VENDOR'!$C$6,K125)),MAX($J$2:J124)+1,0)","v":0},"456N - Int. Audit & Invest (OIAI)",{"$f":"IFERROR(VLOOKUP(ROWS($L$2:L124),J:K,2,0),\"\")","v":""},"Y002 within 30 days Due net",{"$nulls":11},"0990C00000 - BANDUNDU",{"$nulls":7},"378 Saudi Arabia",{"$nulls":7},{"$f":"IF(ISNUMBER(SEARCH('INSTITUTIONAL VENDOR'!$C$35,AP125)),MAX($AO$7:AO124)+1,0)","v":0},"378 Saudi Arabia",{"$f":"IFERROR(VLOOKUP(ROWS(AQ$7:$AQ124),AO:AP,2,0),\"\")","v":""},"395 Slovak Republic","394 Slovenia","No"]
[null,null,{"$f":"IF(ISNUMBER(SEARCH('INSTITUTIONAL VENDOR'!$E$12,D126)),MAX($C$1:C125)+1,0)","v":0},"395 Slovak Republic",{"$f":"IFERROR(VLOOKUP(ROWS($E$1:E125),C:D,2,0),\"\")","v":""},{"$f":"IF(ISNUMBER(SEARCH('INSTITUTIONAL VENDOR'!$C$31,G126)),MAX($F$2:F125)+1,0)","v":0},"SHP St.Helena Pound",{"$f":"IFERROR(VLOOKUP(ROWS($H$2:H125),F:G,2,0),\"\")","v":""},null,{"$f":"IF(ISNUMBER(SEARCH('INSTITUTIONAL VENDOR'!$C$6,K126)),MAX($J$2:J125)+1,0)","v":0},"456O - Evaluation Office",{"$f":"IFERROR(VLOOKUP(ROWS($L$2:L125),J:K,2,0),\"\")","v":""},"Y003 For incoming invoices until 15 of the month",{"$nulls":11},"0990D00000 - SUD KIVU BUKAVU",{"$nulls":7},"381 Senegal",{"$nulls":7},{"$f":"IF(ISNUMBER(SEARCH('INSTITUTIONAL VENDOR'!$C$35,AP126)),MAX($AO$7:AO125)+1,0)","v":0},"381 Senegal",{"$f":"IFERROR(VLOOKUP(ROWS(AQ$7:$AQ125),AO:AP,2,0),\"\")","v":""},"399 Spain","395 Slovak Republic","No"]
[null,null,{"$f":"IF(ISNUMBER(SEARCH('INSTITUTIONAL VENDOR'!$E$12,D127)),MAX($C$1:C126)+1,0)","v":0},"399 Spain",{"$f":"IFERROR(VLOOKUP(ROWS($E$1:E126),C:D,2,0),\"\")","v":""},{"$f":"IF(ISNUMBER(SEARCH('INSTITUTIONAL VENDOR'!$C$31,G127)),MAX($F$2:F126)+1,0)","v":0},"SLL Sierra Leone",{"$f":"IFERROR(VLOOKUP(ROWS($H$2:H126),F:G,2,0),\"\")","v":""},null,{"$f":"IF(ISNUMBER(SEARCH('INSTITUTIONAL VENDOR'!$C$6,K127)),MAX($J$2:J126)+1,0)","v":0},"456Q - GSSC Project",{"$f":"IFERROR(VLOOKUP(ROWS($L$2:L126),J:K,2,0),\"\")","v":""}," within 10 days 3 % cash discount",{"$nulls":11},"0990E00000 - ITURI BUNIA",{"$nulls":7},"390 Sierra Leone",{"$nulls":7},{"$f":"IF(ISNUMBER(SEARCH('INSTITUTIONAL VENDOR'!$C$35,AP127)),MAX($AO$7:AO126)+1,0)","v":0},"390 Sierra Leone",{"$f":"IFERROR(VLOOKUP(ROWS(AQ$7:$AQ126),AO:AP,2,0),\"\")","v":""},"402 Sudan","399 Spain","No"]
[null,null,{"$f":"IF(ISNUMBER(SEARCH('INSTITUTIONAL VENDOR'!$E$12,D128)),MAX($C$1:C127)+1,0)","v":0},"402 Sudan",{"$f":"IFERROR(VLOOKUP(ROWS($E$1:E127),C:D,2,0),\"\")","v":""},{"$f":"IF(ISNUMBER(SEARCH('INSTITUTIONAL VENDOR'!$C$31,G128)),MAX($F$2:F127)+1,0)","v":0},"SOS Somalian Shilling",{"$f":"IFERROR(VLOOKUP(ROWS($H$2:H127),F:G,2,0),\"\")","v":""},null,{"$f":"IF(ISNUMBER(SEARCH('INSTITUTIONAL VENDOR'!$C$6,K128)),MAX($J$2:J127)+1,0)","v":0},"456R - Office of Global Insight & Policy",{"$f":"IFERROR(VLOOKUP(ROWS($L$2:L127),J:K,2,0),\"\")","v":""}," within 29 days 1.5 % cash discount",{"$nulls":11},"0990F00000 - DUNGU",{"$nulls":7},"391 Singapore",{"$nulls":7},{"$f":"IF(ISNUMBER(SEARCH('INSTITUTIONAL VENDOR'!$C$35,AP128)),MAX($AO$7:AO127)+1,0)","v":0},"391 Singapore",{"$f":"IFERROR(VLOOKUP(ROWS(AQ$7:$AQ127),AO:AP,2,0),\"\")","v":""},"403 Swaziland","402 Sudan","Yes"]
[null,null,{"$f":"IF(ISNUMBER(SEARCH('INSTITUTIONAL VENDOR'!$E$12,D129)),MAX($C$1:C128)+1,0)","v":0},"403 Swaziland",{"$f":"IFERROR(VLOOKUP(ROWS($E$1:E128),C:D,2,0),\"\")","v":""},{"$f":"IF(ISNUMBER(SEARCH('INSTITUTIONAL VENDOR'!$C$31,G129)),MAX($F$2:F128)+1,0)","v":0},"SRD Surinamese Dollar",{"$f":"IFERROR(VLOOKUP(ROWS($H$2:H128),F:G,2,0),\"\")","v":""},null,{"$f":"IF(ISNUMBER(SEARCH('INSTITUTIONAL VENDOR'!$C$6,K129)),MAX($J$2:J128)+1,0)","v":0},"456S - OSEB",{"$f":"IFERROR(VLOOKUP(ROWS($L$2:L128),J:K,2,0),\"\")","v":""}," within 30 days Due net",{"$nulls":11},"0990G00000 - NORD KIVU GOMA",{"$nulls":7},"392 Somalia",{"$nulls":7},{"$f":"IF(ISNUMBER(SEARCH('INSTITUTIONAL VENDOR'!$C$35,AP129)),MAX($AO$7:AO128)+1,0)","v":0},"392 Somalia",{"$f":"IFERROR(VLOOKUP(ROWS(AQ$7:$AQ128),AO:AP,2,0),\"\")","v":""},"404 South Sudan","403 Swaziland","Yes"]
[null,null,{"$f":"IF(ISNUMBER(SEARCH('INSTITUTIONAL VENDOR'!$E$12,D130)),MAX($C$1:C129)+1,0)","v":0},"404 South Sudan",{"$f":"IFERROR(VLOOKUP(ROWS($E$1:E129),C:D,2,0),\"\")","v":""},{"$f":"IF(ISNUMBER(SEARCH('INSTITUTIONAL VENDOR'!$C$31,G130)),MAX($F$2:F129)+1,0)","v":0},"SSP South Sudanese Pound",{"$f":"IFERROR(VLOOKUP(ROWS($H$2:H129),F:G,2,0),\"\")","v":""},null,{"$f":"IF(ISNUMBER(SEARCH('INSTITUTIONAL VENDOR'!$C$6,K130)),MAX($J$2:J129)+1,0)","v":0},"456T - UNICEF Hosted Funds",{"$f":"IFERROR(VLOOKUP(ROWS($L$2:L129),J:K,2,0),\"\")","v":""},"Y004 within 10 days 1 % cash discount",{"$nulls":11},"0990G10000 - EAST GOMA",{"$nulls":7},"393 South Africa",{"$nulls":7},{"$f":"IF(ISNUMBER(SEARCH('INSTITUTIONAL VENDOR'!$C$35,AP130)),MAX($AO$7:AO129)+1,0)","v":0},"393 South Africa",{"$f":"IFERROR(VLOOKUP(ROWS(AQ$7:$AQ129),AO:AP,2,0),\"\")","v":""},"411 Sweden","404 South Sudan","Yes"]
[null,null,{"$f":"IF(ISNUMBER(SEARCH('INSTITUTIONAL VENDOR'!$E$12,D131)),MAX($C$1:C130)+1,0)","v":0},"411 Sweden",{"$f":"IFERROR(VLOOKUP(ROWS($E$1:E130),C:D,2,0),\"\")","v":""},{"$f":"IF(ISNUMBER(SEARCH('INSTITUTIONAL VENDOR'!$C$31,G131)),MAX($F$2:F130)+1,0)","v":0},"STD Sao Tome / Principe Dobra",{"$f":"IFERROR(VLOOKUP(ROWS($H$2:H130),F:G,2,0),\"\")","v":""},null,{"$f":"IF(ISNUMBER(SEARCH('INSTITUTIONAL VENDOR'!$C$6,K131)),MAX($J$2:J130)+1,0)","v":0},"4590 - Burkina Faso",{"$f":"IFERROR(VLOOKUP(ROWS($L$2:L130),J:K,2,0),\"\")","v":""}," within 30 days Due net",{"$nulls":11},"0990H00000 - TANGANYIKA KALEMIE",{"$nulls":7},"394 Slovenia",{"$nulls":7},{"$f":"IF(ISNUMBER(SEARCH('INSTITUTIONAL VENDOR'!$C$35,AP131)),MAX($AO$7:AO130)+1,0)","v":0},"394 Slovenia",{"$f":"IFERROR(VLOOKUP(ROWS(AQ$7:$AQ130),AO:AP,2,0),\"\")","v":""},"414 Syria, Arab Rep","411 Sweden","No"]
[null,null,{"$f":"IF(ISNUMBER(SEARCH('INSTITUTIONAL VENDOR'!$E$12,D132)),MAX($C$1:C131)+1,0)","v":0},"414 Syria, Arab Rep",{"$f":"IFERROR(VLOOKUP(ROWS($E$1:E131),C:D,2,0),\"\")","v":""},{"$f":"IF(ISNUMBER(SEARCH('INSTITUTIONAL VENDOR'!$C$31,G132)),MAX($F$2:F131)+1,0)","v":0},"SVC El Salvador Colon",{"$f":"IFERROR(VLOOKUP(ROWS($H$2:H131),F:G,2,0),\"\")","v":""},null,{"$f":"IF(ISNUMBER(SEARCH('INSTITUTIONAL VENDOR'!$C$6,K132)),MAX($J$2:J131)+1,0)","v":0},"4620 - Uruguay",{"$f":"IFERROR(VLOOKUP(ROWS($L$2:L131),J:K,2,0),\"\")","v":""},"Y005 within 12 days 2 % cash discount",{"$nulls":11},"0990I00000 - KASAI OCCIDENTAL KA",{"$nulls":7},"395 Slovakia",{"$nulls":7},{"$f":"IF(ISNUMBER(SEARCH('INSTITUTIONAL VENDOR'!$C$35,AP132)),MAX($AO$7:AO131)+1,0)","v":0},"395 Slovak Republic",{"$f":"IFERROR(VLOOKUP(ROWS(AQ$7:$AQ131),AO:AP,2,0),\"\")","v":""},"415 Tajikistan","414 Syria, Arab Rep","Yes"]
[null,null,{"$f":"IF(ISNUMBER(SEARCH('INSTITUTIONAL VENDOR'!$E$12,D133)),MAX($C$1:C132)+1,0)","v":0},"415 Tajikistan",{"$f":"IFERROR(VLOOKUP(ROWS($E$1:E132),C:D,2,0),\"\")","v":""},{"$f":"IF(ISNUMBER(SEARCH('INSTITUTIONAL VENDOR'!$C$31,G133)),MAX($F$2:F132)+1,0)","v":0},"SYP Syrian Pound",{"$f":"IFERROR(VLOOKUP(ROWS($H$2:H132),F:G,2,0),\"\")","v":""},null,{"$f":"IF(ISNUMBER(SEARCH('INSTITUTIONAL VENDOR'!$C$6,K133)),MAX($J$2:J132)+1,0)","v":0},"4630 - Rep of Uzbekistan",{"$f":"IFERROR(VLOOKUP(ROWS($L$2:L132),J:K,2,0),\"\")","v":""}," within 30 days Due net",{"$nulls":11},"0990J00000 - PROVINCE ORIENTALE",{"$nulls":7},"399 Spain",{"$nulls":7},{"$f":"IF(ISNUMBER(SEARCH('INSTITUTIONAL VENDOR'!$C$35,AP133)),MAX($AO$7:AO132)+1,0)","v":0},"399 Spain",{"$f":"IFERROR(VLOOKUP(ROWS(AQ$7:$AQ132),AO:AP,2,0),\"\")","v":""},"420 Thailand","415 Tajikistan","Yes"]
[null,null,{"$f":"IF(ISNUMBER(SEARCH('INSTITUTIONAL VENDOR'!$E$12,D134)),MAX($C$1:C133)+1,0)","v":0},"420 Thailand",{"$f":"IFERROR(VLOOKUP(ROWS($E$1:E133),C:D,2,0),\"\")","v":""},{"$f":"IF(ISNUMBER(SEARCH('INSTITUTIONAL VENDOR'!$C$31,G134)),MAX($F$2:F133)+1,0)","v":0},"SZL Swaziland Lilangeni",{"$f":"IFERROR(VLOOKUP(ROWS($H$2:H133),F:G,2,0),\"\")","v":""},null,{"$f":"IF(ISNUMBER(SEARCH('INSTITUTIONAL VENDOR'!$C$6,K134)),MAX($J$2:J133)+1,0)","v":0},"4710 - Venezuela",{"$f":"IFERROR(VLOOKUP(ROWS($L$2:L133),J:K,2,0),\"\")","v":""},"Y010 Payment due in 10 days(Without discount)",{"$nulls":11},"0990K00000 - KATANGA LUBUMBASHI",{"$nulls":7},"402 Sudan",{"$nulls":7},{"$f":"IF(ISNUMBER(SEARCH('INSTITUTIONAL VENDOR'!$C$35,AP134)),MAX($AO$7:AO133)+1,0)","v":0},"402 Sudan",{"$f":"IFERROR(VLOOKUP(ROWS(AQ$7:$AQ133),AO:AP,2,0),\"\")","v":""},"423 Togo","420 Thailand","Yes"]
[null,null,{"$f":"IF(ISNUMBER(SEARCH('INSTITUTIONAL VENDOR'!$E$12,D135)),MAX($C$1:C134)+1,0)","v":0},"423 Togo",{"$f":"IFERROR(VLOOKUP(ROWS($E$1:E134),C:D,2,0),\"\")","v":""},{"$f":"IF(ISNUMBER(SEARCH('INSTITUTIONAL VENDOR'!$C$31,G135)),MAX($F$2:F134)+1,0)","v":0},"THB Thailand Baht",{"$f":"IFERROR(VLOOKUP(ROWS($H$2:H134),F:G,2,0),\"\")","v":""},null,{"$f":"IF(ISNUMBER(SEARCH('INSTITUTIONAL VENDOR'!$C$6,K135)),MAX($J$2:J134)+1,0)","v":0},"4920 - Yemen",{"$f":"IFERROR(VLOOKUP(ROWS($L$2:L134),J:K,2,0),\"\")","v":""},"Y020 Payment due in 20 days(Without discount)",{"$nulls":11},"0990K10000 - SUD LUBUMBASHI",{"$nulls":7},"403 Swaziland",{"$nulls":7},{"$f":"IF(ISNUMBER(SEARCH('INSTITUTIONAL VENDOR'!$C$35,AP135)),MAX($AO$7:AO134)+1,0)","v":0},"403 Swaziland",{"$f":"IFERROR(VLOOKUP(ROWS(AQ$7:$AQ134),AO:AP,2,0),\"\")","v":""},"429 Trinidad,Tobago","423 Togo","Yes"]
[null,null,{"$f":"IF(ISNUMBER(SEARCH('INSTITUTIONAL VENDOR'!$E$12,D136)),MAX($C$1:C135)+1,0)","v":0},"429 Trinidad,Tobago",{"$f":"IFERROR(VLOOKUP(ROWS($E$1:E135),C:D,2,0),\"\")","v":""},{"$f":"IF(ISNUMBER(SEARCH('INSTITUTIONAL VENDOR'!$C$31,G136)),MAX($F$2:F135)+1,0)","v":0},"TJS Tajik Somoni",{"$f":"IFERROR(VLOOKUP(ROWS($H$2:H135),F:G,2,0),\"\")","v":""},null,{"$f":"IF(ISNUMBER(SEARCH('INSTITUTIONAL VENDOR'!$C$6,K136)),MAX($J$2:J135)+1,0)","v":0},"4980 - Zambia",{"$f":"IFERROR(VLOOKUP(ROWS($L$2:L135),J:K,2,0),\"\")","v":""},"Y100 Payment due in 30 days",{"$nulls":11},"0990L00000 - BAS CONGO MATADI",{"$nulls":7},"404 South Sudan",{"$nulls":7},{"$f":"IF(ISNUMBER(SEARCH('INSTITUTIONAL VENDOR'!$C$35,AP136)),MAX($AO$7:AO135)+1,0)","v":0},"404 South Sudan",{"$f":"IFERROR(VLOOKUP(ROWS(AQ$7:$AQ135),AO:AP,2,0),\"\")","v":""},"432 Tunisia","429 Trinidad,Tobago","Yes"]
[null,null,{"$f":"IF(ISNUMBER(SEARCH('INSTITUTIONAL VENDOR'!$E$12,D137)),MAX($C$1:C136)+1,0)","v":0},"432 Tunisia",{"$f":"IFERROR(VLOOKUP(ROWS($E$1:E136),C:D,2,0),\"\")","v":""},{"$f":"IF(ISNUMBER(SEARCH('INSTITUTIONAL VENDOR'!$C$31,G137)),MAX($F$2:F136)+1,0)","v":0},"TMT Turkmenistan Manat",{"$f":"IFERROR(VLOOKUP(ROWS($H$2:H136),F:G,2,0),\"\")","v":""},null,{"$f":"IF(ISNUMBER(SEARCH('INSTITUTIONAL VENDOR'!$C$6,K137)),MAX($J$2:J136)+1,0)","v":0},"5070 - Bangladesh",{"$f":"IFERROR(VLOOKUP(ROWS($L$2:L136),J:K,2,0),\"\")","v":""},"Y101 within 29 days 2 % cash discount",{"$nulls":11},"0990M00000 - EQUATEUR MBANDAKA",{"$nulls":7},"411 Sweden",{"$nulls":7},{"$f":"IF(ISNUMBER(SEARCH('INSTITUTIONAL VENDOR'!$C$35,AP137)),MAX($AO$7:AO136)+1,0)","v":0},"411 Sweden",{"$f":"IFERROR(VLOOKUP(ROWS(AQ$7:$AQ136),AO:AP,2,0),\"\")","v":""},"435 Turkey","432 Tunisia","Yes"]
[null,null,{"$f":"IF(ISNUMBER(SEARCH('INSTITUTIONAL VENDOR'!$E$12,D138)),MAX($C$1:C137)+1,0)","v":0},"435 Turkey",{"$f":"IFERROR(VLOOKUP(ROWS($E$1:E137),C:D,2,0),\"\")","v":""},{"$f":"IF(ISNUMBER(SEARCH('INSTITUTIONAL VENDOR'!$C$31,G138)),MAX($F$2:F137)+1,0)","v":0},"TND Tunisian Dinar",{"$f":"IFERROR(VLOOKUP(ROWS($H$2:H137),F:G,2,0),\"\")","v":""},null,{"$f":"IF(ISNUMBER(SEARCH('INSTITUTIONAL VENDOR'!$C$6,K138)),MAX($J$2:J137)+1,0)","v":0},"5150 - DP Republic of Korea",{"$f":"IFERROR(VLOOKUP(ROWS($L$2:L137),J:K,2,0),\"\")","v":""}," within 30 days Due net",{"$nulls":11},"0990N00000 - KASAI ORIENTAL MBUJ",{"$nulls":7},"414 Syrian Arab Republic",{"$nulls":7},{"$f":"IF(ISNUMBER(SEARCH('INSTITUTIONAL VENDOR'!$C$35,AP138)),MAX($AO$7:AO137)+1,0)","v":0},"414 Syria, Arab Rep",{"$f":"IFERROR(VLOOKUP(ROWS(AQ$7:$AQ137),AO:AP,2,0),\"\")","v":""},"436 Turkmenistan","435 Turkey","Yes"]
[null,null,{"$f":"IF(ISNUMBER(SEARCH('INSTITUTIONAL VENDOR'!$E$12,D139)),MAX($C$1:C138)+1,0)","v":0},"436 Turkmenistan",{"$f":"IFERROR(VLOOKUP(ROWS($E$1:E138),C:D,2,0),\"\")","v":""},{"$f":"IF(ISNUMBER(SEARCH('INSTITUTIONAL VENDOR'!$C$31,G139)),MAX($F$2:F138)+1,0)","v":0},"TOP Tongan Pa'anga",{"$f":"IFERROR(VLOOKUP(ROWS($H$2:H138),F:G,2,0),\"\")","v":""},null,{"$f":"IF(ISNUMBER(SEARCH('INSTITUTIONAL VENDOR'!$C$6,K139)),MAX($J$2:J138)+1,0)","v":0},"5200 - Vietnam",{"$f":"IFERROR(VLOOKUP(ROWS($L$2:L138),J:K,2,0),\"\")","v":""},"Y103 For incoming invoices until 15 of the month",{"$nulls":11},"0990O00000 - MANIEMA",{"$nulls":7},"415 Tajikistan",{"$nulls":7},{"$f":"IF(ISNUMBER(SEARCH('INSTITUTIONAL VENDOR'!$C$35,AP139)),MAX($AO$7:AO138)+1,0)","v":0},"415 Tajikistan",{"$f":"IFERROR(VLOOKUP(ROWS(AQ$7:$AQ138),AO:AP,2,0),\"\")","v":""},"438 Uganda","436 Turkmenistan","Yes"]
[null,null,{"$f":"IF(ISNUMBER(SEARCH('INSTITUTIONAL VENDOR'!$E$12,D140)),MAX($C$1:C139)+1,0)","v":0},"438 Uganda",{"$f":"IFERROR(VLOOKUP(ROWS($E$1:E139),C:D,2,0),\"\")","v":""},{"$f":"IF(ISNUMBER(SEARCH('INSTITUTIONAL VENDOR'!$C$31,G140)),MAX($F$2:F139)+1,0)","v":0},"TRY New Turkish Lira",{"$f":"IFERROR(VLOOKUP(ROWS($H$2:H139),F:G,2,0),\"\")","v":""},null,{"$f":"IF(ISNUMBER(SEARCH('INSTITUTIONAL VENDOR'!$C$6,K140)),MAX($J$2:J139)+1,0)","v":0},"5640 - Moldova",{"$f":"IFERROR(VLOOKUP(ROWS($L$2:L139),J:K,2,0),\"\")","v":""}," within 10 days 3 % cash discount",{"$nulls":11},"0990P00000 - LIBENGE DRC",{"$nulls":7},"420 Thailand",{"$nulls":7},{"$f":"IF(ISNUMBER(SEARCH('INSTITUTIONAL VENDOR'!$C$35,AP140)),MAX($AO$7:AO139)+1,0)","v":0},"420 Thailand",{"$f":"IFERROR(VLOOKUP(ROWS(AQ$7:$AQ139),AO:AP,2,0),\"\")","v":""},"441 Ukraine","438 Uganda","Yes"]
[null,null,{"$f":"IF(ISNUMBER(SEARCH('INSTITUTIONAL VENDOR'!$E$12,D141)),MAX($C$1:C140)+1,0)","v":1},"441 Ukraine",{"$f":"IFERROR(VLOOKUP(ROWS($E$1:E140),C:D,2,0),\"\")","v":""},{"$f":"IF(ISNUMBER(SEARCH('INSTITUTIONAL VENDOR'!$C$31,G141)),MAX($F$2:F140)+1,0)","v":0},"TTD Trinidad and Tobago Dollar",{"$f":"IFERROR(VLOOKUP(ROWS($H$2:H140),F:G,2,0),\"\")","v":""},null,{"$f":"IF(ISNUMBER(SEARCH('INSTITUTIONAL VENDOR'!$C$6,K141)),MAX($J$2:J140)+1,0)","v":0},"5750 - Switzerland",{"$f":"IFERROR(VLOOKUP(ROWS($L$2:L140),J:K,2,0),\"\")","v":""}," within 29 days 1.5 % cash discount",{"$nulls":11},"0990Q00000 - BENI DRC",{"$nulls":7},"423 Togo",{"$nulls":7},{"$f":"IF(ISNUMBER(SEARCH('INSTITUTIONAL VENDOR'!$C$35,AP141)),MAX($AO$7:AO140)+1,0)","v":0},"423 Togo",{"$f":"IFERROR(VLOOKUP(ROWS(AQ$7:$AQ140),AO:AP,2,0),\"\")","v":""},"449 Utd.Arab.Emir.","441 Ukraine","Yes"]
[null,null,{"$f":"IF(ISNUMBER(SEARCH('INSTITUTIONAL VENDOR'!$E$12,D142)),MAX($C$1:C141)+1,0)","v":0},"449 Utd.Arab.Emir.",{"$f":"IFERROR(VLOOKUP(ROWS($E$1:E141),C:D,2,0),\"\")","v":""},{"$f":"IF(ISNUMBER(SEARCH('INSTITUTIONAL VENDOR'!$C$31,G142)),MAX($F$2:F141)+1,0)","v":0},"TZS Tanzanian Shilling",{"$f":"IFERROR(VLOOKUP(ROWS($H$2:H141),F:G,2,0),\"\")","v":""},null,{"$f":"IF(ISNUMBER(SEARCH('INSTITUTIONAL VENDOR'!$C$6,K142)),MAX($J$2:J141)+1,0)","v":0},"575R - ECARO, Switzerland",{"$f":"IFERROR(VLOOKUP(ROWS($L$2:L141),J:K,2,0),\"\")","v":""}," within 30 days Due net",{"$nulls":11},"1020A00000 - COSTA RICA",{"$nulls":7},"429 Trinidad and Tobago",{"$nulls":7},{"$f":"IF(ISNUMBER(SEARCH('INSTITUTIONAL VENDOR'!$C$35,AP142)),MAX($AO$7:AO141)+1,0)","v":0},"429 Trinidad,Tobago",{"$f":"IFERROR(VLOOKUP(ROWS(AQ$7:$AQ141),AO:AP,2,0),\"\")","v":""},"450 Egypt","449 Utd.Arab.Emir.","Yes"]
[null,null,{"$f":"IF(ISNUMBER(SEARCH('INSTITUTIONAL VENDOR'!$E$12,D143)),MAX($C$1:C142)+1,0)","v":0},"450 Egypt",{"$f":"IFERROR(VLOOKUP(ROWS($E$1:E142),C:D,2,0),\"\")","v":""},{"$f":"IF(ISNUMBER(SEARCH('INSTITUTIONAL VENDOR'!$C$31,G143)),MAX($F$2:F142)+1,0)","v":1},"UAH Ukrainian Hryvnia",{"$f":"IFERROR(VLOOKUP(ROWS($H$2:H142),F:G,2,0),\"\")","v":""},null,{"$f":"IF(ISNUMBER(SEARCH('INSTITUTIONAL VENDOR'!$C$6,K143)),MAX($J$2:J142)+1,0)","v":0},"6110 - Belize",{"$f":"IFERROR(VLOOKUP(ROWS($L$2:L142),J:K,2,0),\"\")","v":""},"Y104 within 7 days 0.5 % cash discount",{"$nulls":11},"1020B00000 - SAN JOSE COSTA RICA",{"$nulls":7},"432 Tunisia",{"$nulls":7},{"$f":"IF(ISNUMBER(SEARCH('INSTITUTIONAL VENDOR'!$C$35,AP143)),MAX($AO$7:AO142)+1,0)","v":0},"432 Tunisia",{"$f":"IFERROR(VLOOKUP(ROWS(AQ$7:$AQ142),AO:AP,2,0),\"\")","v":""},"453 United Kingdom","450 Egypt","Yes"]
[null,null,{"$f":"IF(ISNUMBER(SEARCH('INSTITUTIONAL VENDOR'!$E$12,D144)),MAX($C$1:C143)+1,0)","v":0},"453 United Kingdom",{"$f":"IFERROR(VLOOKUP(ROWS($E$1:E143),C:D,2,0),\"\")","v":""},{"$f":"IF(ISNUMBER(SEARCH('INSTITUTIONAL VENDOR'!$C$31,G144)),MAX($F$2:F143)+1,0)","v":0},"UGX Ugandan Shilling",{"$f":"IFERROR(VLOOKUP(ROWS($H$2:H143),F:G,2,0),\"\")","v":""},null,{"$f":"IF(ISNUMBER(SEARCH('INSTITUTIONAL VENDOR'!$C$6,K144)),MAX($J$2:J143)+1,0)","v":0},"6260 - Zimbabwe",{"$f":"IFERROR(VLOOKUP(ROWS($L$2:L143),J:K,2,0),\"\")","v":""}," within 30 days Due net",{"$nulls":11},"1030A00000 - CROATIA",{"$nulls":7},"435 Turkey",{"$nulls":7},{"$f":"IF(ISNUMBER(SEARCH('INSTITUTIONAL VENDOR'!$C$35,AP144)),MAX($AO$7:AO143)+1,0)","v":0},"435 Turkey",{"$f":"IFERROR(VLOOKUP(ROWS(AQ$7:$AQ143),AO:AP,2,0),\"\")","v":""},"455 Tanzania,Uni.Re","453 United Kingdom","No"]
[null,null,{"$f":"IF(ISNUMBER(SEARCH('INSTITUTIONAL VENDOR'!$E$12,D145)),MAX($C$1:C144)+1,0)","v":0},"455 Tanzania,Uni.Re",{"$f":"IFERROR(VLOOKUP(ROWS($E$1:E144),C:D,2,0),\"\")","v":""},{"$f":"IF(ISNUMBER(SEARCH('INSTITUTIONAL VENDOR'!$C$31,G145)),MAX($F$2:F144)+1,0)","v":0},"USD US Dollar",{"$f":"IFERROR(VLOOKUP(ROWS($H$2:H144),F:G,2,0),\"\")","v":""},null,{"$f":"IF(ISNUMBER(SEARCH('INSTITUTIONAL VENDOR'!$C$6,K145)),MAX($J$2:J144)+1,0)","v":0},"6350 - Oman",{"$f":"IFERROR(VLOOKUP(ROWS($L$2:L144),J:K,2,0),\"\")","v":""},"Y105 within 7 days 0.7 % cash discount",{"$nulls":11},"1030B00000 - ZAGREB CROATIA",{"$nulls":7},"436 Turkmenistan",{"$nulls":7},{"$f":"IF(ISNUMBER(SEARCH('INSTITUTIONAL VENDOR'!$C$35,AP145)),MAX($AO$7:AO144)+1,0)","v":0},"436 Turkmenistan",{"$f":"IFERROR(VLOOKUP(ROWS(AQ$7:$AQ144),AO:AP,2,0),\"\")","v":""},"456 USA","455 Tanzania,Uni.Re","Yes"]
[null,null,{"$f":"IF(ISNUMBER(SEARCH('INSTITUTIONAL VENDOR'!$E$12,D146)),MAX($C$1:C145)+1,0)","v":0},"456 USA",{"$f":"IFERROR(VLOOKUP(ROWS($E$1:E145),C:D,2,0),\"\")","v":""},{"$f":"IF(ISNUMBER(SEARCH('INSTITUTIONAL VENDOR'!$C$31,G146)),MAX($F$2:F145)+1,0)","v":0},"UYU Uruguayan Peso",{"$f":"IFERROR(VLOOKUP(ROWS($H$2:H145),F:G,2,0),\"\")","v":""},null,{"$f":"IF(ISNUMBER(SEARCH('INSTITUTIONAL VENDOR'!$C$6,K146)),MAX($J$2:J145)+1,0)","v":0},"6490 - Papua New Guinea",{"$f":"IFERROR(VLOOKUP(ROWS($L$2:L145),J:K,2,0),\"\")","v":""}," within 30 days Due net",{"$nulls":11},"1050A00000 - CUBA",{"$nulls":7},"438 Uganda",{"$nulls":7},{"$f":"IF(ISNUMBER(SEARCH('INSTITUTIONAL VENDOR'!$C$35,AP146)),MAX($AO$7:AO145)+1,0)","v":0},"438 Uganda",{"$f":"IFERROR(VLOOKUP(ROWS(AQ$7:$AQ145),AO:AP,2,0),\"\")","v":""},"459 Burkina-Faso","456 USA","No"]
[null,null,{"$f":"IF(ISNUMBER(SEARCH('INSTITUTIONAL VENDOR'!$E$12,D147)),MAX($C$1:C146)+1,0)","v":0},"459 Burkina-Faso",{"$f":"IFERROR(VLOOKUP(ROWS($E$1:E146),C:D,2,0),\"\")","v":""},{"$f":"IF(ISNUMBER(SEARCH('INSTITUTIONAL VENDOR'!$C$31,G147)),MAX($F$2:F146)+1,0)","v":0},"UZS Uzbekistan Som",{"$f":"IFERROR(VLOOKUP(ROWS($H$2:H146),F:G,2,0),\"\")","v":""},null,{"$f":"IF(ISNUMBER(SEARCH('INSTITUTIONAL VENDOR'!$C$6,K147)),MAX($J$2:J146)+1,0)","v":0},"6620 - Comoros",{"$f":"IFERROR(VLOOKUP(ROWS($L$2:L146),J:K,2,0),\"\")","v":""},"Y106 within 10 days 1 % cash discount",{"$nulls":11},"1050B00000 - HAVANA CUBA",{"$nulls":7},"441 Ukraine",{"$nulls":7},{"$f":"IF(ISNUMBER(SEARCH('INSTITUTIONAL VENDOR'!$C$35,AP147)),MAX($AO$7:AO146)+1,0)","v":1},"441 Ukraine",{"$f":"IFERROR(VLOOKUP(ROWS(AQ$7:$AQ146),AO:AP,2,0),\"\")","v":""},"462 Uruguay","459 Burkina-Faso","Yes"]
[null,null,{"$f":"IF(ISNUMBER(SEARCH('INSTITUTIONAL VENDOR'!$E$12,D148)),MAX($C$1:C147)+1,0)","v":0},"462 Uruguay",{"$f":"IFERROR(VLOOKUP(ROWS($E$1:E147),C:D,2,0),\"\")","v":""},{"$f":"IF(ISNUMBER(SEARCH('INSTITUTIONAL VENDOR'!$C$31,G148)),MAX($F$2:F147)+1,0)","v":0},"VES Venezuela Bolivar Soberano",{"$f":"IFERROR(VLOOKUP(ROWS($H$2:H147),F:G,2,0),\"\")","v":""},null,{"$f":"IF(ISNUMBER(SEARCH('INSTITUTIONAL VENDOR'!$C$6,K148)),MAX($J$2:J147)+1,0)","v":0},"6690 - Djibouti",{"$f":"IFERROR(VLOOKUP(ROWS($L$2:L147),J:K,2,0),\"\")","v":""}," within 30 days Due net",{"$nulls":11},"1170A00000 - BENIN",{"$nulls":7},"449 United Arab Emirates",{"$nulls":7},{"$f":"IF(ISNUMBER(SEARCH('INSTITUTIONAL VENDOR'!$C$35,AP148)),MAX($AO$7:AO147)+1,0)","v":0},"449 Utd.Arab.Emir.",{"$f":"IFERROR(VLOOKUP(ROWS(AQ$7:$AQ147),AO:AP,2,0),\"\")","v":""},"463 Uzbekistan","462 Uruguay","Yes"]
[null,null,{"$f":"IF(ISNUMBER(SEARCH('INSTITUTIONAL VENDOR'!$E$12,D149)),MAX($C$1:C148)+1,0)","v":0},"463 Uzbekistan",{"$f":"IFERROR(VLOOKUP(ROWS($E$1:E148),C:D,2,0),\"\")","v":""},{"$f":"IF(ISNUMBER(SEARCH('INSTITUTIONAL VENDOR'!$C$31,G149)),MAX($F$2:F148)+1,0)","v":0},"VND Vietnamese Dong",{"$f":"IFERROR(VLOOKUP(ROWS($H$2:H148),F:G,2,0),\"\")","v":""},null,{"$f":"IF(ISNUMBER(SEARCH('INSTITUTIONAL VENDOR'!$C$6,K149)),MAX($J$2:J148)+1,0)","v":0},"6810 - Angola",{"$f":"IFERROR(VLOOKUP(ROWS($L$2:L148),J:K,2,0),\"\")","v":""},"Y107 within 10 days 1.5 % cash discount",{"$nulls":11},"1170B00000 - COTONOU BENIN",{"$nulls":7},"450 Egypt",{"$nulls":7},{"$f":"IF(ISNUMBER(SEARCH('INSTITUTIONAL VENDOR'!$C$35,AP149)),MAX($AO$7:AO148)+1,0)","v":0},"450 Egypt",{"$f":"IFERROR(VLOOKUP(ROWS(AQ$7:$AQ148),AO:AP,2,0),\"\")","v":""},"471 Venezuela","463 Uzbekistan","Yes"]
[null,null,{"$f":"IF(ISNUMBER(SEARCH('INSTITUTIONAL VENDOR'!$E$12,D150)),MAX($C$1:C149)+1,0)","v":0},"471 Venezuela",{"$f":"IFERROR(VLOOKUP(ROWS($E$1:E149),C:D,2,0),\"\")","v":""},{"$f":"IF(ISNUMBER(SEARCH('INSTITUTIONAL VENDOR'!$C$31,G150)),MAX($F$2:F149)+1,0)","v":0},"VUV Vanuatu Vatu",{"$f":"IFERROR(VLOOKUP(ROWS($H$2:H149),F:G,2,0),\"\")","v":""},null,{"$f":"IF(ISNUMBER(SEARCH('INSTITUTIONAL VENDOR'!$C$6,K150)),MAX($J$2:J149)+1,0)","v":0},"6820 - Cabo Verde",{"$f":"IFERROR(VLOOKUP(ROWS($L$2:L149),J:K,2,0),\"\")","v":""}," within 30 days Due net",{"$nulls":11},"1170C00000 - PARAKOU",{"$nulls":7},"453 United Kingdom",{"$nulls":7},{"$f":"IF(ISNUMBER(SEARCH('INSTITUTIONAL VENDOR'!$C$35,AP150)),MAX($AO$7:AO149)+1,0)","v":0},"453 United Kingdom",{"$f":"IFERROR(VLOOKUP(ROWS(AQ$7:$AQ149),AO:AP,2,0),\"\")","v":""},"492 Yemen, Rep of","471 Venezuela","Yes"]
[null,null,{"$f":"IF(ISNUMBER(SEARCH('INSTITUTIONAL VENDOR'!$E$12,D151)),MAX($C$1:C150)+1,0)","v":0},"492 Yemen, Rep of",{"$f":"IFERROR(VLOOKUP(ROWS($E$1:E150),C:D,2,0),\"\")","v":""},{"$f":"IF(ISNUMBER(SEARCH('INSTITUTIONAL VENDOR'!$C$31,G151)),MAX($F$2:F150)+1,0)","v":0},"WST Samoan Tala",{"$f":"IFERROR(VLOOKUP(ROWS($H$2:H150),F:G,2,0),\"\")","v":""},null,{"$f":"IF(ISNUMBER(SEARCH('INSTITUTIONAL VENDOR'!$C$6,K151)),MAX($J$2:J150)+1,0)","v":0},"6830 - Sao Tome & Principe",{"$f":"IFERROR(VLOOKUP(ROWS($L$2:L150),J:K,2,0),\"\")","v":""},"Y108 within 10 days 2 % cash discount",{"$nulls":11},"1200A00000 - SUPPLY DIVISION",{"$nulls":7},"455 Tanzania, United Rep. of",{"$nulls":7},{"$f":"IF(ISNUMBER(SEARCH('INSTITUTIONAL VENDOR'!$C$35,AP151)),MAX($AO$7:AO150)+1,0)","v":0},"455 Tanzania,Uni.Re",{"$f":"IFERROR(VLOOKUP(ROWS(AQ$7:$AQ150),AO:AP,2,0),\"\")","v":""},"498 Zambia","492 Yemen, Rep of","Yes"]
[null,null,{"$f":"IF(ISNUMBER(SEARCH('INSTITUTIONAL VENDOR'!$E$12,D152)),MAX($C$1:C151)+1,0)","v":0},"495 Yugoslavia",{"$f":"IFERROR(VLOOKUP(ROWS($E$1:E151),C:D,2,0),\"\")","v":""},{"$f":"IF(ISNUMBER(SEARCH('INSTITUTIONAL VENDOR'!$C$31,G152)),MAX($F$2:F151)+1,0)","v":0},"XAF C.F.A. Franc (BEAC)",{"$f":"IFERROR(VLOOKUP(ROWS($H$2:H151),F:G,2,0),\"\")","v":""},null,{"$f":"IF(ISNUMBER(SEARCH('INSTITUTIONAL VENDOR'!$C$6,K152)),MAX($J$2:J151)+1,0)","v":0},"6850 - Guinea Bissau",{"$f":"IFERROR(VLOOKUP(ROWS($L$2:L151),J:K,2,0),\"\")","v":""}," within 30 days Due net",{"$nulls":11},"1200A00100 - DIRECTOR'S OFFICE",{"$nulls":7},"456 United States of America",{"$nulls":7},{"$f":"IF(ISNUMBER(SEARCH('INSTITUTIONAL VENDOR'!$C$35,AP152)),MAX($AO$7:AO151)+1,0)","v":0},"456 USA",{"$f":"IFERROR(VLOOKUP(ROWS(AQ$7:$AQ151),AO:AP,2,0),\"\")","v":""},"505 Andorra","495 Yugoslavia","Yes"]
[null,null,{"$f":"IF(ISNUMBER(SEARCH('INSTITUTIONAL VENDOR'!$E$12,D153)),MAX($C$1:C152)+1,0)","v":0},"498 Zambia",{"$f":"IFERROR(VLOOKUP(ROWS($E$1:E152),C:D,2,0),\"\")","v":""},{"$f":"IF(ISNUMBER(SEARCH('INSTITUTIONAL VENDOR'!$C$31,G153)),MAX($F$2:F152)+1,0)","v":0},"XCD East Carribean Dollar",{"$f":"IFERROR(VLOOKUP(ROWS($H$2:H152),F:G,2,0),\"\")","v":""},null,{"$f":"IF(ISNUMBER(SEARCH('INSTITUTIONAL VENDOR'!$C$6,K153)),MAX($J$2:J152)+1,0)","v":0},"6890 - Republic of Mozambique",{"$f":"IFERROR(VLOOKUP(ROWS($L$2:L152),J:K,2,0),\"\")","v":""},"Y109 within 10 days 3 % cash discount",{"$nulls":11},"1200A00300 - CPH LOGISTICS",{"$nulls":7},"459 Burkina Faso",{"$nulls":7},{"$f":"IF(ISNUMBER(SEARCH('INSTITUTIONAL VENDOR'!$C$35,AP153)),MAX($AO$7:AO152)+1,0)","v":0},"459 Burkina-Faso",{"$f":"IFERROR(VLOOKUP(ROWS(AQ$7:$AQ152),AO:AP,2,0),\"\")","v":""},"507 Bangladesh","498 Zambia","Yes"]
[null,null,{"$f":"IF(ISNUMBER(SEARCH('INSTITUTIONAL VENDOR'!$E$12,D154)),MAX($C$1:C153)+1,0)","v":0},"505 Andorra",{"$f":"IFERROR(VLOOKUP(ROWS($E$1:E153),C:D,2,0),\"\")","v":""},{"$f":"IF(ISNUMBER(SEARCH('INSTITUTIONAL VENDOR'!$C$31,G154)),MAX($F$2:F153)+1,0)","v":0},"XOF C.F.A. Franc (BCEAO)",{"$f":"IFERROR(VLOOKUP(ROWS($H$2:H153),F:G,2,0),\"\")","v":""},null,{"$f":"IF(ISNUMBER(SEARCH('INSTITUTIONAL VENDOR'!$C$6,K154)),MAX($J$2:J153)+1,0)","v":0},"6980 - Namibia",{"$f":"IFERROR(VLOOKUP(ROWS($L$2:L153),J:K,2,0),\"\")","v":""}," within 30 days Due net",{"$nulls":11},"1200A00400 - CONTRACTING CENTRE",{"$nulls":7},"462 Uruguay",{"$nulls":7},{"$f":"IF(ISNUMBER(SEARCH('INSTITUTIONAL VENDOR'!$C$35,AP154)),MAX($AO$7:AO153)+1,0)","v":0},"462 Uruguay",{"$f":"IFERROR(VLOOKUP(ROWS(AQ$7:$AQ153),AO:AP,2,0),\"\")","v":""},"515 D.P.R. of Korea","505 Andorra","No"]
[null,null,{"$f":"IF(ISNUMBER(SEARCH('INSTITUTIONAL VENDOR'!$E$12,D155)),MAX($C$1:C154)+1,0)","v":0},"507 Bangladesh",{"$f":"IFERROR(VLOOKUP(ROWS($E$1:E154),C:D,2,0),\"\")","v":""},{"$f":"IF(ISNUMBER(SEARCH('INSTITUTIONAL VENDOR'!$C$31,G155)),MAX($F$2:F154)+1,0)","v":0},"YER Yemeni Rial",{"$f":"IFERROR(VLOOKUP(ROWS($H$2:H154),F:G,2,0),\"\")","v":""},null,{"$f":"IF(ISNUMBER(SEARCH('INSTITUTIONAL VENDOR'!$C$6,K155)),MAX($J$2:J154)+1,0)","v":0},"7050 - Palestine, State of",{"$f":"IFERROR(VLOOKUP(ROWS($L$2:L154),J:K,2,0),\"\")","v":""},"Y110 within 15 days 0.5 % cash discount",{"$nulls":11},"1200A00600 - QUALITY ASSURANCE",{"$nulls":7},"463 Uzbekistan",{"$nulls":7},{"$f":"IF(ISNUMBER(SEARCH('INSTITUTIONAL VENDOR'!$C$35,AP155)),MAX($AO$7:AO154)+1,0)","v":0},"463 Uzbekistan",{"$f":"IFERROR(VLOOKUP(ROWS(AQ$7:$AQ154),AO:AP,2,0),\"\")","v":""},"520 Vietnam","507 Bangladesh","Yes"]
[null,null,{"$f":"IF(ISNUMBER(SEARCH('INSTITUTIONAL VENDOR'!$E$12,D156)),MAX($C$1:C155)+1,0)","v":0},"515 D.P.R. of Korea",{"$f":"IFERROR(VLOOKUP(ROWS($E$1:E155),C:D,2,0),\"\")","v":""},{"$f":"IF(ISNUMBER(SEARCH('INSTITUTIONAL VENDOR'!$C$31,G156)),MAX($F$2:F155)+1,0)","v":0},"ZAR South African Rand",{"$f":"IFERROR(VLOOKUP(ROWS($H$2:H155),F:G,2,0),\"\")","v":""},null,{"$f":"IF(ISNUMBER(SEARCH('INSTITUTIONAL VENDOR'!$C$6,K156)),MAX($J$2:J155)+1,0)","v":0},"7060 - Timor-Leste",{"$f":"IFERROR(VLOOKUP(ROWS($L$2:L155),J:K,2,0),\"\")","v":""}," within 30 days Due net",{"$nulls":11},"1200A00700 - HUMAN RESOURCES",{"$nulls":7},"471 Venezuela",{"$nulls":7},{"$f":"IF(ISNUMBER(SEARCH('INSTITUTIONAL VENDOR'!$C$35,AP156)),MAX($AO$7:AO155)+1,0)","v":0},"471 Venezuela",{"$f":"IFERROR(VLOOKUP(ROWS(AQ$7:$AQ155),AO:AP,2,0),\"\")","v":""},"525 Germany","515 D.P.R. of Korea","Yes"]
[null,null,{"$f":"IF(ISNUMBER(SEARCH('INSTITUTIONAL VENDOR'!$E$12,D157)),MAX($C$1:C156)+1,0)","v":0},"520 Vietnam",{"$f":"IFERROR(VLOOKUP(ROWS($E$1:E156),C:D,2,0),\"\")","v":""},{"$f":"IF(ISNUMBER(SEARCH('INSTITUTIONAL VENDOR'!$C$31,G157)),MAX($F$2:F156)+1,0)","v":0},"ZMW Zambian Kwacha",{"$f":"IFERROR(VLOOKUP(ROWS($H$2:H156),F:G,2,0),\"\")","v":""},null,{"$f":"IF(ISNUMBER(SEARCH('INSTITUTIONAL VENDOR'!$C$6,K157)),MAX($J$2:J156)+1,0)","v":0},"8950 - Republic of Montenegro",{"$f":"IFERROR(VLOOKUP(ROWS($L$2:L156),J:K,2,0),\"\")","v":""},"Y111 within 15 days 0.55 % cash discount",{"$nulls":11},"1200A00800 - FIN MGMT AND ADMIN",{"$nulls":7},"492 Republic of Yemen",{"$nulls":7},{"$f":"IF(ISNUMBER(SEARCH('INSTITUTIONAL VENDOR'!$C$35,AP157)),MAX($AO$7:AO156)+1,0)","v":0},"492 Yemen, Rep of",{"$f":"IFERROR(VLOOKUP(ROWS(AQ$7:$AQ156),AO:AP,2,0),\"\")","v":""},"535 Vatican City","520 Vietnam","Yes"]
[null,null,{"$f":"IF(ISNUMBER(SEARCH('INSTITUTIONAL VENDOR'!$E$12,D158)),MAX($C$1:C157)+1,0)","v":0},"525 Germany",{"$f":"IFERROR(VLOOKUP(ROWS($E$1:E157),C:D,2,0),\"\")","v":""},{"$f":"IF(ISNUMBER(SEARCH('INSTITUTIONAL VENDOR'!$C$31,G158)),MAX($F$2:F157)+1,0)","v":0},"ZWL Zimbabwe Dollar",{"$f":"IFERROR(VLOOKUP(ROWS($H$2:H157),F:G,2,0),\"\")","v":""},null,{"$f":"IF(ISNUMBER(SEARCH('INSTITUTIONAL VENDOR'!$C$6,K158)),MAX($J$2:J157)+1,0)","v":0},"8970 - Serbia",{"$f":"IFERROR(VLOOKUP(ROWS($L$2:L157),J:K,2,0),\"\")","v":""}," within 30 days Due net",{"$nulls":11},"1200A00900 - OATC",{"$nulls":7},"495 (Yugoslavia)",{"$nulls":7},{"$f":"IF(ISNUMBER(SEARCH('INSTITUTIONAL VENDOR'!$C$35,AP158)),MAX($AO$7:AO157)+1,0)","v":0},"495 Yugoslavia",{"$f":"IFERROR(VLOOKUP(ROWS(AQ$7:$AQ157),AO:AP,2,0),\"\")","v":""},"555 Liechtenstein","525 Germany","No"]
[null,null,{"$f":"IF(ISNUMBER(SEARCH('INSTITUTIONAL VENDOR'!$E$12,D159)),MAX($C$1:C158)+1,0)","v":0},"535 Vatican City",{"$f":"IFERROR(VLOOKUP(ROWS($E$1:E158),C:D,2,0),\"\")","v":""},{"$nulls":4},{"$f":"IF(ISNUMBER(SEARCH('INSTITUTIONAL VENDOR'!$C$6,K159)),MAX($J$2:J158)+1,0)","v":0},"8971 - Kosovo",{"$f":"IFERROR(VLOOKUP(ROWS($L$2:L158),J:K,2,0),\"\")","v":""},"Y112 within 15 days 0.6 % cash discount",{"$nulls":11},"1200A01100 - THE LOGISTICS CENTRE",{"$nulls":7},"498 Zambia",{"$nulls":7},{"$f":"IF(ISNUMBER(SEARCH('INSTITUTIONAL VENDOR'!$C$35,AP159)),MAX($AO$7:AO158)+1,0)","v":0},"498 Zambia",{"$f":"IFERROR(VLOOKUP(ROWS(AQ$7:$AQ158),AO:AP,2,0),\"\")","v":""},"564 Moldova, Rep of","535 Vatican City","No"]
[null,null,{"$f":"IF(ISNUMBER(SEARCH('INSTITUTIONAL VENDOR'!$E$12,D160)),MAX($C$1:C159)+1,0)","v":0},"555 Liechtenstein",{"$f":"IFERROR(VLOOKUP(ROWS($E$1:E159),C:D,2,0),\"\")","v":""},{"$nulls":7}," within 30 days Due net",{"$nulls":11},"1200A01300 - PS SUPPORT TO FO",{"$nulls":7},"505 Andorra",{"$nulls":7},{"$f":"IF(ISNUMBER(SEARCH('INSTITUTIONAL VENDOR'!$C$35,AP160)),MAX($AO$7:AO159)+1,0)","v":0},"499 Stateless",{"$f":"IFERROR(VLOOKUP(ROWS(AQ$7:$AQ159),AO:AP,2,0),\"\")","v":""},"565 Monaco","555 Liechtenstein","No"]
[null,null,{"$f":"IF(ISNUMBER(SEARCH('INSTITUTIONAL VENDOR'!$E$12,D161)),MAX($C$1:C160)+1,0)","v":0},"564 Moldova, Rep of",{"$f":"IFERROR(VLOOKUP(ROWS($E$1:E160),C:D,2,0),\"\")","v":""},{"$nulls":7},"Y113 within 15 days 1 % cash discount",{"$nulls":11},"1200A01800 - PROCUREMENT SERVICES",{"$nulls":7},"507 Bangladesh",{"$nulls":7},{"$f":"IF(ISNUMBER(SEARCH('INSTITUTIONAL VENDOR'!$C$35,AP161)),MAX($AO$7:AO160)+1,0)","v":0},"505 Andorra",{"$f":"IFERROR(VLOOKUP(ROWS(AQ$7:$AQ160),AO:AP,2,0),\"\")","v":""},"567 South Korea,Rep","564 Moldova, Rep of","Yes"]
[null,null,{"$f":"IF(ISNUMBER(SEARCH('INSTITUTIONAL VENDOR'!$E$12,D162)),MAX($C$1:C161)+1,0)","v":0},"565 Monaco",{"$f":"IFERROR(VLOOKUP(ROWS($E$1:E161),C:D,2,0),\"\")","v":""},{"$nulls":7}," within 30 days Due net",{"$nulls":11},"1200A02000 - SUPPLY CENTER NY",{"$nulls":7},"515 D.P.R  of Korea",{"$nulls":7},{"$f":"IF(ISNUMBER(SEARCH('INSTITUTIONAL VENDOR'!$C$35,AP162)),MAX($AO$7:AO161)+1,0)","v":0},"507 Bangladesh",{"$f":"IFERROR(VLOOKUP(ROWS(AQ$7:$AQ161),AO:AP,2,0),\"\")","v":""},"570 San Marino","565 Monaco","No"]
[null,null,{"$f":"IF(ISNUMBER(SEARCH('INSTITUTIONAL VENDOR'!$E$12,D163)),MAX($C$1:C162)+1,0)","v":0},"567 South Korea,Rep",{"$f":"IFERROR(VLOOKUP(ROWS($E$1:E162),C:D,2,0),\"\")","v":""},{"$nulls":7},"Y114 within 15 days 2 % cash discount",{"$nulls":11},"1200A02300 - VACCINE CENTRE",{"$nulls":7},"520 Viet Nam",{"$nulls":7},{"$f":"IF(ISNUMBER(SEARCH('INSTITUTIONAL VENDOR'!$C$35,AP163)),MAX($AO$7:AO162)+1,0)","v":0},"515 D.P.R. of Korea",{"$f":"IFERROR(VLOOKUP(ROWS(AQ$7:$AQ162),AO:AP,2,0),\"\")","v":""},"575 Switzerland","567 South Korea,Rep","No"]
[null,null,{"$f":"IF(ISNUMBER(SEARCH('INSTITUTIONAL VENDOR'!$E$12,D164)),MAX($C$1:C163)+1,0)","v":0},"570 San Marino",{"$f":"IFERROR(VLOOKUP(ROWS($E$1:E163),C:D,2,0),\"\")","v":""},{"$nulls":7}," within 30 days Due net",{"$nulls":11},"1200A02400 - MEDICINES/NUTRITION",{"$nulls":7},"525 Germany",{"$nulls":7},{"$f":"IF(ISNUMBER(SEARCH('INSTITUTIONAL VENDOR'!$C$35,AP164)),MAX($AO$7:AO163)+1,0)","v":0},"520 Vietnam",{"$f":"IFERROR(VLOOKUP(ROWS(AQ$7:$AQ163),AO:AP,2,0),\"\")","v":""},"590 Samoa","570 San Marino","No"]
[null,null,{"$f":"IF(ISNUMBER(SEARCH('INSTITUTIONAL VENDOR'!$E$12,D165)),MAX($C$1:C164)+1,0)","v":0},"575 Switzerland",{"$f":"IFERROR(VLOOKUP(ROWS($E$1:E164),C:D,2,0),\"\")","v":""},{"$nulls":19},"1200A02500 - WATER SANIT & EDUC",{"$nulls":7},"535 Holy See",{"$nulls":7},{"$f":"IF(ISNUMBER(SEARCH('INSTITUTIONAL VENDOR'!$C$35,AP165)),MAX($AO$7:AO164)+1,0)","v":0},"525 Germany",{"$f":"IFERROR(VLOOKUP(ROWS(AQ$7:$AQ164),AO:AP,2,0),\"\")","v":""},"601 Antigua/Barbuda","575 Switzerland","No"]
[null,null,{"$f":"IF(ISNUMBER(SEARCH('INSTITUTIONAL VENDOR'!$E$12,D166)),MAX($C$1:C165)+1,0)","v":0},"590 Samoa",{"$f":"IFERROR(VLOOKUP(ROWS($E$1:E165),C:D,2,0),\"\")","v":""},{"$nulls":19},"1200A02600 - HTC",{"$nulls":7},"555 Liechtenstein",{"$nulls":7},{"$f":"IF(ISNUMBER(SEARCH('INSTITUTIONAL VENDOR'!$C$35,AP166)),MAX($AO$7:AO165)+1,0)","v":0},"535 Vatican City",{"$f":"IFERROR(VLOOKUP(ROWS(AQ$7:$AQ165),AO:AP,2,0),\"\")","v":""},"602 Brunei Darussal","590 Samoa","Yes"]
[null,null,{"$f":"IF(ISNUMBER(SEARCH('INSTITUTIONAL VENDOR'!$E$12,D167)),MAX($C$1:C166)+1,0)","v":0},"601 Antigua/Barbuda",{"$f":"IFERROR(VLOOKUP(ROWS($E$1:E166),C:D,2,0),\"\")","v":""},{"$nulls":19},"1200A02700 - KMC",{"$nulls":7},"564 Republic of Moldova",{"$nulls":7},{"$f":"IF(ISNUMBER(SEARCH('INSTITUTIONAL VENDOR'!$C$35,AP167)),MAX($AO$7:AO166)+1,0)","v":0},"555 Liechtenstein",{"$f":"IFERROR(VLOOKUP(ROWS(AQ$7:$AQ166),AO:AP,2,0),\"\")","v":""},"603 Bahamas","601 Antigua/Barbuda","Yes"]
[null,null,{"$f":"IF(ISNUMBER(SEARCH('INSTITUTIONAL VENDOR'!$E$12,D168)),MAX($C$1:C167)+1,0)","v":0},"602 Brunei Darussal",{"$f":"IFERROR(VLOOKUP(ROWS($E$1:E167),C:D,2,0),\"\")","v":""},{"$nulls":19},"1200A02800 - INNOVATION UNIT",{"$nulls":7},"565 Monaco",{"$nulls":7},{"$f":"IF(ISNUMBER(SEARCH('INSTITUTIONAL VENDOR'!$C$35,AP168)),MAX($AO$7:AO167)+1,0)","v":0},"564 Moldova, Rep of",{"$f":"IFERROR(VLOOKUP(ROWS(AQ$7:$AQ167),AO:AP,2,0),\"\")","v":""},"604 Bahrain","602 Brunei Darussal","Yes"]
[null,null,{"$f":"IF(ISNUMBER(SEARCH('INSTITUTIONAL VENDOR'!$E$12,D169)),MAX($C$1:C168)+1,0)","v":0},"603 Bahamas",{"$f":"IFERROR(VLOOKUP(ROWS($E$1:E168),C:D,2,0),\"\")","v":""},{"$nulls":19},"1200A02900 - EMERGENCY UNIT",{"$nulls":7},"567 Republic of Korea",{"$nulls":7},{"$f":"IF(ISNUMBER(SEARCH('INSTITUTIONAL VENDOR'!$C$35,AP169)),MAX($AO$7:AO168)+1,0)","v":0},"565 Monaco",{"$f":"IFERROR(VLOOKUP(ROWS(AQ$7:$AQ168),AO:AP,2,0),\"\")","v":""},"605 Bermuda","603 Bahamas","Yes"]
[null,null,{"$f":"IF(ISNUMBER(SEARCH('INSTITUTIONAL VENDOR'!$E$12,D170)),MAX($C$1:C169)+1,0)","v":0},"604 Bahrain",{"$f":"IFERROR(VLOOKUP(ROWS($E$1:E169),C:D,2,0),\"\")","v":""},{"$nulls":19},"1200A03000 - SUPPLY CHAIN",{"$nulls":7},"570 San Marino",{"$nulls":7},{"$f":"IF(ISNUMBER(SEARCH('INSTITUTIONAL VENDOR'!$C$35,AP170)),MAX($AO$7:AO169)+1,0)","v":0},"567 South Korea,Rep",{"$f":"IFERROR(VLOOKUP(ROWS(AQ$7:$AQ169),AO:AP,2,0),\"\")","v":""},"610 Dominica","604 Bahrain","Yes"]
[null,null,{"$f":"IF(ISNUMBER(SEARCH('INSTITUTIONAL VENDOR'!$E$12,D171)),MAX($C$1:C170)+1,0)","v":0},"605 Bermuda",{"$f":"IFERROR(VLOOKUP(ROWS($E$1:E170),C:D,2,0),\"\")","v":""},{"$nulls":19},"1200A03100 - MARKETSFIN & STR.",{"$nulls":7},"575 Switzerland",{"$nulls":7},{"$f":"IF(ISNUMBER(SEARCH('INSTITUTIONAL VENDOR'!$C$35,AP171)),MAX($AO$7:AO170)+1,0)","v":0},"570 San Marino",{"$f":"IFERROR(VLOOKUP(ROWS(AQ$7:$AQ170),AO:AP,2,0),\"\")","v":""},"611 Belize","605 Bermuda","Yes"]
[null,null,{"$f":"IF(ISNUMBER(SEARCH('INSTITUTIONAL VENDOR'!$E$12,D172)),MAX($C$1:C171)+1,0)","v":0},"610 Dominica",{"$f":"IFERROR(VLOOKUP(ROWS($E$1:E171),C:D,2,0),\"\")","v":""},{"$nulls":19},"1200A03200 - INTL. TRANSPORT UNIT",{"$nulls":7},"590 Samoa",{"$nulls":7},{"$f":"IF(ISNUMBER(SEARCH('INSTITUTIONAL VENDOR'!$C$35,AP172)),MAX($AO$7:AO171)+1,0)","v":0},"575 Switzerland",{"$f":"IFERROR(VLOOKUP(ROWS(AQ$7:$AQ171),AO:AP,2,0),\"\")","v":""},"612 Hong Kong","610 Dominica","Yes"]
[null,null,{"$f":"IF(ISNUMBER(SEARCH('INSTITUTIONAL VENDOR'!$E$12,D173)),MAX($C$1:C172)+1,0)","v":0},"611 Belize",{"$f":"IFERROR(VLOOKUP(ROWS($E$1:E172),C:D,2,0),\"\")","v":""},{"$nulls":19},"120XA00000 - SD PROCUREMENT",{"$nulls":7},"601 Antigua and Barbuda",{"$nulls":7},{"$f":"IF(ISNUMBER(SEARCH('INSTITUTIONAL VENDOR'!$C$35,AP173)),MAX($AO$7:AO172)+1,0)","v":0},"590 Samoa",{"$f":"IFERROR(VLOOKUP(ROWS(AQ$7:$AQ172),AO:AP,2,0),\"\")","v":""},"615 Cayman Islands","611 Belize","Yes"]
[null,null,{"$f":"IF(ISNUMBER(SEARCH('INSTITUTIONAL VENDOR'!$E$12,D174)),MAX($C$1:C173)+1,0)","v":0},"612 Hong Kong",{"$f":"IFERROR(VLOOKUP(ROWS($E$1:E173),C:D,2,0),\"\")","v":""},{"$nulls":19},"1260A00000 - DOMINICAN REPUBLIC",{"$nulls":7},"602 Brunei",{"$nulls":7},{"$f":"IF(ISNUMBER(SEARCH('INSTITUTIONAL VENDOR'!$C$35,AP174)),MAX($AO$7:AO173)+1,0)","v":0},"601 Antigua/Barbuda",{"$f":"IFERROR(VLOOKUP(ROWS(AQ$7:$AQ173),AO:AP,2,0),\"\")","v":""},"616 Grenada","612 Hong Kong","No"]
[null,null,{"$f":"IF(ISNUMBER(SEARCH('INSTITUTIONAL VENDOR'!$E$12,D175)),MAX($C$1:C174)+1,0)","v":0},"615 Cayman Islands",{"$f":"IFERROR(VLOOKUP(ROWS($E$1:E174),C:D,2,0),\"\")","v":""},{"$nulls":19},"1260B00000 - SANTO DOMINGO DO",{"$nulls":7},"603 Bahamas",{"$nulls":7},{"$f":"IF(ISNUMBER(SEARCH('INSTITUTIONAL VENDOR'!$C$35,AP175)),MAX($AO$7:AO174)+1,0)","v":0},"602 Brunei Darussal",{"$f":"IFERROR(VLOOKUP(ROWS(AQ$7:$AQ174),AO:AP,2,0),\"\")","v":""},"617 Kiribati","615 Cayman Islands","Yes"]
[null,null,{"$f":"IF(ISNUMBER(SEARCH('INSTITUTIONAL VENDOR'!$E$12,D176)),MAX($C$1:C175)+1,0)","v":0},"616 Grenada",{"$f":"IFERROR(VLOOKUP(ROWS($E$1:E175),C:D,2,0),\"\")","v":""},{"$nulls":19},"1350A00000 - ECUADOR",{"$nulls":7},"604 Bahrain",{"$nulls":7},{"$f":"IF(ISNUMBER(SEARCH('INSTITUTIONAL VENDOR'!$C$35,AP176)),MAX($AO$7:AO175)+1,0)","v":0},"603 Bahamas",{"$f":"IFERROR(VLOOKUP(ROWS(AQ$7:$AQ175),AO:AP,2,0),\"\")","v":""},"618 Tuvalu","616 Grenada","Yes"]
[null,null,{"$f":"IF(ISNUMBER(SEARCH('INSTITUTIONAL VENDOR'!$E$12,D177)),MAX($C$1:C176)+1,0)","v":0},"617 Kiribati",{"$f":"IFERROR(VLOOKUP(ROWS($E$1:E176),C:D,2,0),\"\")","v":""},{"$nulls":19},"1350B00000 - QUITO ECUADOR",{"$nulls":7},"605 Bermuda",{"$nulls":7},{"$f":"IF(ISNUMBER(SEARCH('INSTITUTIONAL VENDOR'!$C$35,AP177)),MAX($AO$7:AO176)+1,0)","v":0},"604 Bahrain",{"$f":"IFERROR(VLOOKUP(ROWS(AQ$7:$AQ176),AO:AP,2,0),\"\")","v":""},"620 Montserrat","617 Kiribati","Yes"]
[null,null,{"$f":"IF(ISNUMBER(SEARCH('INSTITUTIONAL VENDOR'!$E$12,D178)),MAX($C$1:C177)+1,0)","v":0},"618 Tuvalu",{"$f":"IFERROR(VLOOKUP(ROWS($E$1:E177),C:D,2,0),\"\")","v":""},{"$nulls":19},"1350C00000 - GUAYAQUIL EQUADOR",{"$nulls":7},"610 Dominica",{"$nulls":7},{"$f":"IF(ISNUMBER(SEARCH('INSTITUTIONAL VENDOR'!$C$35,AP178)),MAX($AO$7:AO177)+1,0)","v":0},"605 Bermuda",{"$f":"IFERROR(VLOOKUP(ROWS(AQ$7:$AQ177),AO:AP,2,0),\"\")","v":""},"623 Anguilla","618 Tuvalu","Yes"]
[null,null,{"$f":"IF(ISNUMBER(SEARCH('INSTITUTIONAL VENDOR'!$E$12,D179)),MAX($C$1:C178)+1,0)","v":0},"620 Montserrat",{"$f":"IFERROR(VLOOKUP(ROWS($E$1:E178),C:D,2,0),\"\")","v":""},{"$nulls":19},"1380A00000 - EL SAVADOR",{"$nulls":7},"611 Belize",{"$nulls":7},{"$f":"IF(ISNUMBER(SEARCH('INSTITUTIONAL VENDOR'!$C$35,AP179)),MAX($AO$7:AO178)+1,0)","v":0},"610 Dominica",{"$f":"IFERROR(VLOOKUP(ROWS(AQ$7:$AQ178),AO:AP,2,0),\"\")","v":""},"624 Qatar","620 Montserrat","Yes"]
[null,null,{"$f":"IF(ISNUMBER(SEARCH('INSTITUTIONAL VENDOR'!$E$12,D180)),MAX($C$1:C179)+1,0)","v":0},"623 Anguilla",{"$f":"IFERROR(VLOOKUP(ROWS($E$1:E179),C:D,2,0),\"\")","v":""},{"$nulls":19},"1380B00000 - SAN SALVADOR SV",{"$nulls":7},"612 Hong Kong",{"$nulls":7},{"$f":"IF(ISNUMBER(SEARCH('INSTITUTIONAL VENDOR'!$C$35,AP180)),MAX($AO$7:AO179)+1,0)","v":0},"611 Belize",{"$f":"IFERROR(VLOOKUP(ROWS(AQ$7:$AQ179),AO:AP,2,0),\"\")","v":""},"625 St. Helena","623 Anguilla","Yes"]
[null,null,{"$f":"IF(ISNUMBER(SEARCH('INSTITUTIONAL VENDOR'!$E$12,D181)),MAX($C$1:C180)+1,0)","v":0},"624 Qatar",{"$f":"IFERROR(VLOOKUP(ROWS($E$1:E180),C:D,2,0),\"\")","v":""},{"$nulls":19},"1390A00000 - EQUATORIAL GUINEA",{"$nulls":7},"615 Cayman Islands",{"$nulls":7},{"$f":"IF(ISNUMBER(SEARCH('INSTITUTIONAL VENDOR'!$C$35,AP181)),MAX($AO$7:AO180)+1,0)","v":0},"612 Hong Kong",{"$f":"IFERROR(VLOOKUP(ROWS(AQ$7:$AQ180),AO:AP,2,0),\"\")","v":""},"626 Zimbabwe","624 Qatar","Yes"]
[null,null,{"$f":"IF(ISNUMBER(SEARCH('INSTITUTIONAL VENDOR'!$E$12,D182)),MAX($C$1:C181)+1,0)","v":0},"625 St. Helena",{"$f":"IFERROR(VLOOKUP(ROWS($E$1:E181),C:D,2,0),\"\")","v":""},{"$nulls":19},"1390B00000 - MALABO EQUI GUINEA",{"$nulls":7},"616 Grenada",{"$nulls":7},{"$f":"IF(ISNUMBER(SEARCH('INSTITUTIONAL VENDOR'!$C$35,AP182)),MAX($AO$7:AO181)+1,0)","v":0},"615 Cayman Islands",{"$f":"IFERROR(VLOOKUP(ROWS(AQ$7:$AQ181),AO:AP,2,0),\"\")","v":""},"627 St Kitts&Nevis","625 St. Helena","Yes"]
[null,null,{"$f":"IF(ISNUMBER(SEARCH('INSTITUTIONAL VENDOR'!$E$12,D183)),MAX($C$1:C182)+1,0)","v":0},"626 Zimbabwe",{"$f":"IFERROR(VLOOKUP(ROWS($E$1:E182),C:D,2,0),\"\")","v":""},{"$nulls":19},"1410A00000 - ETHIOPIA",{"$nulls":7},"617 Kiribati",{"$nulls":7},{"$f":"IF(ISNUMBER(SEARCH('INSTITUTIONAL VENDOR'!$C$35,AP183)),MAX($AO$7:AO182)+1,0)","v":0},"616 Grenada",{"$f":"IFERROR(VLOOKUP(ROWS(AQ$7:$AQ182),AO:AP,2,0),\"\")","v":""},"628 Seychelles","626 Zimbabwe","Yes"]
[null,null,{"$f":"IF(ISNUMBER(SEARCH('INSTITUTIONAL VENDOR'!$E$12,D184)),MAX($C$1:C183)+1,0)","v":0},"627 St Kitts&Nevis",{"$f":"IFERROR(VLOOKUP(ROWS($E$1:E183),C:D,2,0),\"\")","v":""},{"$nulls":19},"1410B00000 - ADDIS ABABAETHIOPIA",{"$nulls":7},"618 Tuvalu",{"$nulls":7},{"$f":"IF(ISNUMBER(SEARCH('INSTITUTIONAL VENDOR'!$C$35,AP184)),MAX($AO$7:AO183)+1,0)","v":0},"617 Kiribati",{"$f":"IFERROR(VLOOKUP(ROWS(AQ$7:$AQ183),AO:AP,2,0),\"\")","v":""},"629 St. Lucia","627 St Kitts&Nevis","Yes"]
[null,null,{"$f":"IF(ISNUMBER(SEARCH('INSTITUTIONAL VENDOR'!$E$12,D185)),MAX($C$1:C184)+1,0)","v":0},"628 Seychelles",{"$f":"IFERROR(VLOOKUP(ROWS($E$1:E184),C:D,2,0),\"\")","v":""},{"$nulls":19},"1410B10000 - OROMIYA",{"$nulls":7},"620 Montserrat",{"$nulls":7},{"$f":"IF(ISNUMBER(SEARCH('INSTITUTIONAL VENDOR'!$C$35,AP185)),MAX($AO$7:AO184)+1,0)","v":0},"618 Tuvalu",{"$f":"IFERROR(VLOOKUP(ROWS(AQ$7:$AQ184),AO:AP,2,0),\"\")","v":""},"630 St. Vincent","628 Seychelles","Yes"]
[null,null,{"$f":"IF(ISNUMBER(SEARCH('INSTITUTIONAL VENDOR'!$E$12,D186)),MAX($C$1:C185)+1,0)","v":0},"629 St. Lucia",{"$f":"IFERROR(VLOOKUP(ROWS($E$1:E185),C:D,2,0),\"\")","v":""},{"$nulls":19},"1410C00000 - ASOSA",{"$nulls":7},"623 Anguilla",{"$nulls":7},{"$f":"IF(ISNUMBER(SEARCH('INSTITUTIONAL VENDOR'!$C$35,AP186)),MAX($AO$7:AO185)+1,0)","v":0},"620 Montserrat",{"$f":"IFERROR(VLOOKUP(ROWS(AQ$7:$AQ185),AO:AP,2,0),\"\")","v":""},"631 Solomon Islands","629 St. Lucia","Yes"]
[null,null,{"$f":"IF(ISNUMBER(SEARCH('INSTITUTIONAL VENDOR'!$E$12,D187)),MAX($C$1:C186)+1,0)","v":0},"630 St. Vincent",{"$f":"IFERROR(VLOOKUP(ROWS($E$1:E186),C:D,2,0),\"\")","v":""},{"$nulls":19},"1410D00000 - AWASA",{"$nulls":7},"624 Qatar",{"$nulls":7},{"$f":"IF(ISNUMBER(SEARCH('INSTITUTIONAL VENDOR'!$C$35,AP187)),MAX($AO$7:AO186)+1,0)","v":0},"623 Anguilla",{"$f":"IFERROR(VLOOKUP(ROWS(AQ$7:$AQ186),AO:AP,2,0),\"\")","v":""},"634 Tonga","630 St. Vincent","Yes"]
[null,null,{"$f":"IF(ISNUMBER(SEARCH('INSTITUTIONAL VENDOR'!$E$12,D188)),MAX($C$1:C187)+1,0)","v":0},"631 Solomon Islands",{"$f":"IFERROR(VLOOKUP(ROWS($E$1:E187),C:D,2,0),\"\")","v":""},{"$nulls":19},"1410E00000 - BAHIR DAR",{"$nulls":7},"625 Saint Helena",{"$nulls":7},{"$f":"IF(ISNUMBER(SEARCH('INSTITUTIONAL VENDOR'!$C$35,AP188)),MAX($AO$7:AO187)+1,0)","v":0},"624 Qatar",{"$f":"IFERROR(VLOOKUP(ROWS(AQ$7:$AQ187),AO:AP,2,0),\"\")","v":""},"635 Oman","631 Solomon Islands","Yes"]
[null,null,{"$f":"IF(ISNUMBER(SEARCH('INSTITUTIONAL VENDOR'!$E$12,D189)),MAX($C$1:C188)+1,0)","v":0},"634 Tonga",{"$f":"IFERROR(VLOOKUP(ROWS($E$1:E188),C:D,2,0),\"\")","v":""},{"$nulls":19},"1410F00000 - GAMBELA",{"$nulls":7},"626 Zimbabwe",{"$nulls":7},{"$f":"IF(ISNUMBER(SEARCH('INSTITUTIONAL VENDOR'!$C$35,AP189)),MAX($AO$7:AO188)+1,0)","v":0},"625 St. Helena",{"$f":"IFERROR(VLOOKUP(ROWS(AQ$7:$AQ188),AO:AP,2,0),\"\")","v":""},"636 Turks& Caicosin","634 Tonga","Yes"]
[null,null,{"$f":"IF(ISNUMBER(SEARCH('INSTITUTIONAL VENDOR'!$E$12,D190)),MAX($C$1:C189)+1,0)","v":0},"635 Oman",{"$f":"IFERROR(VLOOKUP(ROWS($E$1:E189),C:D,2,0),\"\")","v":""},{"$nulls":19},"1410G00000 - JIJIGA",{"$nulls":7},"627 Saint Kitts and Nevis",{"$nulls":7},{"$f":"IF(ISNUMBER(SEARCH('INSTITUTIONAL VENDOR'!$C$35,AP190)),MAX($AO$7:AO189)+1,0)","v":0},"626 Zimbabwe",{"$f":"IFERROR(VLOOKUP(ROWS(AQ$7:$AQ189),AO:AP,2,0),\"\")","v":""},"640 Brit.Virgin Is.","635 Oman","Yes"]
[null,null,{"$f":"IF(ISNUMBER(SEARCH('INSTITUTIONAL VENDOR'!$E$12,D191)),MAX($C$1:C190)+1,0)","v":0},"636 Turks& Caicosin",{"$f":"IFERROR(VLOOKUP(ROWS($E$1:E190),C:D,2,0),\"\")","v":""},{"$nulls":19},"1410H00000 - MEKELLE",{"$nulls":7},"628 Seychelles",{"$nulls":7},{"$f":"IF(ISNUMBER(SEARCH('INSTITUTIONAL VENDOR'!$C$35,AP191)),MAX($AO$7:AO190)+1,0)","v":0},"627 St Kitts&Nevis",{"$f":"IFERROR(VLOOKUP(ROWS(AQ$7:$AQ190),AO:AP,2,0),\"\")","v":""},"645 Sikkim","636 Turks& Caicosin","Yes"]
[null,null,{"$f":"IF(ISNUMBER(SEARCH('INSTITUTIONAL VENDOR'!$E$12,D192)),MAX($C$1:C191)+1,0)","v":0},"640 Brit.Virgin Is.",{"$f":"IFERROR(VLOOKUP(ROWS($E$1:E191),C:D,2,0),\"\")","v":""},{"$nulls":19},"1410I00000 - SEMERA",{"$nulls":7},"629 Saint Lucia",{"$nulls":7},{"$f":"IF(ISNUMBER(SEARCH('INSTITUTIONAL VENDOR'!$C$35,AP192)),MAX($AO$7:AO191)+1,0)","v":0},"628 Seychelles",{"$f":"IFERROR(VLOOKUP(ROWS(AQ$7:$AQ191),AO:AP,2,0),\"\")","v":""},"648 Nauru","640 Brit.Virgin Is.","Yes"]
[null,null,{"$f":"IF(ISNUMBER(SEARCH('INSTITUTIONAL VENDOR'!$E$12,D193)),MAX($C$1:C192)+1,0)","v":0},"645 Sikkim",{"$f":"IFERROR(VLOOKUP(ROWS($E$1:E192),C:D,2,0),\"\")","v":""},{"$nulls":19},"1410J00000 - GODE",{"$nulls":7},"630 St. Vincent and the Grena",{"$nulls":7},{"$f":"IF(ISNUMBER(SEARCH('INSTITUTIONAL VENDOR'!$C$35,AP193)),MAX($AO$7:AO192)+1,0)","v":0},"629 St. Lucia",{"$f":"IFERROR(VLOOKUP(ROWS(AQ$7:$AQ192),AO:AP,2,0),\"\")","v":""},"649 Pap. New Guinea","645 Sikkim","Yes"]
[null,null,{"$f":"IF(ISNUMBER(SEARCH('INSTITUTIONAL VENDOR'!$E$12,D194)),MAX($C$1:C193)+1,0)","v":0},"648 Nauru",{"$f":"IFERROR(VLOOKUP(ROWS($E$1:E193),C:D,2,0),\"\")","v":""},{"$nulls":19},"1410K00000 - KEBRIDEHAR",{"$nulls":7},"631 Solomon Islands",{"$nulls":7},{"$f":"IF(ISNUMBER(SEARCH('INSTITUTIONAL VENDOR'!$C$35,AP194)),MAX($AO$7:AO193)+1,0)","v":0},"630 St. Vincent",{"$f":"IFERROR(VLOOKUP(ROWS(AQ$7:$AQ193),AO:AP,2,0),\"\")","v":""},"655 Vanuatu","648 Nauru","Yes"]
[null,null,{"$f":"IF(ISNUMBER(SEARCH('INSTITUTIONAL VENDOR'!$E$12,D195)),MAX($C$1:C194)+1,0)","v":0},"649 Pap. New Guinea",{"$f":"IFERROR(VLOOKUP(ROWS($E$1:E194),C:D,2,0),\"\")","v":""},{"$nulls":19},"1410L00000 - DOLLO ADO",{"$nulls":7},"634 Tonga",{"$nulls":7},{"$f":"IF(ISNUMBER(SEARCH('INSTITUTIONAL VENDOR'!$C$35,AP195)),MAX($AO$7:AO194)+1,0)","v":0},"631 Solomon Islands",{"$f":"IFERROR(VLOOKUP(ROWS(AQ$7:$AQ194),AO:AP,2,0),\"\")","v":""},"656 Tokelau Islands","649 Pap. New Guinea","Yes"]
[null,null,{"$f":"IF(ISNUMBER(SEARCH('INSTITUTIONAL VENDOR'!$E$12,D196)),MAX($C$1:C195)+1,0)","v":0},"655 Vanuatu",{"$f":"IFERROR(VLOOKUP(ROWS($E$1:E195),C:D,2,0),\"\")","v":""},{"$nulls":19},"1420A00000 - ERITREA",{"$nulls":7},"635 Oman",{"$nulls":7},{"$f":"IF(ISNUMBER(SEARCH('INSTITUTIONAL VENDOR'!$C$35,AP196)),MAX($AO$7:AO195)+1,0)","v":0},"634 Tonga",{"$f":"IFERROR(VLOOKUP(ROWS(AQ$7:$AQ195),AO:AP,2,0),\"\")","v":""},"660 French Antilles","655 Vanuatu","Yes"]
[null,null,{"$f":"IF(ISNUMBER(SEARCH('INSTITUTIONAL VENDOR'!$E$12,D197)),MAX($C$1:C196)+1,0)","v":0},"656 Tokelau Islands",{"$f":"IFERROR(VLOOKUP(ROWS($E$1:E196),C:D,2,0),\"\")","v":""},{"$nulls":19},"1420B00000 - ASMARA ERITREA",{"$nulls":7},"636 Turks and Caicos Island",{"$nulls":7},{"$f":"IF(ISNUMBER(SEARCH('INSTITUTIONAL VENDOR'!$C$35,AP197)),MAX($AO$7:AO196)+1,0)","v":0},"635 Oman",{"$f":"IFERROR(VLOOKUP(ROWS(AQ$7:$AQ196),AO:AP,2,0),\"\")","v":""},"661 Wallis,Futuna","656 Tokelau Islands","Yes"]
[null,null,{"$f":"IF(ISNUMBER(SEARCH('INSTITUTIONAL VENDOR'!$E$12,D198)),MAX($C$1:C197)+1,0)","v":0},"660 French Antilles",{"$f":"IFERROR(VLOOKUP(ROWS($E$1:E197),C:D,2,0),\"\")","v":""},{"$nulls":19},"1430A00000 - FIJI-PACIFIC ISLANDS",{"$nulls":7},"640 Virgin Islands (UK)",{"$nulls":7},{"$f":"IF(ISNUMBER(SEARCH('INSTITUTIONAL VENDOR'!$C$35,AP198)),MAX($AO$7:AO197)+1,0)","v":0},"636 Turks& Caicosin",{"$f":"IFERROR(VLOOKUP(ROWS(AQ$7:$AQ197),AO:AP,2,0),\"\")","v":""},"662 Comoros","660 French Antilles","No"]
[null,null,{"$f":"IF(ISNUMBER(SEARCH('INSTITUTIONAL VENDOR'!$E$12,D199)),MAX($C$1:C198)+1,0)","v":0},"661 Wallis,Futuna",{"$f":"IFERROR(VLOOKUP(ROWS($E$1:E198),C:D,2,0),\"\")","v":""},{"$nulls":19},"1430B00000 - SUVA FIJI",{"$nulls":7},"645 Sikkim",{"$nulls":7},{"$f":"IF(ISNUMBER(SEARCH('INSTITUTIONAL VENDOR'!$C$35,AP199)),MAX($AO$7:AO198)+1,0)","v":0},"640 Brit.Virgin Is.",{"$f":"IFERROR(VLOOKUP(ROWS(AQ$7:$AQ198),AO:AP,2,0),\"\")","v":""},"663 Reunion","661 Wallis,Futuna","Yes"]
[null,null,{"$f":"IF(ISNUMBER(SEARCH('INSTITUTIONAL VENDOR'!$E$12,D200)),MAX($C$1:C199)+1,0)","v":0},"662 Comoros",{"$f":"IFERROR(VLOOKUP(ROWS($E$1:E199),C:D,2,0),\"\")","v":""},{"$nulls":19},"1430C00000 - APIA SAMOA",{"$nulls":7},"648 Nauru",{"$nulls":7},{"$f":"IF(ISNUMBER(SEARCH('INSTITUTIONAL VENDOR'!$C$35,AP200)),MAX($AO$7:AO199)+1,0)","v":0},"645 Sikkim",{"$f":"IFERROR(VLOOKUP(ROWS(AQ$7:$AQ199),AO:AP,2,0),\"\")","v":""},"664 Martinique","662 Comoros","Yes"]
[null,null,{"$f":"IF(ISNUMBER(SEARCH('INSTITUTIONAL VENDOR'!$E$12,D201)),MAX($C$1:C200)+1,0)","v":0},"663 Reunion",{"$f":"IFERROR(VLOOKUP(ROWS($E$1:E200),C:D,2,0),\"\")","v":""},{"$nulls":19},"1430D00000 - HONIARA SB",{"$nulls":7},"649 Papua New Guinea",{"$nulls":7},{"$f":"IF(ISNUMBER(SEARCH('INSTITUTIONAL VENDOR'!$C$35,AP201)),MAX($AO$7:AO200)+1,0)","v":0},"648 Nauru",{"$f":"IFERROR(VLOOKUP(ROWS(AQ$7:$AQ200),AO:AP,2,0),\"\")","v":""},"665 French Guiana","663 Reunion","No"]
[null,null,{"$f":"IF(ISNUMBER(SEARCH('INSTITUTIONAL VENDOR'!$E$12,D202)),MAX($C$1:C201)+1,0)","v":0},"664 Martinique",{"$f":"IFERROR(VLOOKUP(ROWS($E$1:E201),C:D,2,0),\"\")","v":""},{"$nulls":19},"1430E00000 - PORT VILA VANUATU",{"$nulls":7},"655 Vanuatu",{"$nulls":7},{"$f":"IF(ISNUMBER(SEARCH('INSTITUTIONAL VENDOR'!$C$35,AP202)),MAX($AO$7:AO201)+1,0)","v":0},"649 Pap. New Guinea",{"$f":"IFERROR(VLOOKUP(ROWS(AQ$7:$AQ201),AO:AP,2,0),\"\")","v":""},"666 Guadeloupe","664 Martinique","No"]
[null,null,{"$f":"IF(ISNUMBER(SEARCH('INSTITUTIONAL VENDOR'!$E$12,D203)),MAX($C$1:C202)+1,0)","v":0},"665 French Guiana",{"$f":"IFERROR(VLOOKUP(ROWS($E$1:E202),C:D,2,0),\"\")","v":""},{"$nulls":19},"1430F00000 - TARAWA KIRIBATI",{"$nulls":7},"656 Tokelau Islands",{"$nulls":7},{"$f":"IF(ISNUMBER(SEARCH('INSTITUTIONAL VENDOR'!$C$35,AP203)),MAX($AO$7:AO202)+1,0)","v":0},"655 Vanuatu",{"$f":"IFERROR(VLOOKUP(ROWS(AQ$7:$AQ202),AO:AP,2,0),\"\")","v":""},"667 New Caledonia","665 French Guiana","No"]
[null,null,{"$f":"IF(ISNUMBER(SEARCH('INSTITUTIONAL VENDOR'!$E$12,D204)),MAX($C$1:C203)+1,0)","v":0},"666 Guadeloupe",{"$f":"IFERROR(VLOOKUP(ROWS($E$1:E203),C:D,2,0),\"\")","v":""},{"$nulls":19},"1430G00000 - MAJURO RMI",{"$nulls":7},"660 French Antilles",{"$nulls":7},{"$f":"IF(ISNUMBER(SEARCH('INSTITUTIONAL VENDOR'!$C$35,AP204)),MAX($AO$7:AO203)+1,0)","v":0},"656 Tokelau Islands",{"$f":"IFERROR(VLOOKUP(ROWS(AQ$7:$AQ203),AO:AP,2,0),\"\")","v":""},"668 Frenc.Polynesia","666 Guadeloupe","No"]
[null,null,{"$f":"IF(ISNUMBER(SEARCH('INSTITUTIONAL VENDOR'!$E$12,D205)),MAX($C$1:C204)+1,0)","v":0},"667 New Caledonia",{"$f":"IFERROR(VLOOKUP(ROWS($E$1:E204),C:D,2,0),\"\")","v":""},{"$nulls":19},"1430H00000 - POHNPEI FSM",{"$nulls":7},"661 Wallis and Futuna Islands",{"$nulls":7},{"$f":"IF(ISNUMBER(SEARCH('INSTITUTIONAL VENDOR'!$C$35,AP205)),MAX($AO$7:AO204)+1,0)","v":0},"660 French Antilles",{"$f":"IFERROR(VLOOKUP(ROWS(AQ$7:$AQ204),AO:AP,2,0),\"\")","v":""},"669 Djibouti","667 New Caledonia","No"]
[null,null,{"$f":"IF(ISNUMBER(SEARCH('INSTITUTIONAL VENDOR'!$E$12,D206)),MAX($C$1:C205)+1,0)","v":0},"668 Frenc.Polynesia",{"$f":"IFERROR(VLOOKUP(ROWS($E$1:E205),C:D,2,0),\"\")","v":""},{"$nulls":19},"1430I00000 - NAURA",{"$nulls":7},"662 Comoros",{"$nulls":7},{"$f":"IF(ISNUMBER(SEARCH('INSTITUTIONAL VENDOR'!$C$35,AP206)),MAX($AO$7:AO205)+1,0)","v":0},"661 Wallis,Futuna",{"$f":"IFERROR(VLOOKUP(ROWS(AQ$7:$AQ205),AO:AP,2,0),\"\")","v":""},"672 Netherlands Ant","668 Frenc.Polynesia","No"]
[null,null,{"$f":"IF(ISNUMBER(SEARCH('INSTITUTIONAL VENDOR'!$E$12,D207)),MAX($C$1:C206)+1,0)","v":0},"669 Djibouti",{"$f":"IFERROR(VLOOKUP(ROWS($E$1:E206),C:D,2,0),\"\")","v":""},{"$nulls":19},"1430J00000 - NGERULMUD PALAU",{"$nulls":7},"663 Reunion",{"$nulls":7},{"$f":"IF(ISNUMBER(SEARCH('INSTITUTIONAL VENDOR'!$C$35,AP207)),MAX($AO$7:AO206)+1,0)","v":0},"662 Comoros",{"$f":"IFERROR(VLOOKUP(ROWS(AQ$7:$AQ206),AO:AP,2,0),\"\")","v":""},"678 Suriname","669 Djibouti","Yes"]
[null,null,{"$f":"IF(ISNUMBER(SEARCH('INSTITUTIONAL VENDOR'!$E$12,D208)),MAX($C$1:C207)+1,0)","v":0},"672 Netherlands Ant",{"$f":"IFERROR(VLOOKUP(ROWS($E$1:E207),C:D,2,0),\"\")","v":""},{"$nulls":19},"1430K00000 - NUKI'ALOFA TONGA",{"$nulls":7},"664 Martinique",{"$nulls":7},{"$f":"IF(ISNUMBER(SEARCH('INSTITUTIONAL VENDOR'!$C$35,AP208)),MAX($AO$7:AO207)+1,0)","v":0},"663 Reunion",{"$f":"IFERROR(VLOOKUP(ROWS(AQ$7:$AQ207),AO:AP,2,0),\"\")","v":""},"679 Cook Islands","672 Netherlands Ant","No"]
[null,null,{"$f":"IF(ISNUMBER(SEARCH('INSTITUTIONAL VENDOR'!$E$12,D209)),MAX($C$1:C208)+1,0)","v":0},"678 Suriname",{"$f":"IFERROR(VLOOKUP(ROWS($E$1:E208),C:D,2,0),\"\")","v":""},{"$nulls":19},"1430L00000 - FUNAFUTI TUVALU",{"$nulls":7},"665 French Guiana",{"$nulls":7},{"$f":"IF(ISNUMBER(SEARCH('INSTITUTIONAL VENDOR'!$C$35,AP209)),MAX($AO$7:AO208)+1,0)","v":0},"664 Martinique",{"$f":"IFERROR(VLOOKUP(ROWS(AQ$7:$AQ208),AO:AP,2,0),\"\")","v":""},"680 Niue","678 Suriname","Yes"]
[null,null,{"$f":"IF(ISNUMBER(SEARCH('INSTITUTIONAL VENDOR'!$E$12,D210)),MAX($C$1:C209)+1,0)","v":0},"679 Cook Islands",{"$f":"IFERROR(VLOOKUP(ROWS($E$1:E209),C:D,2,0),\"\")","v":""},{"$nulls":19},"1430M00000 - ALOFI NUIE",{"$nulls":7},"666 Guadeloupe",{"$nulls":7},{"$f":"IF(ISNUMBER(SEARCH('INSTITUTIONAL VENDOR'!$C$35,AP210)),MAX($AO$7:AO209)+1,0)","v":0},"665 French Guiana",{"$f":"IFERROR(VLOOKUP(ROWS(AQ$7:$AQ209),AO:AP,2,0),\"\")","v":""},"681 Angola","679 Cook Islands","Yes"]
[null,null,{"$f":"IF(ISNUMBER(SEARCH('INSTITUTIONAL VENDOR'!$E$12,D211)),MAX($C$1:C210)+1,0)","v":0},"680 Niue",{"$f":"IFERROR(VLOOKUP(ROWS($E$1:E210),C:D,2,0),\"\")","v":""},{"$nulls":19},"1430N00000 - AVARUA COOK ISLANDS",{"$nulls":7},"667 New Caledonia",{"$nulls":7},{"$f":"IF(ISNUMBER(SEARCH('INSTITUTIONAL VENDOR'!$C$35,AP211)),MAX($AO$7:AO210)+1,0)","v":0},"666 Guadeloupe",{"$f":"IFERROR(VLOOKUP(ROWS(AQ$7:$AQ210),AO:AP,2,0),\"\")","v":""},"682 Cabo Verde","680 Niue","Yes"]
[null,null,{"$f":"IF(ISNUMBER(SEARCH('INSTITUTIONAL VENDOR'!$E$12,D212)),MAX($C$1:C211)+1,0)","v":0},"681 Angola",{"$f":"IFERROR(VLOOKUP(ROWS($E$1:E211),C:D,2,0),\"\")","v":""},{"$nulls":19},"1430O00000 - TOKELAU",{"$nulls":7},"668 French Polynesia",{"$nulls":7},{"$f":"IF(ISNUMBER(SEARCH('INSTITUTIONAL VENDOR'!$C$35,AP212)),MAX($AO$7:AO211)+1,0)","v":0},"667 New Caledonia",{"$f":"IFERROR(VLOOKUP(ROWS(AQ$7:$AQ211),AO:AP,2,0),\"\")","v":""},"683 S.Tome&Principe","681 Angola","Yes"]
[null,null,{"$f":"IF(ISNUMBER(SEARCH('INSTITUTIONAL VENDOR'!$E$12,D213)),MAX($C$1:C212)+1,0)","v":0},"682 Cabo Verde",{"$f":"IFERROR(VLOOKUP(ROWS($E$1:E212),C:D,2,0),\"\")","v":""},{"$nulls":19},"1530A00000 - GABON",{"$nulls":7},"669 Djibouti",{"$nulls":7},{"$f":"IF(ISNUMBER(SEARCH('INSTITUTIONAL VENDOR'!$C$35,AP213)),MAX($AO$7:AO212)+1,0)","v":0},"668 Frenc.Polynesia",{"$f":"IFERROR(VLOOKUP(ROWS(AQ$7:$AQ212),AO:AP,2,0),\"\")","v":""},"685 Guinea-Bissau","682 Cabo Verde","Yes"]
[null,null,{"$f":"IF(ISNUMBER(SEARCH('INSTITUTIONAL VENDOR'!$E$12,D214)),MAX($C$1:C213)+1,0)","v":0},"683 S.Tome&Principe",{"$f":"IFERROR(VLOOKUP(ROWS($E$1:E213),C:D,2,0),\"\")","v":""},{"$nulls":19},"1530B00000 - LIBREVILLE GABON",{"$nulls":7},"672 Netherlands Antilles",{"$nulls":7},{"$f":"IF(ISNUMBER(SEARCH('INSTITUTIONAL VENDOR'!$C$35,AP214)),MAX($AO$7:AO213)+1,0)","v":0},"669 Djibouti",{"$f":"IFERROR(VLOOKUP(ROWS(AQ$7:$AQ213),AO:AP,2,0),\"\")","v":""},"688 Macau","683 S.Tome&Principe","Yes"]
[null,null,{"$f":"IF(ISNUMBER(SEARCH('INSTITUTIONAL VENDOR'!$E$12,D215)),MAX($C$1:C214)+1,0)","v":0},"685 Guinea-Bissau",{"$f":"IFERROR(VLOOKUP(ROWS($E$1:E214),C:D,2,0),\"\")","v":""},{"$nulls":19},"1560A00000 - GAMBIA",{"$nulls":7},"678 Suriname",{"$nulls":7},{"$f":"IF(ISNUMBER(SEARCH('INSTITUTIONAL VENDOR'!$C$35,AP215)),MAX($AO$7:AO214)+1,0)","v":0},"672 Netherlands Ant",{"$f":"IFERROR(VLOOKUP(ROWS(AQ$7:$AQ214),AO:AP,2,0),\"\")","v":""},"689 Mozambique","685 Guinea-Bissau","Yes"]
[null,null,{"$f":"IF(ISNUMBER(SEARCH('INSTITUTIONAL VENDOR'!$E$12,D216)),MAX($C$1:C215)+1,0)","v":0},"688 Macau",{"$f":"IFERROR(VLOOKUP(ROWS($E$1:E215),C:D,2,0),\"\")","v":""},{"$nulls":19},"1560B00000 - BANJUL GAMBIA",{"$nulls":7},"679 Cook Islands",{"$nulls":7},{"$f":"IF(ISNUMBER(SEARCH('INSTITUTIONAL VENDOR'!$C$35,AP216)),MAX($AO$7:AO215)+1,0)","v":0},"678 Suriname",{"$f":"IFERROR(VLOOKUP(ROWS(AQ$7:$AQ215),AO:AP,2,0),\"\")","v":""},"690 Palau, Rep of","688 Macau","Yes"]
[null,null,{"$f":"IF(ISNUMBER(SEARCH('INSTITUTIONAL VENDOR'!$E$12,D217)),MAX($C$1:C216)+1,0)","v":0},"689 Mozambique",{"$f":"IFERROR(VLOOKUP(ROWS($E$1:E216),C:D,2,0),\"\")","v":""},{"$nulls":19},"1600A00000 - GEORGIA",{"$nulls":7},"680 Niue",{"$nulls":7},{"$f":"IF(ISNUMBER(SEARCH('INSTITUTIONAL VENDOR'!$C$35,AP217)),MAX($AO$7:AO216)+1,0)","v":0},"679 Cook Islands",{"$f":"IFERROR(VLOOKUP(ROWS(AQ$7:$AQ216),AO:AP,2,0),\"\")","v":""},"691 Western Sahara","689 Mozambique","Yes"]
[null,null,{"$f":"IF(ISNUMBER(SEARCH('INSTITUTIONAL VENDOR'!$E$12,D218)),MAX($C$1:C217)+1,0)","v":0},"690 Palau, Rep of",{"$f":"IFERROR(VLOOKUP(ROWS($E$1:E217),C:D,2,0),\"\")","v":""},{"$nulls":19},"1600B00000 - TBLISI GEORGIA",{"$nulls":7},"681 Angola",{"$nulls":7},{"$f":"IF(ISNUMBER(SEARCH('INSTITUTIONAL VENDOR'!$C$35,AP218)),MAX($AO$7:AO217)+1,0)","v":0},"680 Niue",{"$f":"IFERROR(VLOOKUP(ROWS(AQ$7:$AQ217),AO:AP,2,0),\"\")","v":""},"692 Marshall Islnds","690 Palau, Rep of","Yes"]
[null,null,{"$f":"IF(ISNUMBER(SEARCH('INSTITUTIONAL VENDOR'!$E$12,D219)),MAX($C$1:C218)+1,0)","v":0},"691 Western Sahara",{"$f":"IFERROR(VLOOKUP(ROWS($E$1:E218),C:D,2,0),\"\")","v":""},{"$nulls":19},"1600C00000 - SUKHUMI",{"$nulls":7},"682 Cape Verde",{"$nulls":7},{"$f":"IF(ISNUMBER(SEARCH('INSTITUTIONAL VENDOR'!$C$35,AP219)),MAX($AO$7:AO218)+1,0)","v":0},"681 Angola",{"$f":"IFERROR(VLOOKUP(ROWS(AQ$7:$AQ218),AO:AP,2,0),\"\")","v":""},"693 Micronesia","691 Western Sahara","Yes"]
[null,null,{"$f":"IF(ISNUMBER(SEARCH('INSTITUTIONAL VENDOR'!$E$12,D220)),MAX($C$1:C219)+1,0)","v":0},"692 Marshall Islnds",{"$f":"IFERROR(VLOOKUP(ROWS($E$1:E219),C:D,2,0),\"\")","v":""},{"$nulls":19},"1620A00000 - GHANA",{"$nulls":7},"683 Sao Tome and Principe",{"$nulls":7},{"$f":"IF(ISNUMBER(SEARCH('INSTITUTIONAL VENDOR'!$C$35,AP220)),MAX($AO$7:AO219)+1,0)","v":0},"682 Cabo Verde",{"$f":"IFERROR(VLOOKUP(ROWS(AQ$7:$AQ219),AO:AP,2,0),\"\")","v":""},"695 Puerto Rico","692 Marshall Islnds","Yes"]
[null,null,{"$f":"IF(ISNUMBER(SEARCH('INSTITUTIONAL VENDOR'!$E$12,D221)),MAX($C$1:C220)+1,0)","v":0},"693 Micronesia",{"$f":"IFERROR(VLOOKUP(ROWS($E$1:E220),C:D,2,0),\"\")","v":""},{"$nulls":19},"1620B00000 - ACCRA GHANA",{"$nulls":7},"685 Guinea-Bissau",{"$nulls":7},{"$f":"IF(ISNUMBER(SEARCH('INSTITUTIONAL VENDOR'!$C$35,AP221)),MAX($AO$7:AO220)+1,0)","v":0},"683 S.Tome&Principe",{"$f":"IFERROR(VLOOKUP(ROWS(AQ$7:$AQ220),AO:AP,2,0),\"\")","v":""},"696 Samoa,American","693 Micronesia","Yes"]
[null,null,{"$f":"IF(ISNUMBER(SEARCH('INSTITUTIONAL VENDOR'!$E$12,D222)),MAX($C$1:C221)+1,0)","v":0},"695 Puerto Rico",{"$f":"IFERROR(VLOOKUP(ROWS($E$1:E221),C:D,2,0),\"\")","v":""},{"$nulls":19},"1620C00000 - TAMALE",{"$nulls":7},"688 Macao",{"$nulls":7},{"$f":"IF(ISNUMBER(SEARCH('INSTITUTIONAL VENDOR'!$C$35,AP222)),MAX($AO$7:AO221)+1,0)","v":0},"685 Guinea-Bissau",{"$f":"IFERROR(VLOOKUP(ROWS(AQ$7:$AQ221),AO:AP,2,0),\"\")","v":""},"697 Amer.Virgin Is.","695 Puerto Rico","Yes"]
[null,null,{"$f":"IF(ISNUMBER(SEARCH('INSTITUTIONAL VENDOR'!$E$12,D223)),MAX($C$1:C222)+1,0)","v":0},"696 Samoa,American",{"$f":"IFERROR(VLOOKUP(ROWS($E$1:E222),C:D,2,0),\"\")","v":""},{"$nulls":19},"1680A00000 - GUATEMALA",{"$nulls":7},"689 Mozambique",{"$nulls":7},{"$f":"IF(ISNUMBER(SEARCH('INSTITUTIONAL VENDOR'!$C$35,AP223)),MAX($AO$7:AO222)+1,0)","v":0},"688 Macau",{"$f":"IFERROR(VLOOKUP(ROWS(AQ$7:$AQ222),AO:AP,2,0),\"\")","v":""},"698 Namibia","696 Samoa,American","Yes"]
[null,null,{"$f":"IF(ISNUMBER(SEARCH('INSTITUTIONAL VENDOR'!$E$12,D224)),MAX($C$1:C223)+1,0)","v":0},"697 Amer.Virgin Is.",{"$f":"IFERROR(VLOOKUP(ROWS($E$1:E223),C:D,2,0),\"\")","v":""},{"$nulls":19},"1680B00000 - GUATEMALA CITY GT",{"$nulls":7},"691 Western Sahara",{"$nulls":7},{"$f":"IF(ISNUMBER(SEARCH('INSTITUTIONAL VENDOR'!$C$35,AP224)),MAX($AO$7:AO223)+1,0)","v":0},"689 Mozambique",{"$f":"IFERROR(VLOOKUP(ROWS(AQ$7:$AQ223),AO:AP,2,0),\"\")","v":""},"700 N.Mariana Is.","697 Amer.Virgin Is.","Yes"]
[null,null,{"$f":"IF(ISNUMBER(SEARCH('INSTITUTIONAL VENDOR'!$E$12,D225)),MAX($C$1:C224)+1,0)","v":0},"698 Namibia",{"$f":"IFERROR(VLOOKUP(ROWS($E$1:E224),C:D,2,0),\"\")","v":""},{"$nulls":19},"1770A00000 - GUINEA",{"$nulls":7},"692 Marshall Islands",{"$nulls":7},{"$f":"IF(ISNUMBER(SEARCH('INSTITUTIONAL VENDOR'!$C$35,AP225)),MAX($AO$7:AO224)+1,0)","v":0},"690 Palau, Rep of",{"$f":"IFERROR(VLOOKUP(ROWS(AQ$7:$AQ224),AO:AP,2,0),\"\")","v":""},"705 Palestine","698 Namibia","Yes"]
[null,null,{"$f":"IF(ISNUMBER(SEARCH('INSTITUTIONAL VENDOR'!$E$12,D226)),MAX($C$1:C225)+1,0)","v":0},"700 N.Mariana Is.",{"$f":"IFERROR(VLOOKUP(ROWS($E$1:E225),C:D,2,0),\"\")","v":""},{"$nulls":19},"1770B00000 - CONAKRY GUINEA",{"$nulls":7},"693 Micronesia",{"$nulls":7},{"$f":"IF(ISNUMBER(SEARCH('INSTITUTIONAL VENDOR'!$C$35,AP226)),MAX($AO$7:AO225)+1,0)","v":0},"691 Western Sahara",{"$f":"IFERROR(VLOOKUP(ROWS(AQ$7:$AQ225),AO:AP,2,0),\"\")","v":""},"706 Timor-Leste","700 N.Mariana Is.","Yes"]
[null,null,{"$f":"IF(ISNUMBER(SEARCH('INSTITUTIONAL VENDOR'!$E$12,D227)),MAX($C$1:C226)+1,0)","v":0},"705 Palestine",{"$f":"IFERROR(VLOOKUP(ROWS($E$1:E226),C:D,2,0),\"\")","v":""},{"$nulls":19},"1770B10000 - WESTERN CONAKRY",{"$nulls":7},"694 (Trust Territory Palau)",{"$nulls":7},{"$f":"IF(ISNUMBER(SEARCH('INSTITUTIONAL VENDOR'!$C$35,AP227)),MAX($AO$7:AO226)+1,0)","v":0},"692 Marshall Islnds",{"$f":"IFERROR(VLOOKUP(ROWS(AQ$7:$AQ226),AO:AP,2,0),\"\")","v":""},"891 Serbia & Monten","705 Palestine","Yes"]
[null,null,{"$f":"IF(ISNUMBER(SEARCH('INSTITUTIONAL VENDOR'!$E$12,D228)),MAX($C$1:C227)+1,0)","v":0},"706 Timor-Leste",{"$f":"IFERROR(VLOOKUP(ROWS($E$1:E227),C:D,2,0),\"\")","v":""},{"$nulls":19},"1770C00000 - NZEREKORE",{"$nulls":7},"695 Puerto Rico",{"$nulls":7},{"$f":"IF(ISNUMBER(SEARCH('INSTITUTIONAL VENDOR'!$C$35,AP228)),MAX($AO$7:AO227)+1,0)","v":0},"693 Micronesia",{"$f":"IFERROR(VLOOKUP(ROWS(AQ$7:$AQ227),AO:AP,2,0),\"\")","v":""},"895 Montenegro","706 Timor-Leste","Yes"]
[null,null,{"$f":"IF(ISNUMBER(SEARCH('INSTITUTIONAL VENDOR'!$E$12,D229)),MAX($C$1:C228)+1,0)","v":0},"891 Serbia & Monten",{"$f":"IFERROR(VLOOKUP(ROWS($E$1:E228),C:D,2,0),\"\")","v":""},{"$nulls":19},"1770D00000 - KANKAN",{"$nulls":7},"696 American Samoa",{"$nulls":7},{"$f":"IF(ISNUMBER(SEARCH('INSTITUTIONAL VENDOR'!$C$35,AP229)),MAX($AO$7:AO228)+1,0)","v":0},"695 Puerto Rico",{"$f":"IFERROR(VLOOKUP(ROWS(AQ$7:$AQ228),AO:AP,2,0),\"\")","v":""},"897 Serbia","891 Serbia & Monten","Yes"]
[null,null,{"$f":"IF(ISNUMBER(SEARCH('INSTITUTIONAL VENDOR'!$E$12,D230)),MAX($C$1:C229)+1,0)","v":0},"895 Montenegro",{"$f":"IFERROR(VLOOKUP(ROWS($E$1:E229),C:D,2,0),\"\")","v":""},{"$nulls":19},"1800A00000 - GUYANA",{"$nulls":7},"697 Virgin Islands (USA)",{"$nulls":7},{"$f":"IF(ISNUMBER(SEARCH('INSTITUTIONAL VENDOR'!$C$35,AP230)),MAX($AO$7:AO229)+1,0)","v":0},"696 Samoa,American",{"$f":"IFERROR(VLOOKUP(ROWS(AQ$7:$AQ229),AO:AP,2,0),\"\")","v":""},"AED United Arab Emirates Dirham","895 Montenegro","Yes"]
[null,null,{"$f":"IF(ISNUMBER(SEARCH('INSTITUTIONAL VENDOR'!$E$12,D231)),MAX($C$1:C230)+1,0)","v":0},"897 Serbia",{"$f":"IFERROR(VLOOKUP(ROWS($E$1:E230),C:D,2,0),\"\")","v":""},{"$nulls":19},"1800B00000 - GEORGETOWN GUYANA",{"$nulls":7},"698 Namibia",{"$nulls":7},{"$f":"IF(ISNUMBER(SEARCH('INSTITUTIONAL VENDOR'!$C$35,AP231)),MAX($AO$7:AO230)+1,0)","v":0},"697 Amer.Virgin Is.",{"$f":"IFERROR(VLOOKUP(ROWS(AQ$7:$AQ230),AO:AP,2,0),\"\")","v":""},"AFN Afghani","897 Serbia","Yes"]
[null,null,{"$f":"IF(ISNUMBER(SEARCH('INSTITUTIONAL VENDOR'!$E$12,D232)),MAX($C$1:C231)+1,0)","v":0},null,{"$f":"IFERROR(VLOOKUP(ROWS($E$1:E231),C:D,2,0),\"\")","v":""},{"$nulls":19},"1800C00000 - PARAMARIBO SURINAME",{"$nulls":7},"705 Palestine",{"$nulls":7},{"$f":"IF(ISNUMBER(SEARCH('INSTITUTIONAL VENDOR'!$C$35,AP232)),MAX($AO$7:AO231)+1,0)","v":0},"698 Namibia",{"$f":"IFERROR(VLOOKUP(ROWS(AQ$7:$AQ231),AO:AP,2,0),\"\")","v":""},"ALL Albanian Lek(e)",0,"-"]
[null,null,{"$f":"IF(ISNUMBER(SEARCH('INSTITUTIONAL VENDOR'!$E$12,D233)),MAX($C$1:C232)+1,0)","v":0},null,{"$f":"IFERROR(VLOOKUP(ROWS($E$1:E232),C:D,2,0),\"\")","v":""},{"$nulls":19},"1830A00000 - HAITI",{"$nulls":7},"706 East Timor",{"$nulls":7},{"$f":"IF(ISNUMBER(SEARCH('INSTITUTIONAL VENDOR'!$C$35,AP233)),MAX($AO$7:AO232)+1,0)","v":0},"700 N.Mariana Is.",{"$f":"IFERROR(VLOOKUP(ROWS(AQ$7:$AQ232),AO:AP,2,0),\"\")","v":""},"AMD Armenian Dram"]
[null,null,{"$f":"IF(ISNUMBER(SEARCH('INSTITUTIONAL VENDOR'!$E$12,D234)),MAX($C$1:C233)+1,0)","v":0},null,{"$f":"IFERROR(VLOOKUP(ROWS($E$1:E233),C:D,2,0),\"\")","v":""},{"$nulls":19},"1830B00000 - PORT AU PRINCEHAITI",{"$nulls":7},"891 Serbia and Montenegro",{"$nulls":7},{"$f":"IF(ISNUMBER(SEARCH('INSTITUTIONAL VENDOR'!$C$35,AP234)),MAX($AO$7:AO233)+1,0)","v":0},"705 Palestine",{"$f":"IFERROR(VLOOKUP(ROWS(AQ$7:$AQ233),AO:AP,2,0),\"\")","v":""},"ANG Netherlands Antillean Gulder"]
[{"$nulls":24},"1830C00000 - GONAIVES HAITI",{"$nulls":7},"895 Montenegro",{"$nulls":7},{"$f":"IF(ISNUMBER(SEARCH('INSTITUTIONAL VENDOR'!$C$35,AP235)),MAX($AO$7:AO234)+1,0)","v":0},"706 Timor-Leste",{"$f":"IFERROR(VLOOKUP(ROWS(AQ$7:$AQ234),AO:AP,2,0),\"\")","v":""},"AOA Angolan Kwanza"]
[{"$nulls":24},"1860A00000 - HONDURAS",{"$nulls":7},"897 Serbia",{"$nulls":7},{"$f":"IF(ISNUMBER(SEARCH('INSTITUTIONAL VENDOR'!$C$35,AP236)),MAX($AO$7:AO235)+1,0)","v":0},"891 Serbia & Monten",{"$f":"IFERROR(VLOOKUP(ROWS(AQ$7:$AQ235),AO:AP,2,0),\"\")","v":""},"ARS Argentine Peso"]
[{"$nulls":8},"006",{"$nulls":15},"1860B00000 - TEGUCIGALPAHONDURAS",{"$nulls":7},"AR01 Oficina central Argentina",{"$nulls":7},{"$f":"IF(ISNUMBER(SEARCH('INSTITUTIONAL VENDOR'!$C$35,AP237)),MAX($AO$7:AO236)+1,0)","v":0},"895 Montenegro",{"$f":"IFERROR(VLOOKUP(ROWS(AQ$7:$AQ236),AO:AP,2,0),\"\")","v":""},"AUD Australian Dollar"]
[null,null,null,{"$f":"CONCATENATE(G238,\" \",I237)","v":"Afghanistan 006"},null,null,"Afghanistan",null,"009",{"$nulls":15},"1950A00000 - GSSC BUDAPEST",{"$nulls":7},"AR02 Plantas Zona Norte Argentina",{"$nulls":7},{"$f":"IF(ISNUMBER(SEARCH('INSTITUTIONAL VENDOR'!$C$35,AP238)),MAX($AO$7:AO237)+1,0)","v":0},"897 Serbia",{"$f":"IFERROR(VLOOKUP(ROWS(AQ$7:$AQ237),AO:AP,2,0),\"\")","v":""},"AWG Aruban Guilder"]
[null,null,null,"Albania 009",null,null,"Albania",null,"012",{"$nulls":15},"1950A00100 - DO GSSC",{"$nulls":7},"AR03 Plantas Zona Sur Argentina",{"$nulls":10},"AZN New Azerbaijan Manat"]
[null,null,null,"Algeria 012",null,null,"Algeria",null,697,{"$nulls":15},"1950A00200 - HR ADMIN SECTION",{"$nulls":7},"AT01 Personnel Area AT01",{"$nulls":10},"BAM Bosnia-Herzegovina Mark"]
[null,null,null,"Amer.Virgin Is. 697",null,null,"Amer.Virgin Is.",null,505,{"$nulls":15},"1950A00300 - HR PAYROLL SECTION",{"$nulls":7},"AU01 Personnel Area AU01",{"$nulls":10},"BBD Barbados Dollar"]
[null,null,null,"Andorra 505",null,null,"Andorra",null,681,{"$nulls":15},"1950A00400 - GLOBAL HELP DESK SEC",{"$nulls":7},"AU02 Personnel Area Au02",{"$nulls":10},"BDT Bangladesh Taka"]
[null,null,null,"Angola 681",null,null,"Angola",null,623,{"$nulls":15},"1950A00500 - FINANCE SECTION",{"$nulls":7},"AU03 Australia PA03",{"$nulls":10},"BGN Bulgarian Lev(a)"]
[null,null,null,"Anguilla 623",null,null,"Anguilla",null,601,{"$nulls":15},"1950A00600 - SERVICE MANAGEMENT",{"$nulls":7},"AUPS Australian Personnel Area PS",{"$nulls":10},"BHD Bahrain Dinar"]
[null,null,null,"Antigua/Barbuda 601",null,null,"Antigua/Barbuda",null,"024",{"$nulls":15},"2040A00000 - INDIA",{"$nulls":7},"BE01 Personnel area BE01",{"$nulls":10},"BIF Burundi Franc"]
[null,null,null,"Argentina 024",null,null,"Argentina",null,"026",{"$nulls":15},"2040B00000 - NEW DELHI INDIA",{"$nulls":7},"BR01 Empresa Modelo - Matriz",{"$nulls":10},"BMD Bermudan Dollar"]
[null,null,null,"Armenia 026",null,null,"Armenia",null,"025",{"$nulls":15},"2040C00000 - BHOPAL",{"$nulls":7},"BR02 Empresa Modelo - Escritório",{"$nulls":10},"BND Brunei Dollar"]
[null,null,null,"Aruba 025",null,null,"Aruba",null,"027",{"$nulls":15},"2040D00000 - BHUBANESHWAR",{"$nulls":7},"BR03 Empresa Modelo - Fundição",{"$nulls":10},"BOB Boliviano"]
[null,null,null,"Australia 027",null,null,"Australia",null,"030",{"$nulls":15},"2040E00000 - CALCUTTA",{"$nulls":7},"BR04 Empresa Modelo - Comp. Elét.",{"$nulls":10},"BRL Brazilian Real"]
[null,null,null,"Austria 030",null,null,"Austria",null,"031",{"$nulls":15},"2040F00000 - CHENNAI",{"$nulls":7},"CA01 Regional",{"$nulls":10},"BSD Bahamian Dollar"]
[null,null,null,"Azerbaijan 031",null,null,"Azerbaijan",null,603,{"$nulls":15},"2040G00000 - GANDHINAGAR",{"$nulls":7},"CA02 Unionized",{"$nulls":10},"BTN Bhutanese Ngultrum"]
[null,null,null,"Bahamas 603",null,null,"Bahamas",null,604,{"$nulls":15},"2040H00000 - HYDERABAD",{"$nulls":7},"CA03 Non-Unionized",{"$nulls":10},"BWP Botswana Pula"]
[null,null,null,"Bahrain 604",null,null,"Bahrain",null,507,{"$nulls":15},"2040I00000 - JAIPUR",{"$nulls":7},"CA04 Business Unit",{"$nulls":10},"BYN New Belarusian Ruble"]
[null,null,null,"Bangladesh 507",null,null,"Bangladesh",null,"042",{"$nulls":15},"2040J00000 - LUCKNOW",{"$nulls":7},"CH01 Switzerland Subsidiary",{"$nulls":10},"BZD Belize Dollar"]
[null,null,null,"Barbados 042",null,null,"Barbados",null,"063",{"$nulls":15},"2040K00000 - MUMBAI",{"$nulls":7},"CHS1 Modellfirma Schweiz (PCCS)",{"$nulls":10},"CAD Canadian Dollar"]
[null,null,null,"Belarus 063",null,null,"Belarus",null,"048",{"$nulls":15},"2040L00000 - PATNA",{"$nulls":7},"CN01 Personnel Area CN01",{"$nulls":10},"CDF Franc Congolais"]
[null,null,null,"Belgium 048",null,null,"Belgium",null,611,{"$nulls":15},"2040M00000 - GUWAHATI",{"$nulls":7},"CPH Supply Division Copenhagen",{"$nulls":10},"CHF Swiss Franc"]
[null,null,null,"Belize 611",null,null,"Belize",null,117,{"$nulls":15},"2040N00000 - RAIPUR",{"$nulls":7},"DE01 Personnel area DE01",{"$nulls":10},"CLP Chilean Peso"]
[null,null,null,"Benin 117",null,null,"Benin",null,605,{"$nulls":15},"2040O00000 - RANCHI",{"$nulls":7},"DK01 Personnel area DK01 - Denmark",{"$nulls":10},"CNY Chinese Yuan Renminbi"]
[null,null,null,"Bermuda 605",null,null,"Bermuda",null,"049",{"$nulls":15},"2070A00000 - INDONESIA",{"$nulls":7},"ES01 Personnel area ES01",{"$nulls":10},"COP Colombian Peso"]
[null,null,null,"Bhutan 049",null,null,"Bhutan",null,"051",{"$nulls":15},"2070B00000 - JAKARTA INDONESIA",{"$nulls":7},"FI01 Personnel area FI01",{"$nulls":10},"CRC Costa Rica Colon"]
[null,null,null,"Bolivia 051",null,null,"Bolivia",null,"053",{"$nulls":15},"2070C00000 - MAKASSAR",{"$nulls":7},"FR01 Personnel area FR01",{"$nulls":10},"CUC Cuban Peso"]
[null,null,null,"Bosnia-Herz. 053",null,null,"Bosnia-Herz.",null,"052",{"$nulls":15},"2070D00000 - AMBON",{"$nulls":7},"FRSP Personnel area FRSP",{"$nulls":10},"CVE Cape Verde Escudo"]
[null,null,null,"Botswana 052",null,null,"Botswana",null,"054",{"$nulls":15},"2070E00000 - BANDA ACEH",{"$nulls":7},"GB01 UK Subsidiary",{"$nulls":10},"CZK Czech Koruna"]
[null,null,null,"Brazil 054",null,null,"Brazil",null,640,{"$nulls":15},"2070F00000 - JAYAPURA",{"$nulls":7},"HK01 Hong Kong Subsidiary",{"$nulls":10},"DJF Djibouti Franc"]
[null,null,null,"Brit.Virgin Is. 640",null,null,"Brit.Virgin Is.",null,602,{"$nulls":15},"2070G00000 - KUPANG",{"$nulls":7},"ID01 Personnel area ID01",{"$nulls":10},"DKK Danish Krone"]
[null,null,null,"Brunei Darussal 602",null,null,"Brunei Darussal",null,"057",{"$nulls":15},"2070H00000 - MANOKWARI",{"$nulls":7},"IE01 Irish Subsidiary",{"$nulls":10},"DOP Dominican Peso"]
[null,null,null,"Bulgaria 057",null,null,"Bulgaria",null,459,{"$nulls":15},"2070I00000 - SEMARANG",{"$nulls":7},"IN01 IN Model comp - Andhra Pradesh",{"$nulls":10},"DZD Algerian Dinar"]
[null,null,null,"Burkina-Faso 459",null,null,"Burkina-Faso",null,"061",{"$nulls":15},"2070J00000 - SURABAYA",{"$nulls":7},"IN02 IN Model comp - Gujarat",{"$nulls":10},"EGP Egyptian Pound"]
[null,null,null,"Burundi 061",null,null,"Burundi",null,682,{"$nulls":15},"2100A00000 - IRAN",{"$nulls":7},"IN03 IN Model comp - Karnataka",{"$nulls":10},"ERN Eritrean Nakfa"]
[null,null,null,"Cabo Verde 682",null,null,"Cabo Verde",null,"066",{"$nulls":15},"2100B00000 - TEHERAN IRAN",{"$nulls":7},"IN04 IN Model comp - Kerala",{"$nulls":10},"ETB Ethiopian Birr"]
[null,null,null,"Cambodia 066",null,null,"Cambodia",null,"069",{"$nulls":15},"2130A00000 - IRAQ",{"$nulls":7},"IN05 IN Model comp - Madhya Pradesh",{"$nulls":10},"EUR Euro"]
[null,null,null,"Cameroon 069",null,null,"Cameroon",null,"072",{"$nulls":15},"2130B00000 - IRAQ COUNTRY OFFICE",{"$nulls":7},"IN06 IN Model comp - Maharashtra",{"$nulls":10},"FJD Fiji Dollar"]
[null,null,null,"Canada 072",null,null,"Canada",null,"071",{"$nulls":15},"2130C00000 - AL NAJAF",{"$nulls":7},"IN07 IN Model comp - Tamil Nadu",{"$nulls":10},"GBP Pound Sterling"]
[null,null,null,"Canary Islands 071",null,null,"Canary Islands",null,615,{"$nulls":15},"2130D00000 - BAGHDAD CENTRAL ZONE",{"$nulls":7},"IN08 IN Model comp - West Bengal",{"$nulls":10},"GEL Georgian Lari"]
[null,null,null,"Cayman Islands 615",null,null,"Cayman Islands",null,"075",{"$nulls":15},"2130E00000 - KIRKUK",{"$nulls":7},"IN09 IN Model comp - Assam",{"$nulls":10},"GHS Ghana Cedi (new)"]
[null,null,null,"Central Afr.Rep 075",null,null,"Central Afr.Rep",null,"081",{"$nulls":15},"2130F00000 - ZO SOUTH BASRAH",{"$nulls":7},"IN10 IN Model comp - Mizoram",{"$nulls":10},"GIP Gibraltar Pound"]
[null,null,null,"Chad 081",null,null,"Chad",null,"084",{"$nulls":15},"2130G00000 - ZONE OFFICE NORTH",{"$nulls":7},"IN11 IN Model comp - Nagaland",{"$nulls":10},"GMD Gambian Dalasi"]
[null,null,null,"Chile 084",null,null,"Chile",null,"086",{"$nulls":15},"2130H00000 - DOHUK",{"$nulls":7},"IN12 IN Model comp - Tripura",{"$nulls":10},"GNF Guinean Franc"]
[null,null,null,"China 086",null,null,"China",null,"093",{"$nulls":15},"2130I00000 - KUT",{"$nulls":7},"IN13 IN Model comp - Orissa",{"$nulls":10},"GTQ Guatemalan Quetzal"]
[null,null,null,"Colombia 093",null,null,"Colombia",null,662,{"$nulls":15},"2130J00000 - AMARAH",{"$nulls":7},"IN14 IN Model comp - Rajasthan",{"$nulls":10},"GYD Guyanese Dollar"]
[null,null,null,"Comoros 662",null,null,"Comoros",null,338,{"$nulls":15},"2130K00000 - IRAQ CENTER AMMAN",{"$nulls":7},"IN15 IN Model comp - Chhattisgarh",{"$nulls":10},"HKD Hong Kong Dollar"]
[null,null,null,"Congo 338",null,null,"Congo",null,"099",{"$nulls":15},"2220A00000 - OFFICE OF RESEARCH",{"$nulls":7},"IT01 Area Risorse Umane IT01",{"$nulls":10},"HNL Honduran Lempira"]
[null,null,null,"Congo, Dem. Rep 099",null,null,"Congo, Dem. Rep",null,679,{"$nulls":15},"2220A00100 - RESEARCH SECTION",{"$nulls":7},"JP01 Personnel area JP01",{"$nulls":10},"HRK Croatian Kuna"]
[null,null,null,"Cook Islands 679",null,null,"Cook Islands",null,102,{"$nulls":15},"2250A00000 - COTE D'IVOIRE",{"$nulls":7},"JP02 Personnel area JP02",{"$nulls":10},"HTG Haitian Gourde"]
[null,null,null,"Costa Rica 102",null,null,"Costa Rica",null,225,{"$nulls":15},"2250B00000 - ABIDJANCOTED'IVOIRE",{"$nulls":7},"KR01 Personnel area KR01",{"$nulls":10},"HUF Hungarian Forint"]
[null,null,null,"Cote d'Ivoire 225",null,null,"Cote d'Ivoire",null,103,{"$nulls":15},"2250C00000 - BOUAKE",{"$nulls":7},"MX01 Personnel area MX01",{"$nulls":10},"IDR Indonesian Rupiah"]
[null,null,null,"Croatia 103",null,null,"Croatia",null,105,{"$nulls":15},"2250D00000 - MAN",{"$nulls":7},"MXSP Personnel area MXSP",{"$nulls":10},"ILS Israeli Shekel"]
[null,null,null,"Cuba 105",null,null,"Cuba",null,111,{"$nulls":15},"2280A00000 - JAMAICA",{"$nulls":7},"MY01 Kuala Lumpur - Malaysia",{"$nulls":10},"INR Indian Rupee"]
[null,null,null,"Cyprus 111",null,null,"Cyprus",null,113,{"$nulls":15},"2280B00000 - KINGSTON JAMAICA",{"$nulls":7},"MY02 Petaling Jaya - Malaysia",{"$nulls":10},"IQD Iraqui Dinar"]
[null,null,null,"Czech Republic 113",null,null,"Czech Republic",null,515,{"$nulls":15},"2340A00000 - JORDAN",{"$nulls":7},"NL01 Modelfirma Nederland BV",{"$nulls":10},"IRR Iranian Rial"]
[null,null,null,"D.P.R. of Korea 515",null,null,"D.P.R. of Korea",null,120,{"$nulls":15},"2340B00000 - AMMAN JORDAN",{"$nulls":7},"NO01 Personalomraade 1 Norge",{"$nulls":10},"ISK Iceland Krona"]
[null,null,null,"Denmark 120",null,null,"Denmark",null,669,{"$nulls":15},"234RA00000 - MENA",{"$nulls":7},"NO02 Personalomraade 2 Norge",{"$nulls":10},"JMD Jamaican Dollar"]
[null,null,null,"Djibouti 669",null,null,"Djibouti",null,610,{"$nulls":15},"234RB00000 - REG SERV DIV MENA",{"$nulls":7},"NYHQ Unicef HQ New York",{"$nulls":10},"JOD Jordanian Dinar"]
[null,null,null,"Dominica 610",null,null,"Dominica",null,126,{"$nulls":15},"2390A00000 - KAZAKSTAN",{"$nulls":7},"NZ01 New Zealand Pers. Area",{"$nulls":10},"JPY Japanese Yen"]
[null,null,null,"Dominican Rep. 126",null,null,"Dominican Rep.",null,135,{"$nulls":15},"2390B00000 - ASTANA KAZAKHSTAN",{"$nulls":7},"OE01 Öffentlicher Dienst (DE)",{"$nulls":10},"KES Kenyan Shilling"]
[null,null,null,"Ecuador 135",null,null,"Ecuador",null,450,{"$nulls":15},"2390C00000 - ALMA ATA",{"$nulls":7},"PH01 Philippines Provincial Office",{"$nulls":10},"KGS Kyrgyzstan Som"]
[null,null,null,"Egypt 450",null,null,"Egypt",null,138,{"$nulls":15},"2400A00000 - KENYA",{"$nulls":7},"PSDG Private Sector Division Geneva",{"$nulls":10},"KHR Cambodian Riel"]
[null,null,null,"El Salvador 138",null,null,"El Salvador",null,139,{"$nulls":15},"2400B00000 - NAIROBI KENYA",{"$nulls":7},"PSDN Private Section Division NY",{"$nulls":10},"KMF Comoros Franc"]
[null,null,null,"Equatorial Guin 139",null,null,"Equatorial Guin",null,142,{"$nulls":15},"2400C00000 - GARISSA",{"$nulls":7},"PT01 Personnel area PT01",{"$nulls":10},"KPW01 KPW"]
[null,null,null,"Eritrea 142",null,null,"Eritrea",null,140,{"$nulls":15},"2400D00000 - KISUMU",{"$nulls":7},"SE01 SAP Svenska AB",{"$nulls":10},"KRW South Korean Won"]
[null,null,null,{"$f":"CONCATENATE(G302,\" \",I301)","v":"Estonia 140"},null,null,"Estonia",null,141,{"$nulls":15},"2400E00000 - DADAAD",{"$nulls":7},"SG01 Plant Singapore 1",{"$nulls":10},"KWD Kuwaiti Dinar"]
[null,null,null,"Ethiopia 141",null,null,"Ethiopia",null,143,{"$nulls":15},"2400F00000 - LODWAR",{"$nulls":7},"SG02 Plant Singapore 2",{"$nulls":10},"KYD Cayman Dollar"]
[null,null,null,"Fiji 143",null,null,"Fiji",null,144,{"$nulls":15},"240BB00000 - INNOVATION CENTER",{"$nulls":7},"SHL PSD Shop Labor",{"$nulls":10},"KZT Kazakhstani Tenge"]
[null,null,null,"Finland 144",null,null,"Finland",null,147,{"$nulls":15},"240BB00100 - DIRECTOR'S OFFICE",{"$nulls":7},"TH01 Personnel Area TH01",{"$nulls":10},"LAK Laotian Kip"]
[null,null,null,"France 147",null,null,"France",null,668,{"$nulls":15},"240RA00000 - ESARO",{"$nulls":7},"TW01 Taiwan personnel area",{"$nulls":10},"LBP Lebanese Pound"]
[null,null,null,"Frenc.Polynesia 668",null,null,"Frenc.Polynesia",null,660,{"$nulls":15},"240RB00000 - REG SERV DIV ESAR",{"$nulls":7},"UN01 Personnel area UN01",{"$nulls":10},"LKR Sri Lankan Rupee"]
[null,null,null,"French Antilles 660",null,null,"French Antilles",null,665,{"$nulls":15},"2450A00000 - REP. OF KYRGYZSTAN",{"$nulls":7},"US01 United States Headquarter",{"$nulls":10},"LRD Liberian Dollar"]
[null,null,null,"French Guiana 665",null,null,"French Guiana",null,153,{"$nulls":15},"2450B00000 - BISHKEK KYRGYZSTAN",{"$nulls":7},"US02 US Product A",{"$nulls":10},"LSL Lesotho Loti"]
[null,null,null,"Gabon 153",null,null,"Gabon",null,156,{"$nulls":15},"2450C00000 - OSH",{"$nulls":7},"US03 US Product B",{"$nulls":10},"LTL Lithuanian Lita"]
[null,null,null,"Gambia 156",null,null,"Gambia",null,160,{"$nulls":15},"2460A00000 - LAO PEOPLE'S DEM REP",{"$nulls":7},"US04 US Subsidiary A",{"$nulls":10},"LVL Lativian Lat"]
[null,null,null,"Georgia 160",null,null,"Georgia",null,525,{"$nulls":15},"2460B00000 - VIENTIANE LAO PDR",{"$nulls":7},"VE01 Area de personal Venezolana 1",{"$nulls":10},"LYD Libyan Dinar"]
[null,null,null,"Germany 525",null,null,"Germany",null,162,{"$nulls":15},"2460C00000 - LUANG NAMTHA",{"$nulls":7},"VE02 Modelo de Compañia II Vzla",{"$nulls":10},"MAD Moroccan Dirham"]
[null,null,null,"Ghana 162",null,null,"Ghana",null,163,{"$nulls":15},"2490A00000 - LEBANON",{"$nulls":7},"XX01 Personnel area XX01",{"$nulls":10},"MDL Moldavan Leu"]
[null,null,null,"Gibraltar 163",null,null,"Gibraltar",null,165,{"$nulls":15},"2490B00000 - BEIRUT LEBANON",{"$nulls":7},"ZA01 Head Office - Johannesburg ZA",{"$nulls":10},"MGA Malagasy Ariary"]
[null,null,null,"Greece 165",null,null,"Greece",null,"001",{"$nulls":15},"2490C00000 - TYRE",{"$nulls":7},"ZA02 Factory - Midrand ZA",{"$nulls":10},"MKD Macedonian Denar"]
[null,null,null,"Greenland 001",null,null,"Greenland",null,616,{"$nulls":15},"2520A00000 - LESOTHO",{"$nulls":7},"ZA03 Regional Office - Cape Town ZA",{"$nulls":10},"MMK Myanmar Kyat"]
[null,null,null,"Grenada 616",null,null,"Grenada",null,666,{"$nulls":15},"2520B00000 - MASERU LESOTHO",{"$nulls":7},"ZA04 Regional Office - Durban ZA",{"$nulls":10},"MNT Mongolian Tugrik"]
[null,null,null,"Guadeloupe 666",null,null,"Guadeloupe",null,"004",{"$nulls":15},"2550A00000 - LIBERIA",{"$nulls":18},"MOP Macao Pataca"]
[null,null,null,"Guam 004",null,null,"Guam",null,168,{"$nulls":15},"2550B00000 - MONROVIA LIBERIA",{"$nulls":18},"MRU Mauritanian Ouguiya"]
[null,null,null,"Guatemala 168",null,null,"Guatemala",null,177,{"$nulls":15},"2550C00000 - ZO: ZWEDRU",{"$nulls":18},"MUR Mauritius Rupee"]
[null,null,null,"Guinea 177",null,null,"Guinea",null,685,{"$nulls":15},"2550D00000 - ZO: HARPER",{"$nulls":18},"MVR Maldive Rufiyaa"]
[null,null,null,"Guinea-Bissau 685",null,null,"Guinea-Bissau",null,180,{"$nulls":15},"2550E00000 - ZO: GBARNGA",{"$nulls":18},"MWK Malawi Kwacha"]
[null,null,null,"Guyana 180",null,null,"Guyana",null,183,{"$nulls":15},"2580A00000 - LIBYA",{"$nulls":18},"MXN Mexican Peso"]
[null,null,null,"Haiti 183",null,null,"Haiti",null,186,{"$nulls":15},"2580B00000 - TRIPOLI LIBYAN ARAB",{"$nulls":18},"MYR Malaysian Ringgit"]
[null,null,null,"Honduras 186",null,null,"Honduras",null,612,{"$nulls":15},"2580C00000 - BENGHAZI",{"$nulls":18},"MZN Mozambique Metical (new)"]
[null,null,null,"Hong Kong 612",null,null,"Hong Kong",null,195,{"$nulls":15},"2660A00000 - MACEDONIA",{"$nulls":18},"NAD Namibian dollar"]
[null,null,null,"Hungary 195",null,null,"Hungary",null,198,{"$nulls":15},"2660B00000 - SKOPJE MACEDONIA",{"$nulls":18},"NGN Nigerian Naira"]
[null,null,null,"Iceland 198",null,null,"Iceland",null,204,{"$nulls":15},"2670A00000 - MADAGASCAR",{"$nulls":18},"NIO Nicaraguan Cordoba Oro"]
[null,null,null,"India 204",null,null,"India",null,207,{"$nulls":15},"2670B00000 - ANTANANARIVO MG",{"$nulls":18},"NOK Norwegian Krone"]
[null,null,null,"Indonesia 207",null,null,"Indonesia",null,210,{"$nulls":15},"2670C00000 - AMBOVOMBE",{"$nulls":18},"NPR Nepalese Rupee"]
[null,null,null,"Iran 210",null,null,"Iran",null,213,{"$nulls":15},"2670D00000 - FORT DAUPHIN MDG",{"$nulls":18},"NZD New Zealand Dollar"]
[null,null,null,"Iraq 213",null,null,"Iraq",null,216,{"$nulls":15},"2690A00000 - MALAWI",{"$nulls":18},"OMR Omani Rial"]
[null,null,null,"Ireland 216",null,null,"Ireland",null,219,{"$nulls":15},"2690B00000 - LILONGWE MALAWI",{"$nulls":18},"PAB Panamanian Balboa"]
[null,null,null,"Israel 219",null,null,"Israel",null,222,{"$nulls":15},"2700A00000 - MALAYSIA",{"$nulls":18},"PEN Peruvian Nuevo Sol"]
[null,null,null,"Italy 222",null,null,"Italy",null,228,{"$nulls":15},"2700B00000 - KUALA LUMPUR MY",{"$nulls":18},"PGK Papua New Guinea Kina"]
[null,null,null,"Jamaica 228",null,null,"Jamaica",null,231,{"$nulls":15},"2740A00000 - MALDIVES",{"$nulls":18},"PHP Philippine Peso"]
[null,null,null,"Japan 231",null,null,"Japan",null,234,{"$nulls":15},"2740B00000 - MALE MALDIVES",{"$nulls":18},"PKR Pakistani Rupee"]
[null,null,null,"Jordan 234",null,null,"Jordan",null,239,{"$nulls":15},"2760A00000 - MALI",{"$nulls":18},"PLN Poland Zloty"]
[null,null,null,"Kazakhstan 239",null,null,"Kazakhstan",null,240,{"$nulls":15},"2760B00000 - BAMAKO MALI",{"$nulls":18},"PYG Paraguayan Guarani"]
[null,null,null,"Kenya 240",null,null,"Kenya",null,617,{"$nulls":15},"2760C00000 - KAYES",{"$nulls":18},"QAR Qatari Rial"]
[null,null,null,"Kiribati 617",null,null,"Kiribati",null,243,{"$nulls":15},"2760D00000 - KOULIKORO",{"$nulls":18},"RON New Romanian Leu"]
[null,null,null,"Kuwait 243",null,null,"Kuwait",null,245,{"$nulls":15},"2760E00000 - MOPTI",{"$nulls":18},"RSD Serbia Dinar"]
[null,null,null,"Kyrgyzstan 245",null,null,"Kyrgyzstan",null,246,{"$nulls":15},"2760F00000 - SEGOU",{"$nulls":18},"RUB Russian Rouble"]
[null,null,null,"Lao,Peo.Dem.Rep 246",null,null,"Lao,Peo.Dem.Rep",null,247,{"$nulls":15},"2760G00000 - GAO MALI",{"$nulls":18},"RWF Rwanda Franc"]
[null,null,null,"Latvia 247",null,null,"Latvia",null,249,{"$nulls":15},"2760H00000 - SIKASSO MALI",{"$nulls":18},"SAR Saudi Riyal"]
[null,null,null,"Lebanon 249",null,null,"Lebanon",null,252,{"$nulls":15},"2760I00000 - TOMBOUCTOU MALI",{"$nulls":18},"SBD Solomon Islands Dollar"]
[null,null,null,"Lesotho 252",null,null,"Lesotho",null,255,{"$nulls":15},"2820A00000 - MAURITANIA",{"$nulls":18},"SCR Seychelles Rupee"]
[null,null,null,"Liberia 255",null,null,"Liberia",null,258,{"$nulls":15},"2820B00000 - NOUAKCHOTT MR",{"$nulls":18},"SDG Sudanese Pound (new)"]
[null,null,null,"Libya 258",null,null,"Libya",null,555,{"$nulls":15},"2820C00000 - AIOUN",{"$nulls":18},"SEK Swedish Krona"]
[null,null,null,"Liechtenstein 555",null,null,"Liechtenstein",null,260,{"$nulls":15},"2820D00000 - BASSIKOUNOU",{"$nulls":18},"SGD Singapore Dollar"]
[null,null,null,"Lithuania 260",null,null,"Lithuania",null,264,{"$nulls":15},"2820E00000 - KIFFA",{"$nulls":18},"SHP St.Helena Pound"]
[null,null,null,"Luxembourg 264",null,null,"Luxembourg",null,688,{"$nulls":15},"2850A00000 - MEXICO",{"$nulls":18},"SLL Sierra Leone"]
[null,null,null,"Macau 688",null,null,"Macau",null,266,{"$nulls":15},"2850B00000 - MEXICO CITY MEXICO",{"$nulls":18},"SOS Somalian Shilling"]
[null,null,null,"Macedonia, TFYR 266",null,null,"Macedonia, TFYR",null,267,{"$nulls":15},"2880A00000 - MONGOLIA",{"$nulls":18},"SRD Surinamese Dollar"]
[null,null,null,"Madagascar 267",null,null,"Madagascar",null,269,{"$nulls":15},"2880B00000 - ULAANBAATARMONGOLIA",{"$nulls":18},"SSP South Sudanese Pound"]
[null,null,null,"Malawi 269",null,null,"Malawi",null,270,{"$nulls":15},"2880C00000 - KHOVD CITY",{"$nulls":18},"STD Sao Tome / Principe Dobra"]
[null,null,null,"Malaysia 270",null,null,"Malaysia",null,274,{"$nulls":15},"2880D00000 - KHUVSGUL MONGOLIA",{"$nulls":18},"SVC El Salvador Colon"]
[null,null,null,"Maldives,Rep of 274",null,null,"Maldives,Rep of",null,276,{"$nulls":15},"2910A00000 - MOROCCO",{"$nulls":18},"SYP Syrian Pound"]
[null,null,null,"Mali 276",null,null,"Mali",null,279,{"$nulls":15},"2910B00000 - RABAT MOROCCO",{"$nulls":18},"SZL Swaziland Lilangeni"]
[null,null,null,"Malta 279",null,null,"Malta",null,692,{"$nulls":15},"2970A00000 - NEPAL",{"$nulls":18},"THB Thailand Baht"]
[null,null,null,"Marshall Islnds 692",null,null,"Marshall Islnds",null,664,{"$nulls":15},"2970B00000 - KATHMANDU NEPAL",{"$nulls":18},"TJS Tajik Somoni"]
[null,null,null,"Martinique 664",null,null,"Martinique",null,282,{"$nulls":15},"2970C00000 - BHARATPUR",{"$nulls":18},"TMT Turkmenistan Manat"]
[null,null,null,"Mauritania 282",null,null,"Mauritania",null,283,{"$nulls":15},"2970D00000 - BIRATNAGER",{"$nulls":18},"TND Tunisian Dinar"]
[null,null,null,"Mauritius 283",null,null,"Mauritius",null,285,{"$nulls":15},"2970E00000 - BIRGANG",{"$nulls":18},"TOP Tongan Pa'anga"]
[null,null,null,{"$f":"CONCATENATE(G366,\" \",I365)","v":"Mexico 285"},null,null,"Mexico",null,693,{"$nulls":15},"2970F00000 - DHADHELDURA",{"$nulls":18},"TRY New Turkish Lira"]
[null,null,null,"Micronesia 693",null,null,"Micronesia",null,564,{"$nulls":15},"2970G00000 - GAIGHAT",{"$nulls":18},"TTD Trinidad and Tobago Dollar"]
[null,null,null,"Moldova, Rep of 564",null,null,"Moldova, Rep of",null,565,{"$nulls":15},"2970H00000 - GHORAHI",{"$nulls":18},"TZS Tanzanian Shilling"]
[null,null,null,"Monaco 565",null,null,"Monaco",null,288,{"$nulls":15},"2970I00000 - MANGALSEN",{"$nulls":18},"UAH Ukrainian Hryvnia"]
[null,null,null,"Mongolia 288",null,null,"Mongolia",null,895,{"$nulls":15},"2970J00000 - NEPALGUNJ",{"$nulls":18},"UGX Ugandan Shilling"]
[null,null,null,"Montenegro 895",null,null,"Montenegro",null,620,{"$nulls":15},"2970K00000 - PANCHTHAR",{"$nulls":18},"USD US Dollar"]
[null,null,null,"Montserrat 620",null,null,"Montserrat",null,291,{"$nulls":15},"2970L00000 - RAJBIRAJ",{"$nulls":18},"UYU Uruguayan Peso"]
[null,null,null,"Morocco 291",null,null,"Morocco",null,689,{"$nulls":15},"2970M00000 - SIMIKOT",{"$nulls":18},"UZS Uzbekistan Som"]
[null,null,null,"Mozambique 689",null,null,"Mozambique",null,"060",{"$nulls":15},"2970N00000 - TAULIHAWA",{"$nulls":18},"VES Venezuela Bolivar Soberano"]
[null,null,null,"Myanmar 060",null,null,"Myanmar",null,700,{"$nulls":15},"2970O00000 - JUMLA NEPAL",{"$nulls":18},"VND Vietnamese Dong"]
[null,null,null,"N.Mariana Is. 700",null,null,"N.Mariana Is.",null,698,{"$nulls":15},"2970P00000 - SINDHUPALCHOWK",{"$nulls":18},"VUV Vanuatu Vatu"]
[null,null,null,"Namibia 698",null,null,"Namibia",null,648,{"$nulls":15},"2970Q00000 - DOLAKHA",{"$nulls":18},"WST Samoan Tala"]
[null,null,null,"Nauru 648",null,null,"Nauru",null,297,{"$nulls":15},"2970R00000 - GORKHA",{"$nulls":18},"XAF C.F.A. Franc (BEAC)"]
[null,null,null,"Nepal 297",null,null,"Nepal",null,300,{"$nulls":15},"2970S00000 - NUWAKOT",{"$nulls":18},"XCD East Carribean Dollar"]
[null,null,null,"Netherlands 300",null,null,"Netherlands",null,672,{"$nulls":15},"297RA00000 - ROSA",{"$nulls":18},"XOF C.F.A. Franc (BCEAO)"]
[null,null,null,"Netherlands Ant 672",null,null,"Netherlands Ant",null,667,{"$nulls":15},"297RB00000 - REG SERV DIV ROSA",{"$nulls":18},"YER Yemeni Rial"]
[null,null,null,"New Caledonia 667",null,null,"New Caledonia",null,309,{"$nulls":15},"3120A00000 - NICARAGUA",{"$nulls":18},"ZAR South African Rand"]
[null,null,null,"New Zealand 309",null,null,"New Zealand",null,312,{"$nulls":15},"3120B00000 - MANAGUA NICARAGUA",{"$nulls":18},"ZMW Zambian Kwacha"]
[null,null,null,"Nicaragua 312",null,null,"Nicaragua",null,318,{"$nulls":15},"3120C00000 - BILWI",{"$nulls":18},"ZWL Zimbabwe Dollar"]
[null,null,null,"Niger 318",null,null,"Niger",null,321,{"$nulls":15},"3120D00000 - BLUEFIELDS NICARAGU",{"$nulls":18},"0060 - Afghanistan"]
[null,null,null,"Nigeria 321",null,null,"Nigeria",null,680,{"$nulls":15},"3180A00000 - NIGER",{"$nulls":18},"0090 - Albania"]
[null,null,null,"Niue 680",null,null,"Niue",null,324,{"$nulls":15},"3180B00000 - NIAMEY NIGER",{"$nulls":18},"0120 - Algeria"]
[null,null,null,"Norway 324",null,null,"Norway",null,701,{"$nulls":15},"3180C00000 - AGADEZ",{"$nulls":18},"0240 - Argentina"]
[null,null,null,"Not Applicable 701",null,null,"Not Applicable",null,635,{"$nulls":15},"3180D00000 - MARADI",{"$nulls":18},"0260 - Armenia"]
[null,null,null,"Oman 635",null,null,"Oman",null,330,{"$nulls":15},"3180E00000 - DIFFA",{"$nulls":18},"0310 - Azerbaijan"]
[null,null,null,"Pakistan 330",null,null,"Pakistan",null,690,{"$nulls":15},"3210A00000 - NIGERIA",{"$nulls":18},"0420 - Barbados"]
[null,null,null,"Palau, Rep of 690",null,null,"Palau, Rep of",null,705,{"$nulls":15},"3210B00000 - ABUJA NIGERIA",{"$nulls":18},"0490 - Bhutan"]
[null,null,null,"Palestine 705",null,null,"Palestine",null,333,{"$nulls":15},"3210C00000 - BAUCHI",{"$nulls":18},"0510 - Bolivia"]
[null,null,null,"Panama 333",null,null,"Panama",null,649,{"$nulls":15},"3210D00000 - ENUGU",{"$nulls":18},"0520 - Botswana"]
[null,null,null,"Pap. New Guinea 649",null,null,"Pap. New Guinea",null,336,{"$nulls":15},"3210E00000 - KADUNA",{"$nulls":18},"0530 - Bosnia and Herzegovina"]
[null,null,null,"Paraguay 336",null,null,"Paraguay",null,339,{"$nulls":15},"3210F00000 - LAGOS",{"$nulls":18},"0540 - Brazil"]
[null,null,null,"Peru 339",null,null,"Peru",null,342,{"$nulls":15},"3210G00000 - MAIDUGURI",{"$nulls":18},"0570 - Bulgaria"]
[null,null,null,"Philippines 342",null,null,"Philippines",null,345,{"$nulls":15},"3210H00000 - SOKOTO",{"$nulls":18},"0600 - Myanmar"]
[null,null,null,"Poland 345",null,null,"Poland",null,348,{"$nulls":15},"3210I00000 - KATSINA",{"$nulls":18},"0610 - Burundi"]
[null,null,null,"Portugal 348",null,null,"Portugal",null,695,{"$nulls":15},"3210J00000 - RIVERS ZONE OFFICE",{"$nulls":18},"0630 - Belarus"]
[null,null,null,"Puerto Rico 695",null,null,"Puerto Rico",null,624,{"$nulls":15},"3210K00000 - ONDO",{"$nulls":18},"0660 - Cambodia"]
[null,null,null,"Qatar 624",null,null,"Qatar",null,663,{"$nulls":15},"3300A00000 - PAKISTAN",{"$nulls":18},"0690 - Republic of Cameroon"]
[null,null,null,"Reunion 663",null,null,"Reunion",null,366,{"$nulls":15},"3300B00000 - ISLAMABAD PAKISTAN",{"$nulls":18},"0750 - Central African Republic"]
[null,null,null,"Romania 366",null,null,"Romania",null,370,{"$nulls":15},"3300C00000 - KARACHI",{"$nulls":18},"0780 - Sri Lanka"]
[null,null,null,"Russian Fed. 370",null,null,"Russian Fed.",null,375,{"$nulls":15},"3300D00000 - LAHORE",{"$nulls":18},"0810 - Chad"]
[null,null,null,"Rwanda 375",null,null,"Rwanda",null,683,{"$nulls":15},"3300E00000 - PESHAWAR",{"$nulls":18},"0840 - Chile"]
[null,null,null,"S.Tome&Principe 683",null,null,"S.Tome&Principe",null,590,{"$nulls":15},"3300F00000 - QUETTA",{"$nulls":18},"0860 - China"]
[null,null,null,"Samoa 590",null,null,"Samoa",null,696,{"$nulls":15},"3300G00000 - DUBAI UAE",{"$nulls":18},"0930 - Colombia"]
[null,null,null,"Samoa,American 696",null,null,"Samoa,American",null,570,{"$nulls":15},"3330A00000 - PANAMA",{"$nulls":18},"0990 - Democratic Republic of Congo"]
[null,null,null,"San Marino 570",null,null,"San Marino",null,378,{"$nulls":15},"3330B00000 - PANAMA CITY",{"$nulls":18},"1020 - Costa Rica"]
[null,null,null,"Saudi Arabia 378",null,null,"Saudi Arabia",null,381,{"$nulls":15},"333RA00000 - LACRO",{"$nulls":18},"1030 - Croatia"]
[null,null,null,"Senegal 381",null,null,"Senegal",null,897,{"$nulls":15},"333RB00000 - REG SERV DIV LACR",{"$nulls":18},"1050 - Cuba"]
[null,null,null,"Serbia 897",null,null,"Serbia",null,891,{"$nulls":15},"333RC00000 - PANAMA HUB LACR",{"$nulls":18},"1170 - Benin"]
[null,null,null,"Serbia & Monten 891",null,null,"Serbia & Monten",null,628,{"$nulls":15},"3360A00000 - PARAGUAY",{"$nulls":18},"1200 - Denmark"]
[null,null,null,"Seychelles 628",null,null,"Seychelles",null,390,{"$nulls":15},"3360B00000 - ASUNCION PARAGUAY",{"$nulls":18},"1260 - Dominican Republic"]
[null,null,null,"Sierra Leone 390",null,null,"Sierra Leone",null,645,{"$nulls":15},"3380A00000 - CONGO",{"$nulls":18},"1350 - Ecuador"]
[null,null,null,"Sikkim 645",null,null,"Sikkim",null,391,{"$nulls":15},"3380B00000 - BRAZZAVILLE CONGO",{"$nulls":18},"1380 - El Salvador"]
[null,null,null,"Singapore 391",null,null,"Singapore",null,395,{"$nulls":15},"3380C00000 - POINTE NOIRE",{"$nulls":18},"1390 - Equatorial Guinea"]
[null,null,null,"Slovak Republic 395",null,null,"Slovak Republic",null,394,{"$nulls":15},"3390A00000 - PERU",{"$nulls":18},"1410 - Ethiopia"]
[null,null,null,"Slovenia 394",null,null,"Slovenia",null,631,{"$nulls":15},"3390B00000 - LIMA PERU",{"$nulls":18},"1420 - Eritrea"]
[null,null,null,"Solomon Islands 631",null,null,"Solomon Islands",null,392,{"$nulls":15},"3390C00000 - ABANCAY",{"$nulls":18},"1430 - Fiji (Pacific Islands)"]
[null,null,null,"Somalia 392",null,null,"Somalia",null,393,{"$nulls":15},"3390D00000 - AYACUCHO",{"$nulls":18},"1530 - Gabon"]
[null,null,null,"South Africa 393",null,null,"South Africa",null,567,{"$nulls":15},"3390E00000 - CUZCO",{"$nulls":18},"1560 - Gambia"]
[null,null,null,"South Korea,Rep 567",null,null,"South Korea,Rep",null,404,{"$nulls":15},"3390F00000 - UCAYALI",{"$nulls":18},"1600 - Georgia"]
[null,null,null,"South Sudan 404",null,null,"South Sudan",null,399,{"$nulls":15},"3420A00000 - PHILIPPINES",{"$nulls":18},"1620 - Ghana"]
[null,null,null,"Spain 399",null,null,"Spain",null,"078",{"$nulls":15},"3420B00000 - MANILA",{"$nulls":18},"1680 - Guatemala"]
[null,null,null,"Sri Lanka 078",null,null,"Sri Lanka",null,627,{"$nulls":15},"3420C00000 - COTABATO",{"$nulls":18},"1770 - Guinea"]
[null,null,null,"St Kitts&Nevis 627",null,null,"St Kitts&Nevis",null,625,{"$nulls":15},"3420D00000 - DAVAO",{"$nulls":18},"1800 - Guyana"]
[null,null,null,"St. Helena 625",null,null,"St. Helena",null,629,{"$nulls":15},"3420E00000 - CEBU",{"$nulls":18},"1830 - Haiti"]
[null,null,null,{"$f":"CONCATENATE(G430,\" \",I429)","v":"St. Lucia 629"},null,null,"St. Lucia",null,630,{"$nulls":15},"3420F00000 - TACLOBAN",{"$nulls":18},"1860 - Honduras"]
[null,null,null,"St. Vincent 630",null,null,"St. Vincent",null,499,{"$nulls":15},"3420G00000 - ROXAS",{"$nulls":18},"1950 - Global Shared Services Center"]
[null,null,null,"Stateless 499",null,null,"Stateless",null,402,{"$nulls":15},"3420H00000 - ZAMBOANGA",{"$nulls":18},"2040 - India"]
[null,null,null,"Sudan 402",null,null,"Sudan",null,678,{"$nulls":15},"3660A00000 - ROMANIA",{"$nulls":18},"2070 - Indonesia"]
[null,null,null,"Suriname 678",null,null,"Suriname",null,403,{"$nulls":15},"3660B00000 - BUCHAREST ROMANIA",{"$nulls":18},"2100 - Iran"]
[null,null,null,"Swaziland 403",null,null,"Swaziland",null,411,{"$nulls":15},"3750A00000 - RWANDA",{"$nulls":18},"2130 - Iraq"]
[null,null,null,"Sweden 411",null,null,"Sweden",null,575,{"$nulls":15},"3750B00000 - KIGALI RWANDA",{"$nulls":18},"2220 - Office of Research, Italy"]
[null,null,null,"Switzerland 575",null,null,"Switzerland",null,414,{"$nulls":15},"3780A00000 - SAUDI ARABIA",{"$nulls":18},"2250 - Cote D'Ivoire"]
[null,null,null,"Syria, Arab Rep 414",null,null,"Syria, Arab Rep",null,415,{"$nulls":15},"3780B00000 - RIYADH GULF AREA",{"$nulls":18},"2280 - Jamaica"]
[null,null,null,"Tajikistan 415",null,null,"Tajikistan",null,455,{"$nulls":15},"3780C00000 - ABU DHABI GULF AREA",{"$nulls":18},"2340 - Jordan"]
[null,null,null,"Tanzania,Uni.Re 455",null,null,"Tanzania,Uni.Re",null,420,{"$nulls":15},"3780D00000 - BAHRAIN GULF AREA",{"$nulls":18},"234R - MENA, Jordan"]
[null,null,null,"Thailand 420",null,null,"Thailand",null,706,{"$nulls":15},"3780E00000 - DUBAI GULF AREA",{"$nulls":18},"2390 - Kazakhstan"]
[null,null,null,"Timor-Leste 706",null,null,"Timor-Leste",null,423,{"$nulls":15},"3780F00000 - KUWAIT GULF AREA",{"$nulls":18},"2400 - Kenya"]
[null,null,null,"Togo 423",null,null,"Togo",null,656,{"$nulls":15},"3780G00000 - QATAR GULF AREA",{"$nulls":18},"240B - Office of Global Innovation"]
[null,null,null,"Tokelau Islands 656",null,null,"Tokelau Islands",null,634,{"$nulls":15},"3810A00000 - SENEGAL",{"$nulls":18},"240R - ESARO, Kenya"]
[null,null,null,"Tonga 634",null,null,"Tonga",null,429,{"$nulls":15},"3810B00000 - DAKAR SENEGAL",{"$nulls":18},"2450 - Republic of Kyrgyzstan"]
[null,null,null,"Trinidad,Tobago 429",null,null,"Trinidad,Tobago",null,432,{"$nulls":15},"3810C00000 - ZIGUINCHOR",{"$nulls":18},"2460 - Lao People's Dem Rep."]
[null,null,null,"Tunisia 432",null,null,"Tunisia",null,435,{"$nulls":15},"381RA00000 - WCARO",{"$nulls":18},"2490 - Lebanon"]
[null,null,null,"Turkey 435",null,null,"Turkey",null,436,{"$nulls":15},"381RB00000 - REG SERV DIV WCAR",{"$nulls":18},"2520 - Lesotho"]
[null,null,null,"Turkmenistan 436",null,null,"Turkmenistan",null,636,{"$nulls":15},"3900A00000 - SIERRA LEONE",{"$nulls":18},"2550 - Liberia"]
[null,null,null,"Turks& Caicosin 636",null,null,"Turks& Caicosin",null,618,{"$nulls":15},"3900B00000 - FREETOWN SL",{"$nulls":18},"2580 - Libya"]
[null,null,null,"Tuvalu 618",null,null,"Tuvalu",null,438,{"$nulls":15},"3900C00000 - KENEMA",{"$nulls":18},"2660 - North Macedonia"]
[null,null,null,"Uganda 438",null,null,"Uganda",null,441,{"$nulls":15},"3900D00000 - MAKENI",{"$nulls":18},"2670 - Madagascar"]
[null,null,null,"Ukraine 441",null,null,"Ukraine",null,453,{"$nulls":15},"3920A00000 - SOMALIA",{"$nulls":18},"2690 - Malawi"]
[null,null,null,"United Kingdom 453",null,null,"United Kingdom",null,999,{"$nulls":15},"3920B00000 - MOGADISCIO SOMALIA",{"$nulls":18},"2700 - Malaysia"]
[null,null,null,"United Nations 999",null,null,"United Nations",null,"000",{"$nulls":15},"3920C00000 - BAIDOA",{"$nulls":18},"2740 - Maldives"]
[null,null,null,"Unknown 000",null,null,"Unknown",null,462,{"$nulls":15},"3920D00000 - BOSASO",{"$nulls":18},"2760 - Mali"]
[null,null,null,"Uruguay 462",null,null,"Uruguay",null,456,{"$nulls":15},"3920E00000 - GAROOWE",{"$nulls":18},"2820 - Mauritania"]
[null,null,null,"USA 456",null,null,"USA",null,449,{"$nulls":15},"3920F00000 - HARGEISA",{"$nulls":18},"2850 - Mexico"]
[null,null,null,"Utd.Arab.Emir. 449",null,null,"Utd.Arab.Emir.",null,463,{"$nulls":15},"3920G00000 - JOWHAR",{"$nulls":18},"2880 - Mongolia"]
[null,null,null,"Uzbekistan 463",null,null,"Uzbekistan",null,655,{"$nulls":15},"3920H00000 - GAALKACYO",{"$nulls":18},"2910 - Morocco"]
[null,null,null,"Vanuatu 655",null,null,"Vanuatu",null,535,{"$nulls":15},"3920I00000 - WAJID",{"$nulls":18},"2970 - Nepal"]
[null,null,null,"Vatican City 535",null,null,"Vatican City",null,471,{"$nulls":15},"3920J00000 - SOMALIA DESK KENYA",{"$nulls":18},"297R - ROSA, Nepal"]
[null,null,null,"Venezuela 471",null,null,"Venezuela",null,520,{"$nulls":15},"3920K00000 - DOLLOW",{"$nulls":18},"3120 - Nicaragua"]
[null,null,null,"Vietnam 520",null,null,"Vietnam",null,661,{"$nulls":15},"3930A00000 - SOUTH AFRICA",{"$nulls":18},"3180 - Niger"]
[null,null,null,"Wallis,Futuna 661",null,null,"Wallis,Futuna",null,691,{"$nulls":15},"3930B00000 - PRETORIA ZA",{"$nulls":18},"3210 - Nigeria"]
[null,null,null,"Western Sahara 691",null,null,"Western Sahara",null,492,{"$nulls":15},"4020A00000 - SUDAN",{"$nulls":18},"3300 - Pakistan"]
[null,null,null,"Yemen, Rep of 492",null,null,"Yemen, Rep of",null,495,{"$nulls":15},"4020B00000 - KHARTOUM SUDAN",{"$nulls":18},"3330 - Panama"]
[null,null,null,"Yugoslavia 495",null,null,"Yugoslavia",null,498,{"$nulls":15},"4020C00000 - ABYEI",{"$nulls":18},"333R - LACRO, Panama"]
[null,null,null,"Zambia 498",null,null,"Zambia",null,626,{"$nulls":15},"4020D00000 - AD DAMAZINE",{"$nulls":18},"3360 - Paraguay"]
[null,null,null,"Zimbabwe 626",null,null,"Zimbabwe",{"$nulls":17},"4020E00000 - EL FASHER",{"$nulls":18},"3380 - Congo"]
[{"$nulls":24},"4020F00000 - EL GENEINA",{"$nulls":18},"3390 - Peru"]
[{"$nulls":24},"4020G00000 - EL OBEID",{"$nulls":18},"3420 - Philippines"]
[null,null,null,"01 POs/LTAs not permitted (refer to SEU/DB)",{"$nulls":20},"4020H00000 - KADUGLI",{"$nulls":18},"3660 - Romania"]
[null,null,null,"11 PQ manuf. site. PO with main supplier",{"$nulls":20},"4020I00000 - KASSALA",{"$nulls":18},"3750 - Rwanda"]
[null,null,null,"21 Potential supplier, Not GMP evaluated",{"$nulls":20},"4020J00000 - NYALA",{"$nulls":18},"3780 - Saudi Arabia"]
[null,null,null,"74 Block on vendor`s product for quality",{"$nulls":20},"4020K00000 - ZALINGUEI",{"$nulls":18},"3810 - Senegal"]
[null,null,null,"88 Total block on inactive/duplicate vendor",{"$nulls":20},"4030A00000 - SWAZILAND",{"$nulls":18},"381R - WCARO, Senegal"]
[null,null,null,"97 Blocked for ethical reasons (total block)",{"$nulls":20},"4030B00000 - MBABANE SWAZILAND",{"$nulls":18},"3900 - Sierra Leone"]
[null,null,null,"98 Failed GMP inspection (total block)",{"$nulls":20},"4040A00000 - SOUTH SUDAN",{"$nulls":18},"3920 - Somalia"]
[null,null,null,"99 Not recommended by SEU (total block)",{"$nulls":20},"4040B00000 - JUBA SOUTH SUDAN",{"$nulls":18},"3930 - South Africa"]
[{"$nulls":24},"4040B10000 - JUBA ZONE OFFICE",{"$nulls":18},"4020 - Sudan"]
[null,null,null,"MF manufacturer",{"$nulls":20},"4040C00000 - MALAKAL SOUTH SUDAN",{"$nulls":18},"4030 - Eswatini"]
[null,null,null,"TR trader",{"$nulls":20},"4040D00000 - RUMBEK SOUTH SUDAN",{"$nulls":18},"4040 - South Sudan"]
[null,null,null,"HQ headquarter",{"$nulls":20},"4040E00000 - WAU SOUTH SUDAN",{"$nulls":18},"4140 - Syria"]
[null,null,null,"LO local (sales) office",{"$nulls":20},"4040F00000 - BOR SOUTH SUDAN",{"$nulls":18},"4150 - Tajikistan"]
[null,null,null,"AP alternative payee",{"$nulls":20},"4040G00000 - TORIT SOUTH SUDAN",{"$nulls":18},"4200 - Thailand"]
[null,null,null,"GL global contact point for UNICEF",{"$nulls":20},"4040H00000 - KWAJOK SOUTH SUDAN",{"$nulls":18},"420R - EAPRO, Thailand"]
[{"$nulls":24},"4040I00000 - BENTIU SOUTH SUDAN",{"$nulls":18},"4230 - Togo"]
[{"$nulls":24},"4040J00000 - AWEIL SOUTH SUDAN",{"$nulls":18},"4320 - Tunisia"]
[{"$nulls":24},"4040K00000 - YAMBIO SOUTH SUDAN",{"$nulls":18},"4350 - Turkey"]
[{"$nulls":24},"4140A00000 - SYRIA",{"$nulls":18},"4360 - Rep. of Turkmenistan"]
[{"$nulls":24},"4140B00000 - DAMASCUS SYRIA",{"$nulls":18},"4380 - Uganda"]
[{"$nulls":24},"4140C00000 - ZO: HOMS",{"$nulls":18},"4410 - Ukraine"]
[{"$nulls":24},"4140D00000 - ZO: TARTOUS",{"$nulls":18},"4500 - Egypt"]
[{"$nulls":24},"4140E00000 - ZO: QAMISHLI",{"$nulls":18},"4550 - United Rep. of Tanzania"]
[{"$nulls":24},"4140F00000 - ZO: DARA'A",{"$nulls":18},"456B - Executive Director's Office"]
[{"$nulls":24},"4140G00000 - ZO: DAMASCUS",{"$nulls":18},"456C - Analysis,Planning & Monitoring"]
[{"$nulls":24},"4140H00000 - ZO: ALEPPO",{"$nulls":18},"456D - Programme Division"]
[{"$nulls":24},"4150A00000 - TAJIKISTAN",{"$nulls":18},"456F - Office of Emergency Prog."]
[{"$nulls":24},"4150B00000 - DUSHANBE TAJIKISTAN",{"$nulls":18},"456G - Division of Communication"]
[{"$nulls":24},"4200A00000 - THAILAND",{"$nulls":18},"456H - Gov. & Multilateral Affairs"]
[{"$nulls":24},"4200B00000 - BANGKOK THAILAND",{"$nulls":18},"456I - Public Partnerships Division"]
[{"$nulls":24},"420RA00000 - EAPRO",{"$nulls":18},"456J - Div. of Finance & Admin Mgmt"]
[{"$nulls":24},"420RB00000 - REG SERV DIV EAPR",{"$nulls":18},"456K - Division of Human Resources"]
[{"$nulls":24},"4230A00000 - TOGO",{"$nulls":18},"456L - Info & Comm Technology Div"]
[{"$nulls":24},"4230B00000 - LOME TOGO",{"$nulls":18},"456N - Int. Audit & Invest (OIAI)"]
[{"$nulls":24},"4320A00000 - TUNISIA",{"$nulls":18},"456O - Evaluation Office"]
[{"$nulls":24},"4320B00000 - TUNIS TUNISIA",{"$nulls":18},"456Q - GSSC Project"]
[{"$nulls":24},"4350A00000 - TURKEY",{"$nulls":18},"456R - Office of Global Insight & Policy"]
[{"$nulls":24},"4350B00000 - ANKARA TURKEY",{"$nulls":18},"456S - OSEB"]
[{"$nulls":24},"4350C00000 - GAZIANTEP TURKEY",{"$nulls":18},"456T - UNICEF Hosted Funds"]
[{"$nulls":24},"4360A00000 - REP. OF TURKMENISTAN",{"$nulls":18},"4590 - Burkina Faso"]
[{"$nulls":24},"4360B00000 - ASHKHABAD TM",{"$nulls":18},"4620 - Uruguay"]
[{"$nulls":24},"4380A00000 - UGANDA",{"$nulls":18},"4630 - Rep of Uzbekistan"]
[{"$nulls":24},"4380B00000 - KAMPALA UGANDA",{"$nulls":18},"4710 - Venezuela"]
[{"$nulls":24},"4380C00000 - FORT PORTAL",{"$nulls":18},"4920 - Yemen"]
[{"$nulls":24},"4380D00000 - GULU",{"$nulls":18},"4980 - Zambia"]
[{"$nulls":24},"4380E00000 - MOROTO",{"$nulls":18},"5070 - Bangladesh"]
[{"$nulls":24},"4380F00000 - MBARARA",{"$nulls":18},"5150 - DP Republic of Korea"]
[{"$nulls":24},"4410A00000 - UKRAINE",{"$nulls":18},"5200 - Vietnam"]
[{"$nulls":24},"4410B00000 - KIEV UKRAINE",{"$nulls":18},"5640 - Moldova"]
[{"$nulls":24},"4410C00000 - KHARKIV UKRAINE",{"$nulls":18},"5750 - Switzerland"]
[{"$nulls":24},"4410D00000 - DONETSK UKRAINE",{"$nulls":18},"575R - ECARO, Switzerland"]
[{"$nulls":24},"4410E00000 - MARIUPOL UKRAINE",{"$nulls":18},"6110 - Belize"]
[{"$nulls":24},"4410F00000 - KRAMATORSK UKRAINE",{"$nulls":18},"6260 - Zimbabwe"]
[{"$nulls":24},"4500A00000 - EGYPT",{"$nulls":18},"6350 - Oman"]
[{"$nulls":24},"4500B00000 - CAIRO EGYPT",{"$nulls":18},"6490 - Papua New Guinea"]
[{"$nulls":24},"4500C00000 - ASYUT",{"$nulls":18},"6620 - Comoros"]
[{"$nulls":24},"4550A00000 - TANZANIA UNITED REP",{"$nulls":18},"6690 - Djibouti"]
[{"$nulls":24},"4550B00000 - DAR ES SALAAM TZ",{"$nulls":18},"6810 - Angola"]
[{"$nulls":24},"4550C00000 - KIGOMA",{"$nulls":18},"6820 - Cabo Verde"]
[{"$nulls":24},"4550D00000 - ZANZIBAR",{"$nulls":18},"6830 - Sao Tome & Principe"]
[{"$nulls":24},"4550E00000 - IRINGA TANZANIA",{"$nulls":18},"6850 - Guinea Bissau"]
[{"$nulls":24},"456BB00000 - OED",{"$nulls":18},"6890 - Republic of Mozambique"]
[{"$nulls":24},"456BB00100 - OFFICE OF EXEC DIR",{"$nulls":18},"6980 - Namibia"]
[{"$nulls":24},"456BB00200 - OFFICE OF THE OMBUDS",{"$nulls":18},"7050 - Palestine, State of"]
[{"$nulls":24},"456CC00000 - DPR",{"$nulls":18},"7060 - Timor-Leste"]
[{"$nulls":24},"456CC00100 - DIRECTOR'S OFFICE",{"$nulls":18},"8950 - Republic of Montenegro"]
[{"$nulls":24},"456CC00200 - DATA AND ANALYTICS",{"$nulls":18},"8970 - Serbia"]
[{"$nulls":24},"456CC00300 - CPAKM DPS",{"$nulls":18},"8971 - Kosovo"]
[{"$nulls":24},"456CC00400 - GRCE",{"$nulls":18},"00"]
[{"$nulls":24},"456CC00500 - PSN DRP",{"$nulls":18},"01"]
[{"$nulls":24},"456CC00600 - SIBP DPS",{"$nulls":18},"02"]
[{"$nulls":24},"456CC00700 - STRATEGIC INFO",{"$nulls":18},"03"]
[{"$nulls":24},"456CC00800 - SPPG",{"$nulls":18},"04"]
[{"$nulls":24},"456CC00900 - RESEARCH",{"$nulls":18},"05"]
[{"$nulls":24},"456DD00000 - PROGRAMME DIVISION",{"$nulls":18},"06"]
[{"$nulls":24},"456DD00100 - DIRECTOR'S OFFICE",{"$nulls":18},"07"]
[{"$nulls":24},"456DD00200 - CHILD PROTECTION",{"$nulls":18},"08"]
[{"$nulls":24},"456DD00300 - CSP",{"$nulls":18},"09"]
[{"$nulls":24},"456DD00400 - HIV/AIDS SECTION",{"$nulls":18},10]
[{"$nulls":24},"456DD00500 - HEALTH SECTION",{"$nulls":18},11]
[{"$nulls":24},"456DD00600 - EDUCATION",{"$nulls":18},12]
[{"$nulls":24},"456DD00700 - NUTRITION",{"$nulls":18},13]
[{"$nulls":24},"456DD00800 - WATER AND SANITATION",{"$nulls":18},14]
[{"$nulls":24},"456DD00900 - GENDER AND RIGHTSPD",{"$nulls":18},16]
[{"$nulls":24},"456DD01000 - C4D",{"$nulls":18},17]
[{"$nulls":24},"456DD01100 - ADAP",{"$nulls":18},18]
[{"$nulls":24},"456DD01200 - DISABILITIES",{"$nulls":18},19]
[{"$nulls":24},"456DD01300 - SECRETARIATS PD",{"$nulls":18},20]
[{"$nulls":24},"456DD01400 - ECD PD",{"$nulls":18},21]
[{"$nulls":24},"456DD01500 - SIP PD",{"$nulls":18},22]
[{"$nulls":24},"456DD01600 - ENDVIOLCHILD",{"$nulls":18},23]
[{"$nulls":24},"456FF00000 - EMOPS",{"$nulls":18},24]
[{"$nulls":24},"456FF00100 - EMOPS NYHQ",{"$nulls":18},"ACT"]
[{"$nulls":24},"456FF00200 - EMOPS GENEVA",{"$nulls":18},"NSW"]
[{"$nulls":24},"456GG00000 - DOC",{"$nulls":18},"NT"]
[{"$nulls":24},"456GG00100 - DIRECTOR'S OFFICE",{"$nulls":18},"QLD"]
[{"$nulls":24},"456GG00200 - BRAND SECTION",{"$nulls":18},"SA"]
[{"$nulls":24},"456GG00300 - YOUNG PEOPLE",{"$nulls":18},"TAS"]
[{"$nulls":24},"456GG00400 - PRINT AND LANGUAGE",{"$nulls":18},"VIC"]
[{"$nulls":24},"456GG00500 - GAR DOC",{"$nulls":18},"WA"]
[{"$nulls":24},"456GG00600 - MEDIA SECTION",{"$nulls":18},"B"]
[{"$nulls":24},"456GG00700 - DIGITAL STRATEGY",{"$nulls":18},"K"]
[{"$nulls":24},"456GG00800 - DEVELOP. PROF",{"$nulls":18},"NÖ"]
[{"$nulls":24},"456GG00900 - PUBLIC AFFAIRS",{"$nulls":18},"OÖ"]
[{"$nulls":24},"456GG01000 - PUBLICATIONS",{"$nulls":18},"S"]
[{"$nulls":24},"456GG01100 - INTERNAL COMM",{"$nulls":18},"ST"]
[{"$nulls":24},"456GG01200 - SOCIAL & CIVIC MEDIA",{"$nulls":18},"T"]
[{"$nulls":24},"456GG01300 - PLANNING M&E OPS",{"$nulls":18},"V"]
[{"$nulls":24},"456GG01400 - BRAND BUILDING",{"$nulls":18},"W"]
[{"$nulls":24},"456GG01500 - MEDIA RELATIONS",{"$nulls":18},"AB"]
[{"$nulls":24},"456HH00000 - GMA",{"$nulls":18},"BC"]
[{"$nulls":24},"456HH00100 - DIRECTOR'S OFFICE",{"$nulls":18},"MB"]
[{"$nulls":24},"456HH00200 - MSA",{"$nulls":18},"NB"]
[{"$nulls":24},"456HH00300 - UN COHERENCE",{"$nulls":18},"NF"]
[{"$nulls":24},"456HH00400 - OSEB",{"$nulls":18},"NS"]
[{"$nulls":24},"456HH00500 - UNIA",{"$nulls":18},"NT"]
[{"$nulls":24},"456II00000 - PPD",{"$nulls":18},"ON"]
[{"$nulls":24},"456II00100 - PPD NEW YORK",{"$nulls":18},"PE"]
[{"$nulls":24},"456II00200 - PPD BRUSSELS",{"$nulls":18},"QC"]
[{"$nulls":24},"456II00300 - PPD TOKYO",{"$nulls":18},"SK"]
[{"$nulls":24},"456II00400 - GOVT. PARTNERSHIPS",{"$nulls":18},"YT"]
[{"$nulls":24},"456II00500 - M & I PARTNERSHIPS",{"$nulls":18},"ZZ"]
[{"$nulls":24},"456II00600 - POST 2015",{"$nulls":18},"010"]
[{"$nulls":24},"456II00700 - PPD GENEVA",{"$nulls":18},"020"]
[{"$nulls":24},"456JJ00000 - DFAM",{"$nulls":18},"030"]
[{"$nulls":24},"456JJ00100 - COMPTROLLER'S OFFICE",{"$nulls":18},"040"]
[{"$nulls":24},"456JJ00200 - FINANCE SECTION",{"$nulls":18},"050"]
[{"$nulls":24},"456JJ00300 - ACCOUNTS SECTION",{"$nulls":18},"060"]
[{"$nulls":24},"456JJ00400 - BUDGET SECTION",{"$nulls":18},"070"]
[{"$nulls":24},"456JJ00500 - ADMIN SERVICES",{"$nulls":18},"080"]
[{"$nulls":24},"456JJ00600 - IPSAS",{"$nulls":18},"090"]
[{"$nulls":24},"456KK00000 - DHR",{"$nulls":18},100]
[{"$nulls":24},"456KK00100 - DIRECTOR'S OFFICE",{"$nulls":18},110]
[{"$nulls":24},"456KK00200 - STAFF WELL BEING SEC",{"$nulls":18},120]
[{"$nulls":24},"456KK00300 - MOBILITY & STAFFING",{"$nulls":18},130]
[{"$nulls":24},"456KK00400 - ORG LEARNING & DEV",{"$nulls":18},140]
[{"$nulls":24},"456KK00500 - HRSS",{"$nulls":18},150]
[{"$nulls":24},"456KK00600 - NETI",{"$nulls":18},160]
[{"$nulls":24},"456KK00700 - GLOBAL STAFF ASSOC",{"$nulls":18},170]
[{"$nulls":24},"456KK00800 - POLICY & ADMIN LAW",{"$nulls":18},180]
[{"$nulls":24},"456KK00900 - HRBP PP",{"$nulls":18},190]
[{"$nulls":24},"456KK01000 - HRPP OPERATIONS",{"$nulls":18},200]
[{"$nulls":24},"456KK01100 - HRBP ERCOD",{"$nulls":18},210]
[{"$nulls":24},"456KK01200 - HRBP EMERGENCIES",{"$nulls":18},220]
[{"$nulls":24},"456KK01300 - NY STAFF ASSOCIATION",{"$nulls":18},230]
[{"$nulls":24},"456KK01400 - UNICEF STAFF NEWS",{"$nulls":18},240]
[{"$nulls":24},"456KK01500 - ESRS DHR",{"$nulls":18},250]
[{"$nulls":24},"456KK01600 - RRS DHR",{"$nulls":18},260]
[{"$nulls":24},"456LL00000 - ITSSD",{"$nulls":18},270]
[{"$nulls":24},"456LL00100 - DIRECTOR'S OFFICE",{"$nulls":18},280]
[{"$nulls":24},"456LL00200 - PPPA",{"$nulls":18},290]
[{"$nulls":24},"456LL00300 - ADMINISTRATIVE SERV",{"$nulls":18},300]
[{"$nulls":24},"456LL00400 - IT KMS (INTERNET)",{"$nulls":18},310]
[{"$nulls":24},"456LL00500 - ITACFS",{"$nulls":18},"101"]
[{"$nulls":24},"456LL00600 - TECHNICAL ARCHI",{"$nulls":18},"01"]
[{"$nulls":24},"456LL00700 - IT OPERATIONS",{"$nulls":18},"02"]
[{"$nulls":24},"456LL00800 - IT SECURITY",{"$nulls":18},"03"]
[{"$nulls":24},"456LL00900 - ITAFS",{"$nulls":18},"04"]
[{"$nulls":24},"456NN00000 - OIAI",{"$nulls":18},"05"]
[{"$nulls":24},"456NN00100 - OIAI SECTION",{"$nulls":18},"06"]
[{"$nulls":24},"456OO00000 - EVALUATION OFFICE",{"$nulls":18},"07"]
[{"$nulls":24},"456OO00100 - EVALUATION OFFICE",{"$nulls":18},"08"]
[{"$nulls":24},"456QQ00000 - GSCC PROJECT",{"$nulls":18},"09"]
[{"$nulls":24},"456QQ00100 - GSCC PROJECT SECTION",{"$nulls":18},10]
[{"$nulls":24},"456RR00000 - FRG OFFICE",{"$nulls":18},11]
[{"$nulls":24},"456RR00100 - FRG SECTION",{"$nulls":18},12]
[{"$nulls":24},"456SS00000 - EB SECRETARY OFFICE",{"$nulls":18},13]
[{"$nulls":24},"456SS00100 - EB SECR OFF SECTION",{"$nulls":18},14]
[{"$nulls":24},"4590A00000 - BURKINA FASO",{"$nulls":18},15]
[{"$nulls":24},"4590B00000 - OUAGADOUGOU BF",{"$nulls":18},16]
[{"$nulls":24},"4590C00000 - DORI BURKINA FASO",{"$nulls":18},17]
[{"$nulls":24},"4620A00000 - URUGUAY",{"$nulls":18},18]
[{"$nulls":24},"4620B00000 - MONTEVIDEO URUGUAY",{"$nulls":18},19]
[{"$nulls":24},"4630A00000 - REP OF UZBEKISTAN",{"$nulls":18},21]
[{"$nulls":24},"4630B00000 - TASHKENT UZBEKISTAN",{"$nulls":18},22]
[{"$nulls":24},"4710A00000 - VENEZUELA",{"$nulls":18},23]
[{"$nulls":24},"4710B00000 - CARACAS VENEZUELA",{"$nulls":18},24]
[{"$nulls":24},"4920A00000 - YEMEN",{"$nulls":18},25]
[{"$nulls":24},"4920B00000 - SANA'A YEMEN",{"$nulls":18},26]
[{"$nulls":24},"4920C00000 - ADEN",{"$nulls":18},27]
[{"$nulls":24},"4920D00000 - HODAIDAH",{"$nulls":18},28]
[{"$nulls":24},"4920E00000 - TA'IZZ",{"$nulls":18},29]
[{"$nulls":24},"4920F00000 - SA'ADA",{"$nulls":18},"2A"]
[{"$nulls":24},"4920G00000 - SEYOUN",{"$nulls":18},"2B"]
[{"$nulls":24},"4920H00000 - HARAD",{"$nulls":18},30]
[{"$nulls":24},"4920I00000 - DHALE",{"$nulls":18},31]
[{"$nulls":24},"4920J00000 - IBB",{"$nulls":18},32]
[{"$nulls":24},"4920K00000 - MUKALAH YEMEN",{"$nulls":18},33]
[{"$nulls":24},"4980A00000 - ZAMBIA",{"$nulls":18},34]
[{"$nulls":24},"4980B00000 - LUSAKA ZAMBIA",{"$nulls":18},35]
[{"$nulls":24},"5070A00000 - BANGLADESH",{"$nulls":18},36]
[{"$nulls":24},"5070B00000 - DHAKA BANGLADESH",{"$nulls":18},37]
[{"$nulls":24},"5070C00000 - BARISAL",{"$nulls":18},38]
[{"$nulls":24},"5070D00000 - COMILLA",{"$nulls":18},39]
[{"$nulls":24},"5070E00000 - COX BAZAAR",{"$nulls":18},40]
[{"$nulls":24},"5070F00000 - JESSORE",{"$nulls":18},41]
[{"$nulls":24},"5070G00000 - MYMENSINGH",{"$nulls":18},42]
[{"$nulls":24},"5070H00000 - RANGAMATI",{"$nulls":18},43]
[{"$nulls":24},"5070I00000 - RANGPUR",{"$nulls":18},44]
[{"$nulls":24},"5070J00000 - SYLHET",{"$nulls":18},45]
[{"$nulls":24},"5070K00000 - THAKURGAON",{"$nulls":18},46]
[{"$nulls":24},"5070L00000 - BOGRA",{"$nulls":18},47]
[{"$nulls":24},"5070M00000 - CHITTAGONG",{"$nulls":18},48]
[{"$nulls":24},"5070N00000 - KHULNA",{"$nulls":18},49]
[{"$nulls":24},"5070P00000 - DHAKA CITY",{"$nulls":18},50]
[{"$nulls":24},"5150A00000 - DPR OF KOREA",{"$nulls":18},51]
[{"$nulls":24},"5150B00000 - PYONGYANG DPRK",{"$nulls":18},52]
[{"$nulls":24},"5200A00000 - VIETNAM",{"$nulls":18},53]
[{"$nulls":24},"5200B00000 - HANOI VIETNAM",{"$nulls":18},54]
[{"$nulls":24},"5200C00000 - HO CHI MINH CTY",{"$nulls":18},55]
[{"$nulls":24},"5640A00000 - MOLDOVA",{"$nulls":18},56]
[{"$nulls":24},"5640B00000 - CHISINAU MOLDOVA",{"$nulls":18},57]
[{"$nulls":24},"5750A00000 - PFP",{"$nulls":18},58]
[{"$nulls":24},"5750A00100 - COS IT",{"$nulls":18},59]
[{"$nulls":24},"5750A00101 - CODAS",{"$nulls":18},60]
[{"$nulls":24},"5750A00102 - SPICE",{"$nulls":18},61]
[{"$nulls":24},"5750A00103 - DIRECTOR'S OFFICE",{"$nulls":18},62]
[{"$nulls":24},"5750A00200 - COS OPERATIONS",{"$nulls":18},63]
[{"$nulls":24},"5750A00201 - DD O&F",{"$nulls":18},64]
[{"$nulls":24},"5750A00202 - FINANCE SECTION",{"$nulls":18},65]
[{"$nulls":24},"5750A00203 - PROCUREMENT",{"$nulls":18},66]
[{"$nulls":24},"5750A00300 - COS FINANCE",{"$nulls":18},67]
[{"$nulls":24},"5750A00301 - PFP HR",{"$nulls":18},68]
[{"$nulls":24},"5750A00400 - COS HUMAN RESOURCES",{"$nulls":18},69]
[{"$nulls":24},"5750A00500 - STRATEGIC PARTNRSHPS",{"$nulls":18},70]
[{"$nulls":24},"5750A00501 - DD PSE",{"$nulls":18},71]
[{"$nulls":24},"5750A00502 - CHILD RIGHTS & BUS.",{"$nulls":18},72]
[{"$nulls":24},"5750A00503 - ADV & INNOV PSHIPS",{"$nulls":18},73]
[{"$nulls":24},"5750A00600 - CHILD RIGHT ADVOCACY",{"$nulls":18},74]
[{"$nulls":24},"5750A00601 - DD PSFR",{"$nulls":18},75]
[{"$nulls":24},"5750A00602 - MARKET KNOWLEDGE",{"$nulls":18},76]
[{"$nulls":24},"5750A00603 - FUNDRAISING SERVICES",{"$nulls":18},77]
[{"$nulls":24},"5750A00604 - GLOBAL PHILANTHROPY",{"$nulls":18},78]
[{"$nulls":24},"5750A00605 - PROGRAMME SERVICES",{"$nulls":18},79]
[{"$nulls":24},"5750A00606 - CORPORATE FUNDRSNG",{"$nulls":18},80]
[{"$nulls":24},"5750A00607 - MARKET DEVELOPMENT",{"$nulls":18},81]
[{"$nulls":24},"5750A00608 - INVESTMENT FUNDS",{"$nulls":18},82]
[{"$nulls":24},"5750A00700 - CORP SOCIAL RESP",{"$nulls":18},83]
[{"$nulls":24},"5750A00800 - COMM & BRAND POS",{"$nulls":18},84]
[{"$nulls":24},"5750A00901 - DD NAT COM RELATION",{"$nulls":18},85]
[{"$nulls":24},"5750A00902 - RELATIONSHIPS TEAM 1",{"$nulls":18},86]
[{"$nulls":24},"5750A00903 - RELATIONSHIPS TEAM 2",{"$nulls":18},87]
[{"$nulls":24},"5750A00906 - GOVERNANCE",{"$nulls":18},88]
[{"$nulls":24},"5750P00000 - PFP",{"$nulls":18},89]
[{"$nulls":24},"5750P00100 - GOV & SYS DIR'S OFF",{"$nulls":18},90]
[{"$nulls":24},"5750P00101 - COUNTRY OFFICE D&S",{"$nulls":18},91]
[{"$nulls":24},"5750P00102 - STRATEGIC PLANNING",{"$nulls":18},92]
[{"$nulls":24},"5750P00200 - MGT OF FIN.RESOURCES",{"$nulls":18},93]
[{"$nulls":24},"5750P00201 - DY. DIR FIN & OPS",{"$nulls":18},94]
[{"$nulls":24},"5750P00202 - FINANCE SECTION",{"$nulls":18},95]
[{"$nulls":24},"5750P00203 - PROCUREMENT",{"$nulls":18},97]
[{"$nulls":24},"5750P00204 - ALLOC COMMON SERV",{"$nulls":18},971]
[{"$nulls":24},"5750P00300 - MGT OF HUM CAP: HR",{"$nulls":18},972]
[{"$nulls":24},"5750P00400 - ADVOCACY",{"$nulls":18},973]
[{"$nulls":24},"5750P00500 - CORP SOCIAL RESP",{"$nulls":18},974]
[{"$nulls":24},"5750P00501 - MARKET DEVELOPMENT",{"$nulls":18},975]
[{"$nulls":24},"5750P00600 - STRATEGIC INFO & INV",{"$nulls":18},976]
[{"$nulls":24},"5750P00601 - DY.DIRCENTRLFUNDRSNG",{"$nulls":18},99]
[{"$nulls":24},"5750P00602 - MARKET KNOWLEDGE",{"$nulls":18},"CK"]
[{"$nulls":24},"5750P00603 - CENTRL FUNDRSNG SERV",{"$nulls":18},"CL"]
[{"$nulls":24},"5750P00604 - GLOBAL PHILANTHROPY",{"$nulls":18},"CW"]
[{"$nulls":24},"5750P00605 - PROG-DONOR MATCHING",{"$nulls":18},"DB"]
[{"$nulls":24},"5750P00606 - CORPORATE FUNDRSNG",{"$nulls":18},"DG"]
[{"$nulls":24},"5750P00607 - MARKET DEVELOPMENT",{"$nulls":18},"GW"]
[{"$nulls":24},"5750P00700 - SALES OF CARDS&PRODS",{"$nulls":18},"KD"]
[{"$nulls":24},"5750P00701 - DY.DIR CARDS & PRODS",{"$nulls":18},"KK"]
[{"$nulls":24},"5750P00702 - GLOBAL SUPPLY CHAIN",{"$nulls":18},"KV"]
[{"$nulls":24},"5750P00703 - QUALITY MANAGEMENT",{"$nulls":18},"KY"]
[{"$nulls":24},"5750P00704 - GLOBL MKTG & BUS DEV",{"$nulls":18},"LF"]
[{"$nulls":24},"5750P00800 - COMM & BRAND POS",{"$nulls":18},"LI"]
[{"$nulls":24},"5750P00900 - STRATEGIC DIRECTION",{"$nulls":18},"LM"]
[{"$nulls":24},"5750P00901 - DY.DIR NATL COM REL",{"$nulls":18},"LS"]
[{"$nulls":24},"5750P00902 - RELATIONSHIPS TEAM 1",{"$nulls":18},"LT"]
[{"$nulls":24},"5750P00903 - RELATIONSHIPS TEAM 2",{"$nulls":18},"MH"]
[{"$nulls":24},"5750P00904 - RELATIONSHIPS TEAM 3",{"$nulls":18},"MT"]
[{"$nulls":24},"5750P00905 - RELATIONSHIPS TEAM 4",{"$nulls":18},"MY"]
[{"$nulls":24},"5750P00906 - GOVERNANCE",{"$nulls":18},"OS"]
[{"$nulls":24},"575CA00000 - GENEVA COS",{"$nulls":18},"RC"]
[{"$nulls":24},"575CA00100 - COS IT",{"$nulls":18},"SG"]
[{"$nulls":24},"575CA00200 - COS OPERATIONS",{"$nulls":18},"TP"]
[{"$nulls":24},"575CA00300 - COS FINANCE",{"$nulls":18},"WF"]
[{"$nulls":24},"575CA00400 - COS HUMAN RESOURCES",{"$nulls":18},"WK"]
[{"$nulls":24},"575RA00000 - CEE/CIS",{"$nulls":18},"WM"]
[{"$nulls":24},"575RB00000 - REG SERV DIVCEE/CIS",{"$nulls":18},"WX"]
[{"$nulls":24},"575RC00000 - MOSCOW RUSSIA PO",{"$nulls":18},"AG"]
[{"$nulls":24},"6110A00000 - BELIZE",{"$nulls":18},"AL"]
[{"$nulls":24},"6110B00000 - BELIZE CITY BELIZE",{"$nulls":18},"AN"]
[{"$nulls":24},"6260A00000 - ZIMBABWE",{"$nulls":18},"AO"]
[{"$nulls":24},"6260B00000 - HARARE ZIMBABWE",{"$nulls":18},"AP"]
[{"$nulls":24},"6260C00000 - BULAWAYO ZIMBABWE",{"$nulls":18},"AQ"]
[{"$nulls":24},"6350A00000 - OMAN",{"$nulls":18},"AR"]
[{"$nulls":24},"6350B00000 - MUSCAT OMAN",{"$nulls":18},"AT"]
[{"$nulls":24},"6490A00000 - PAPUA NEW GUINEA",{"$nulls":18},"AV"]
[{"$nulls":24},"6490B00000 - PORT MORESBY PNG",{"$nulls":18},"BA"]
[{"$nulls":24},"6490C00000 - BUKA",{"$nulls":18},"BG"]
[{"$nulls":24},"6490D00000 - GOROKA",{"$nulls":18},"BI"]
[{"$nulls":24},"6620A00000 - COMOROS",{"$nulls":18},"BL"]
[{"$nulls":24},"6620B00000 - MORONI COMOROS",{"$nulls":18},"BN"]
[{"$nulls":24},"6690A00000 - DJIBOUTI",{"$nulls":18},"BO"]
[{"$nulls":24},"6690B00000 - DJIBOUTI DJIBOUTI",{"$nulls":18},"BS"]
[{"$nulls":24},"6810A00000 - ANGOLA",{"$nulls":18},"BZ"]
[{"$nulls":24},"6810B00000 - LUANDA ANGOLA",{"$nulls":18},"CA"]
[{"$nulls":24},"6810C00000 - KUNENE",{"$nulls":18},"CB"]
[{"$nulls":24},"6810D00000 - LUBANGO",{"$nulls":18},"CE"]
[{"$nulls":24},"6810E00000 - LUENA",{"$nulls":18},"CH"]
[{"$nulls":24},"6810F00000 - KUITO BIE",{"$nulls":18},"CL"]
[{"$nulls":24},"6820A00000 - CABO VERDE",{"$nulls":18},"CN"]
[{"$nulls":24},"6820B00000 - PRAIA CABO VERDE",{"$nulls":18},"CO"]
[{"$nulls":24},"6830A00000 - SAO TOME PRINCIPE",{"$nulls":18},"CR"]
[{"$nulls":24},"6830B00000 - SAO TOME STP",{"$nulls":18},"CS"]
[{"$nulls":24},"6850A00000 - GUINEA BISSAU",{"$nulls":18},"CT"]
[{"$nulls":24},"6850B00000 - BISSAUGUINEA BISSAU",{"$nulls":18},"CZ"]
[{"$nulls":24},"6890A00000 - REP. OF MOZAMBIQUE",{"$nulls":18},"EN"]
[{"$nulls":24},"6890B00000 - MAPUTO MOZAMBIQUE",{"$nulls":18},"FE"]
[{"$nulls":24},"6980A00000 - NAMIBIA",{"$nulls":18},"FG"]
[{"$nulls":24},"6980B00000 - WINDHOEK NAMIBIA",{"$nulls":18},"FI"]
[{"$nulls":24},"7050A00000 - STATE OF PALESTINE",{"$nulls":18},"FO"]
[{"$nulls":24},"7050B00000 - EAST JERUSALEM",{"$nulls":18},"FR"]
[{"$nulls":24},"7050C00000 - GAZA",{"$nulls":18},"GE"]
[{"$nulls":24},"7050D00000 - HEBRON",{"$nulls":18},"GO"]
[{"$nulls":24},"7050E00000 - KHAN YUNIS",{"$nulls":18},"GR"]
[{"$nulls":24},"7050F00000 - NABLUS",{"$nulls":18},"IM"]
[{"$nulls":24},"7050G00000 - RAFAH",{"$nulls":18},"IS"]
[{"$nulls":24},"7050H00000 - RAMALLAH",{"$nulls":18},"KR"]
[{"$nulls":24},"7060A00000 - TIMOR-LESTE",{"$nulls":18},"LC"]
[{"$nulls":24},"7060B00000 - DILI TIMOR-LESTE",{"$nulls":18},"LE"]
[{"$nulls":24},"8950A00000 - REP. OF MONTENEGRO",{"$nulls":18},"LI"]
[{"$nulls":24},"8950B00000 - PODGORICAMONTENEGRO",{"$nulls":18},"LO"]
[{"$nulls":24},"8970A00000 - REPUBLIC OF SERBIA",{"$nulls":18},"LT"]
[{"$nulls":24},"8970B00000 - BELGRADE  SERBIA",{"$nulls":18},"LU"]
[{"$nulls":24},"8971A00000 - KOSOVO",{"$nulls":18},"MC"]
[{"$nulls":24},"8971B00000 - PRISTINA KOSOVO",{"$nulls":18},"ME"]
[{"$nulls":24},"8971C00000 - ZVECAN KOSOVO",{"$nulls":18},"MI"]
[{"$nulls":43},"MN"]
[{"$nulls":43},"MO"]
[{"$nulls":43},"MS"]
[{"$nulls":43},"MT"]
[{"$nulls":43},"NA"]
[{"$nulls":43},"NO"]
[{"$nulls":43},"NU"]
[{"$nulls":43},"OR"]
[{"$nulls":43},"PA"]
[{"$nulls":43},"PC"]
[{"$nulls":43},"PD"]
[{"$nulls":43},"PE"]
[{"$nulls":43},"PG"]
[{"$nulls":43},"PI"]
[{"$nulls":43},"PN"]
[{"$nulls":43},"PO"]
[{"$nulls":43},"PR"]
[{"$nulls":43},"PS"]
[{"$nulls":43},"PT"]
[{"$nulls":43},"PV"]
[{"$nulls":43},"PZ"]
[{"$nulls":43},"RA"]
[{"$nulls":43},"RC"]
[{"$nulls":43},"RE"]
[{"$nulls":43},"RG"]
[{"$nulls":43},"RI"]
[{"$nulls":43},"RM"]
[{"$nulls":43},"RN"]
[{"$nulls":43},"RO"]
[{"$nulls":43},"RV"]
[{"$nulls":43},"SA"]
[{"$nulls":43},"SI"]
[{"$nulls":43},"SO"]
[{"$nulls":43},"SP"]
[{"$nulls":43},"SR"]
[{"$nulls":43},"SS"]
[{"$nulls":43},"SV"]
[{"$nulls":43},"TA"]
[{"$nulls":43},"TE"]
[{"$nulls":43},"TN"]
[{"$nulls":43},"TO"]
[{"$nulls":43},"TP"]
[{"$nulls":43},"TR"]
[{"$nulls":43},"TS"]
[{"$nulls":43},"TV"]
[{"$nulls":43},"UD"]
[{"$nulls":43},"VA"]
[{"$nulls":43},"VC"]
[{"$nulls":43},"VE"]
[{"$nulls":43},"VI"]
[{"$nulls":43},"VR"]
[{"$nulls":43},"VT"]
[{"$nulls":43},"VV"]
[{"$nulls":43},"01"]
[{"$nulls":43},"02"]
[{"$nulls":43},"03"]
[{"$nulls":43},"04"]
[{"$nulls":43},"05"]
[{"$nulls":43},"06"]
[{"$nulls":43},"07"]
[{"$nulls":43},"08"]
[{"$nulls":43},"09"]
[{"$nulls":43},10]
[{"$nulls":43},11]
[{"$nulls":43},12]
[{"$nulls":43},13]
[{"$nulls":43},14]
[{"$nulls":43},15]
[{"$nulls":43},16]
[{"$nulls":43},17]
[{"$nulls":43},18]
[{"$nulls":43},19]
[{"$nulls":43},20]
[{"$nulls":43},21]
[{"$nulls":43},22]
[{"$nulls":43},23]
[{"$nulls":43},24]
[{"$nulls":43},25]
[{"$nulls":43},26]
[{"$nulls":43},27]
[{"$nulls":43},28]
[{"$nulls":43},29]
[{"$nulls":43},30]
[{"$nulls":43},31]
[{"$nulls":43},32]
[{"$nulls":43},33]
[{"$nulls":43},34]
[{"$nulls":43},35]
[{"$nulls":43},36]
[{"$nulls":43},37]
[{"$nulls":43},38]
[{"$nulls":43},39]
[{"$nulls":43},40]
[{"$nulls":43},41]
[{"$nulls":43},42]
[{"$nulls":43},43]
[{"$nulls":43},44]
[{"$nulls":43},45]
[{"$nulls":43},46]
[{"$nulls":43},47]
[{"$nulls":43},"JOH"]
[{"$nulls":43},"KED"]
[{"$nulls":43},"KEL"]
[{"$nulls":43},"KUL"]
[{"$nulls":43},"LAB"]
[{"$nulls":43},"MEL"]
[{"$nulls":43},"PAH"]
[{"$nulls":43},"PEL"]
[{"$nulls":43},"PER"]
[{"$nulls":43},"PIN"]
[{"$nulls":43},"SAB"]
[{"$nulls":43},"SAR"]
[{"$nulls":43},"SEL"]
[{"$nulls":43},"SER"]
[{"$nulls":43},"TRE"]
[{"$nulls":43},"AGS"]
[{"$nulls":43},"BCN"]
[{"$nulls":43},"BCS"]
[{"$nulls":43},"CHI"]
[{"$nulls":43},"CHS"]
[{"$nulls":43},"CMP"]
[{"$nulls":43},"COA"]
[{"$nulls":43},"COL"]
[{"$nulls":43},"DF"]
[{"$nulls":43},"DGO"]
[{"$nulls":43},"GRO"]
[{"$nulls":43},"GTO"]
[{"$nulls":43},"HGO"]
[{"$nulls":43},"JAL"]
[{"$nulls":43},"MCH"]
[{"$nulls":43},"MEX"]
[{"$nulls":43},"MOR"]
[{"$nulls":43},"NL"]
[{"$nulls":43},"OAX"]
[{"$nulls":43},"PUE"]
[{"$nulls":43},"QR"]
[{"$nulls":43},"QRO"]
[{"$nulls":43},"SIN"]
[{"$nulls":43},"SLP"]
[{"$nulls":43},"SON"]
[{"$nulls":43},"TAB"]
[{"$nulls":43},"TLX"]
[{"$nulls":43},"TMS"]
[{"$nulls":43},"VER"]
[{"$nulls":43},"YUC"]
[{"$nulls":43},"ZAC"]
[{"$nulls":43},"DR"]
[{"$nulls":43},"FL"]
[{"$nulls":43},"FR"]
[{"$nulls":43},"GE"]
[{"$nulls":43},"GR"]
[{"$nulls":43},"LI"]
[{"$nulls":43},"NB"]
[{"$nulls":43},"NH"]
[{"$nulls":43},"OV"]
[{"$nulls":43},"UT"]
[{"$nulls":43},"ZE"]
[{"$nulls":43},"ZH"]
[{"$nulls":43},"NI"]
[{"$nulls":43},"SI"]
[{"$nulls":43},"01"]
[{"$nulls":43},"02"]
[{"$nulls":43},"03"]
[{"$nulls":43},"04"]
[{"$nulls":43},"05"]
[{"$nulls":43},"06"]
[{"$nulls":43},"07"]
[{"$nulls":43},"08"]
[{"$nulls":43},"09"]
[{"$nulls":43},10]
[{"$nulls":43},11]
[{"$nulls":43},12]
[{"$nulls":43},14]
[{"$nulls":43},15]
[{"$nulls":43},16]
[{"$nulls":43},17]
[{"$nulls":43},18]
[{"$nulls":43},19]
[{"$nulls":43},20]
[{"$nulls":43},21]
[{"$nulls":43},10]
[{"$nulls":43},11]
[{"$nulls":43},12]
[{"$nulls":43},13]
[{"$nulls":43},14]
[{"$nulls":43},15]
[{"$nulls":43},16]
[{"$nulls":43},17]
[{"$nulls":43},20]
[{"$nulls":43},21]
[{"$nulls":43},22]
[{"$nulls":43},23]
[{"$nulls":43},24]
[{"$nulls":43},25]
[{"$nulls":43},26]
[{"$nulls":43},27]
[{"$nulls":43},28]
[{"$nulls":43},29]
[{"$nulls":43},30]
[{"$nulls":43},31]
[{"$nulls":43},32]
[{"$nulls":43},33]
[{"$nulls":43},34]
[{"$nulls":43},40]
[{"$nulls":43},41]
[{"$nulls":43},42]
[{"$nulls":43},43]
[{"$nulls":43},50]
[{"$nulls":43},60]
[{"$nulls":43},70]
[{"$nulls":43},"SE"]
[{"$nulls":43},"SN"]
[{"$nulls":43},"SS"]
[{"$nulls":43},"SW"]
[{"$nulls":43},"01"]
[{"$nulls":43},"02"]
[{"$nulls":43},"03"]
[{"$nulls":43},"04"]
[{"$nulls":43},"05"]
[{"$nulls":43},"06"]
[{"$nulls":43},"07"]
[{"$nulls":43},"08"]
[{"$nulls":43},"09"]
[{"$nulls":43},10]
[{"$nulls":43},11]
[{"$nulls":43},12]
[{"$nulls":43},13]
[{"$nulls":43},14]
[{"$nulls":43},15]
[{"$nulls":43},16]
[{"$nulls":43},17]
[{"$nulls":43},18]
[{"$nulls":43},19]
[{"$nulls":43},20]
[{"$nulls":43},21]
[{"$nulls":43},22]
[{"$nulls":43},23]
[{"$nulls":43},24]
[{"$nulls":43},25]
[{"$nulls":43},26]
[{"$nulls":43},27]
[{"$nulls":43},28]
[{"$nulls":43},29]
[{"$nulls":43},30]
[{"$nulls":43},31]
[{"$nulls":43},32]
[{"$nulls":43},33]
[{"$nulls":43},34]
[{"$nulls":43},35]
[{"$nulls":43},36]
[{"$nulls":43},37]
[{"$nulls":43},38]
[{"$nulls":43},39]
[{"$nulls":43},40]
[{"$nulls":43},41]
[{"$nulls":43},42]
[{"$nulls":43},43]
[{"$nulls":43},44]
[{"$nulls":43},45]
[{"$nulls":43},46]
[{"$nulls":43},47]
[{"$nulls":43},48]
[{"$nulls":43},49]
[{"$nulls":43},50]
[{"$nulls":43},"AM"]
[{"$nulls":43},"AT"]
[{"$nulls":43},"AV"]
[{"$nulls":43},"BE"]
[{"$nulls":43},"BK"]
[{"$nulls":43},"BO"]
[{"$nulls":43},"BU"]
[{"$nulls":43},"CA"]
[{"$nulls":43},"CE"]
[{"$nulls":43},"CH"]
[{"$nulls":43},"CL"]
[{"$nulls":43},"CO"]
[{"$nulls":43},"CU"]
[{"$nulls":43},"CV"]
[{"$nulls":43},"DB"]
[{"$nulls":43},"DF"]
[{"$nulls":43},"DN"]
[{"$nulls":43},"DO"]
[{"$nulls":43},"DU"]
[{"$nulls":43},"DV"]
[{"$nulls":43},"DY"]
[{"$nulls":43},"ES"]
[{"$nulls":43},"FI"]
[{"$nulls":43},"FM"]
[{"$nulls":43},"GL"]
[{"$nulls":43},"GM"]
[{"$nulls":43},"GR"]
[{"$nulls":43},"GW"]
[{"$nulls":43},"GY"]
[{"$nulls":43},"HA"]
[{"$nulls":43},"HI"]
[{"$nulls":43},"HT"]
[{"$nulls":43},"HU"]
[{"$nulls":43},"HW"]
[{"$nulls":43},"IM"]
[{"$nulls":43},"IW"]
[{"$nulls":43},"KE"]
[{"$nulls":43},"LA"]
[{"$nulls":43},"LD"]
[{"$nulls":43},"LE"]
[{"$nulls":43},"LI"]
[{"$nulls":43},"LO"]
[{"$nulls":43},"LT"]
[{"$nulls":43},"MG"]
[{"$nulls":43},"MY"]
[{"$nulls":43},"NH"]
[{"$nulls":43},"NK"]
[{"$nulls":43},"NT"]
[{"$nulls":43},"NU"]
[{"$nulls":43},"OX"]
[{"$nulls":43},"PO"]
[{"$nulls":43},"SC"]
[{"$nulls":43},"SG"]
[{"$nulls":43},"SH"]
[{"$nulls":43},"SK"]
[{"$nulls":43},"SO"]
[{"$nulls":43},"ST"]
[{"$nulls":43},"SU"]
[{"$nulls":43},"SX"]
[{"$nulls":43},"SY"]
[{"$nulls":43},"TA"]
[{"$nulls":43},"TW"]
[{"$nulls":43},"TY"]
[{"$nulls":43},"WA"]
[{"$nulls":43},"WG"]
[{"$nulls":43},"WI"]
[{"$nulls":43},"WM"]
[{"$nulls":43},"WO"]
[{"$nulls":43},"YK"]
[{"$nulls":43},"YN"]
[{"$nulls":43},"YS"]
[{"$nulls":43},"YW"]
[{"$nulls":43},"AK"]
[{"$nulls":43},"AL"]
[{"$nulls":43},"AR"]
[{"$nulls":43},"AS"]
[{"$nulls":43},"AZ"]
[{"$nulls":43},"CA"]
[{"$nulls":43},"CO"]
[{"$nulls":43},"CT"]
[{"$nulls":43},"DC"]
[{"$nulls":43},"DE"]
[{"$nulls":43},"FL"]
[{"$nulls":43},"GA"]
[{"$nulls":43},"GU"]
[{"$nulls":43},"HI"]
[{"$nulls":43},"IA"]
[{"$nulls":43},"ID"]
[{"$nulls":43},"IL"]
[{"$nulls":43},"IN"]
[{"$nulls":43},"KS"]
[{"$nulls":43},"KY"]
[{"$nulls":43},"LA"]
[{"$nulls":43},"MA"]
[{"$nulls":43},"MD"]
[{"$nulls":43},"ME"]
[{"$nulls":43},"MI"]
[{"$nulls":43},"MN"]
[{"$nulls":43},"MO"]
[{"$nulls":43},"MP"]
[{"$nulls":43},"MS"]
[{"$nulls":43},"MT"]
[{"$nulls":43},"NC"]
[{"$nulls":43},"ND"]
[{"$nulls":43},"NE"]
[{"$nulls":43},"NH"]
[{"$nulls":43},"NJ"]
[{"$nulls":43},"NM"]
[{"$nulls":43},"NV"]
[{"$nulls":43},"NY"]
[{"$nulls":43},"OH"]
[{"$nulls":43},"OK"]
[{"$nulls":43},"OR"]
[{"$nulls":43},"PA"]
[{"$nulls":43},"PR"]
[{"$nulls":43},"RI"]
[{"$nulls":43},"SC"]
[{"$nulls":43},"SD"]
[{"$nulls":43},"TN"]
[{"$nulls":43},"TX"]
[{"$nulls":43},"UT"]
[{"$nulls":43},"VA"]
[{"$nulls":43},"VI"]
[{"$nulls":43},"VT"]
[{"$nulls":43},"WA"]
[{"$nulls":43},"WI"]
[{"$nulls":43},"WV"]
[{"$nulls":43},"WY"]
[{"$nulls":43},"01"]
[{"$nulls":43},"02"]
[{"$nulls":43},"03"]
[{"$nulls":43},"04"]
[{"$nulls":43},"05"]
[{"$nulls":43},"06"]
[{"$nulls":43},"07"]
[{"$nulls":43},"08"]
[{"$nulls":43},"09"]
[{"$nulls":43},10]
[{"$nulls":43},11]
[{"$nulls":43},12]
[{"$nulls":43},13]
[{"$nulls":43},14]
[{"$nulls":43},15]
[{"$nulls":43},16]
[{"$nulls":43},"AG"]
[{"$nulls":43},"AI"]
[{"$nulls":43},"AR"]
[{"$nulls":43},"BE"]
[{"$nulls":43},"BL"]
[{"$nulls":43},"BS"]
[{"$nulls":43},"FR"]
[{"$nulls":43},"GE"]
[{"$nulls":43},"GL"]
[{"$nulls":43},"GR"]
[{"$nulls":43},"JU"]
[{"$nulls":43},"LU"]
[{"$nulls":43},"NE"]
[{"$nulls":43},"NW"]
[{"$nulls":43},"OW"]
[{"$nulls":43},"SG"]
[{"$nulls":43},"SH"]
[{"$nulls":43},"SO"]
[{"$nulls":43},"SZ"]
[{"$nulls":43},"TG"]
[{"$nulls":43},"TI"]
[{"$nulls":43},"UR"]
[{"$nulls":43},"VD"]
[{"$nulls":43},"VS"]
[{"$nulls":43},"ZG"]
[{"$nulls":43},"ZH"]
[{"$nulls":43},"5 - Not Required"]
[{"$nulls":43},"4 - Low"]
[{"$nulls":43},"3 - Medium"]
[{"$nulls":43},"2 - Significant"]
[{"$nulls":43},"1 - High"]
[{"$nulls":43},"Micro Assessment"]
[{"$nulls":43},"High Risk Assumed"]
[{"$nulls":43},"Audit Results"]
[{"$nulls":43},"Low Risk Assumed"]
[{"$nulls":43},"Others"]

{"sheet":"Zip Postal Code","index":4,"n_rows":257,"n_cols":21,"rows_kept":257,"cut":false,"hidden":true,"merged":[]}
["Country Key (3 digits)","Postal code length","Check rule for postal code","Check rule for postal code Completed","E.G.",{"$nulls":10},"Check Rule for Postal Code","Short Description","Status","No space","No letter","Special"]
["000","0","",{"$f":"IF(C2=\"\",0,C2)","v":0},{"$nulls":11},1,"Maximum value length, without gaps","Done","X"]
["001","0","",{"$f":"IF(C3=\"\",0,C3)","v":0},{"$nulls":11},2,"Maximum value length, numerical, without gaps","Done","X","X"]
["004","0","",0,{"$nulls":11},3,"Length to be kept to exactly, without gaps","Done","X"]
["006","0","",0,{"$nulls":11},4,"Length to be kept to exactly, numerical, without gaps","Done","X","X"]
["009","0","",0,{"$nulls":11},5,"Maximum value length","Done"]
["012","5","4","4",{"$nulls":11},9,"Check against country-specific edit format","Done","Poland","Poland","Canada"]
["024","4","4","4"]
["025","0","",0]
["026","0","",0]
["027","4","4","4"]
["030","4","4","4",{"$nulls":10},"TEST"]
["031","0","",0,{"$nulls":10},"TEST 2"]
["042","0","",0,{"$nulls":11},"canada","poland"]
["048","4","2","2",{"$nulls":12},{"$f":"IF(AND(ISNUMBER(VALUE(LEFT(E114,2))),ISNUMBER(SEARCH(\"-\",E114,3)),ISNUMBER(VALUE(RIGHT(E114,3)))),TRUE,FALSE)","v":true}]
["049","0","",0]
["051","0","",0]
["052","0","",0]
["053","0","",0]
["054","0","",0]
["057","0","",0]
["060","0","",0]
["061","0","",0]
["063","0","",0]
["066","0","",0]
["069","0","",0]
["071","0","",0]
["072","7","9","9","B3N 1G1"]
["075","0","",0]
["078","0","",0]
["081","5",0,0]
["084","0","",0]
["086","6","4","4"]
["093","0","",0]
["099","0","",0]
["102","4","4","4"]
["103","0","",0]
["105","0","",0]
["111","3","4","4"]
["113","5","2","2"]
["117","0","",0]
["120","4","4","4"]
["126","0","",0]
["135","0","",0]
["138","0","",0]
["139","0","",0]
["140","0","",0]
["141","0","",0]
["142","0","",0]
["143","0","",0]
["144","5","4","4"]
["147","5","4","4"]
["153","0","",0]
["156","0","",0]
["160","0","",0]
["162","0","",0]
["163","0","",0]
["165","5","4","4"]
["168","0","",0]
["177","0","",0]
["180","0","",0]
["183","0","",0]
["186","0","",0]
["195","4","4","4"]
["198","3","4","4"]
["204","6","4","4"]
["207","0","",{"$f":"IF(C67=\"\",0,C67)","v":0}]
["210","5","4","4"]
["213","0","",0]
["216","0","",0]
["219","5",0,0]
["222","5","4","4"]
["225","0","",0]
["228","0","",0]
["231","8","3","3"]
["234","0","",0]
["239","0","",0]
["240","0","",0]
["243","5","4","4"]
["245","0","",0]
["246","0","",0]
["247","0","",0]
["249","0","",0]
["252","3","4","4"]
["255","0","",0]
["258","0","",0]
["260","0","",0]
["264","4","4","4"]
["266","0","",0]
["267","0","",0]
["269","0","",0]
["270","5","4","4"]
["274","0","",0]
["276","0","",0]
["279","0","",0]
["282","0","",0]
["283","0","",0]
["285","5","4","4"]
["288","0","",0]
["291","0","",0]
["297","6","4","4"]
["300","7","9",0]
["309","4","4","4"]
["312","0","",0]
["318","0","",0]
["321","0","",0]
["324","4","4","4"]
["330","0","",0]
["333","0","",0]
["336","0","",0]
["338","0","",0]
["339","0","",0]
["342","4","4","4"]
["345","6","9","9","11-112 "]
["348","4","4","4"]
["366","6","4","4"]
["370","6","4","4"]
["375","0","",0]
["378","5","4","4"]
["381","0","",0]
["390","0","",0]
["391","6","4","4"]
["392","0","",0]
["393","4","4","4"]
["394","0","",0]
["395","0","",0]
["399","5","4","4"]
["402","0","",0]
["403","0","",0]
["404","0","",0]
["411","5","4",{"$f":"IF(C131=\"\",0,C131)","v":"4"}]
["414","0","",0]
["415","0","",0]
["420","5","4","4"]
["423","0","",0]
["429","0","",0]
["432","4","4","4"]
["435","5","4","4"]
["436","0","",0]
["438","0","",0]
["441","0","",0]
["449","0","",0]
["450","0","",0]
["453","9","5","5"]
["455","0","",0]
["456","5","1","4"]
["459","0","",0]
["462","0","",0]
["463","0","",0]
["471","0","",0]
["492","0","",0]
["495","5","4","4"]
["498","0","",0]
["499","0","",0]
["505","0","",0]
["507","0","",0]
["515","7","5","5"]
["520","5","4","4"]
["525","9","1","1"]
["535","0","",0]
["555","0","",0]
["564","0","",0]
["565","5","4","4"]
["567","0","",0]
["570","0","",0]
["575","4","4","4"]
["590","0","",0]
["601","0","",0]
["602","0","",0]
["603","0","",0]
["604","0","",0]
["605","0","",0]
["610","0","",0]
["611","0","",0]
["612","0","",0]
["615","0","",0]
["616","0","",0]
["617","0","",0]
["618","0","",0]
["620","0","",0]
["623","0","",0]
["624","0","",0]
["625","0","",0]
["626","0","",0]
["627","0","",0]
["628","0","",0]
["629","0","",0]
["630","0","",0]
["631","0","",0]
["634","0","",0]
["635","0","",0]
["636","0","",0]
["640","0","",0]
["645","0","",0]
["648","0","",{"$f":"IF(C195=\"\",0,C195)","v":0}]
["649","0","",0]
["655","0","",0]
["656","0","",0]
["660","0","",0]
["661","0","",0]
["662","0","",0]
["663","0","",0]
["664","0","",0]
["665","0","",0]
["666","0","",0]
["667","0","",0]
["668","0","",0]
["669","0","",0]
["672","0","",0]
["678","0","",0]
["679","0","",0]
["680","0","",0]
["681","0","",0]
["682","0","",0]
["683","0","",0]
["685","0","",0]
["688","0","",0]
["689","0","",0]
["690","0","",0]
["691","0","",0]
["692","0","",0]
["693","0","",0]
["695","0","",0]
["696","0","",0]
["697","0","",0]
["698","4","4","4"]
["700","0","",0]
["701","0","",0]
["705","0","",0]
["706","0","",0]
["891","0","",0]
["895","0","",0]
["897","0","",0]
["999","0","",0]
["AT","0","",0]
["BE","0","",0]
["CH","0","",0]
["CN","0","",0]
["DE","0","",0]
["DK","0","",0]
["ES","0","",0]
["FI","0","",0]
["FR","0","",0]
["GB","0","",0]
["ID","0","",0]
["IE","0","",0]
["IT","0","",0]
["JP","0","",0]
["LU","0","",0]
["MC","0","",0]
["NL","0","",0]
["NO","0","",0]
["RO","0","",0]
["RU","0","",0]
["SE","0","",0]
["UN","0","",0]
["… S","0",null,0]

{"sheet":"Region","index":5,"n_rows":700,"n_cols":236,"rows_kept":700,"cut":false,"hidden":true,"merged":[]}
["Check Country Change","Drop_Down_List_Values","Region_Codes","Country_Code&Region_code","Region Country","Mandatory","Argentina Regions","Australia Regions","Austria Regions","Canada Regions","China Regions","Denmark Regions","France Regions","Ireland Regions","Italy Regions","Japan Regions","Malaysia Regions","Mexico Regions","Netherlands Regions","New Zealand Regions","Norway Regions","Portugal Regions","Singapore Regions","Spain Regions","United Kingdom Regions","USA Regions","Germany Regions","Switzerland Regions","… Select","Greenland Regions","Guam Regions","Afghanistan Regions","Albania Regions","Algeria Regions","Aruba Regions","Armenia Regions","Azerbaijan Regions","Barbados Regions","Belgium Regions","Bhutan Regions","Bolivia Regions","Botswana Regions","Bosnia-Herz. Regions","Brazil Regions","Bulgaria Regions","Myanmar Regions","Burundi Regions","Belarus Regions","Cambodia Regions","Cameroon Regions","Canary Islands Regions","Central Afr.Rep Regions","Sri Lanka Regions","Chad Regions","Chile Regions","Colombia Regions","Congo, Dem. Rep Regions","Costa Rica Regions","Croatia Regions","Cuba Regions","Cyprus Regions","Czech Republic Regions","Benin Regions","Dominican Rep. Regions","Ecuador Regions","El Salvador Regions","Equatorial Guin Regions","Estonia Regions","Ethiopia Regions","Eritrea Regions","Fiji Regions","Finland Regions","Gabon Regions","Gambia Regions","Georgia Regions","Ghana Regions","Gibraltar Regions","Greece Regions","Guatemala Regions","Guinea Regions","Guyana Regions","Haiti Regions","Honduras Regions","Hungary Regions","Iceland Regions","India Regions","Indonesia Regions","Iran Regions","Iraq Regions","Israel Regions","Cote d'Ivoire Regions","Jamaica Regions","Jordan Regions","Kazakhstan Regions","Kenya Regions","Kuwait Regions","Kyrgyzstan Regions","Lao,Peo.Dem.Rep Regions","Latvia Regions","Lebanon Regions","Lesotho Regions","Liberia Regions","Libya Regions","Lithuania Regions","Luxembourg Regions","Macedonia, TFYR Regions","Madagascar Regions","Malawi Regions","Maldives,Rep of Regions","Mali Regions","Malta Regions","Mauritania Regions","Mauritius Regions","Mongolia Regions","Morocco Regions","Nepal Regions","Nicaragua Regions","Niger Regions","Nigeria Regions","Pakistan Regions","Panama Regions","Paraguay Regions","Congo Regions","Peru Regions","Philippines Regions","Poland Regions","Romania Regions","Russian Fed. Regions","Rwanda Regions","Saudi Arabia Regions","Senegal Regions","Sierra Leone Regions","Somalia Regions","South Africa Regions","Slovenia Regions","Slovak Republic Regions","Sudan Regions","Swaziland Regions","South Sudan Regions","Sweden Regions","Syria, Arab Rep Regions","Tajikistan Regions","Thailand Regions","Togo Regions","Trinidad,Tobago Regions","Tunisia Regions","Turkey Regions","Turkmenistan Regions","Uganda Regions","Ukraine Regions","Utd.Arab.Emir. Regions","Egypt Regions","Tanzania,Uni.Re Regions","Burkina-Faso Regions","Uruguay Regions","Uzbekistan Regions","Venezuela Regions","Yemen, Rep of Regions","Yugoslavia Regions","Zambia Regions","Andorra Regions","Bangladesh Regions","D.P.R. of Korea Regions","Vietnam Regions","Vatican City Regions","Liechtenstein Regions","Moldova, Rep of Regions","Monaco Regions","South Korea,Rep Regions","San Marino Regions","Samoa Regions","Antigua/Barbuda Regions","Brunei Darussal Regions","Bahamas Regions","Bahrain Regions","Bermuda Regions","Dominica Regions","Belize Regions","Hong Kong Regions","Cayman Islands Regions","Grenada Regions","Kiribati Regions","Tuvalu Regions","Montserrat Regions","Anguilla Regions","Qatar Regions","St. Helena Regions","Zimbabwe Regions","St Kitts&Nevis Regions","Seychelles Regions","St. Lucia Regions","St. Vincent Regions","Solomon Islands Regions","Tonga Regions","Oman Regions","Turks& Caicosin Regions","Brit.Virgin Is. Regions","Sikkim Regions","Nauru Regions","Pap. New Guinea Regions","Vanuatu Regions","Tokelau Islands Regions","French Antilles Regions","Wallis,Futuna Regions","Comoros Regions","Reunion Regions","Martinique Regions","French Guiana Regions","Guadeloupe Regions","New Caledonia Regions","Frenc.Polynesia Regions","Djibouti Regions","Netherlands Ant Regions","Suriname Regions","Cook Islands Regions","Niue Regions","Angola Regions","Cabo Verde Regions","S.Tome&Principe Regions","Guinea-Bissau Regions","Macau Regions","Mozambique Regions","Palau, Rep of Regions","Western Sahara Regions","Marshall Islnds Regions","Micronesia Regions","Puerto Rico Regions","Samoa,American Regions","Amer.Virgin Is. Regions","Namibia Regions","N.Mariana Is. Regions","Palestine Regions","Timor-Leste Regions","Serbia & Monten Regions","Montenegro Regions","Serbia Regions"]
["024 Argentina 00 CAPITAL FEDERAL","00 CAPITAL FEDERAL","00","024 Argentina 00","024 Argentina","Yes","… Select","… Select","… Select","… Select","… Select","… Select","… Select","… Select","… Select","… Select","… Select","… Select","… Select","… Select","… Select","… Select","… Select","… Select","… Select","… Select","… Select","… Select","… Select","… Select","… Select","… Select","… Select","… Select","… Select","… Select","… Select","… Select","… Select","… Select","… Select","… Select","… Select","… Select","… Select","… Select","… Select","… Select","… Select","… Select","… Select","… Select","… Select","… Select","… Select","… Select","… Select","… Select","… Select","… Select","… Select","… Select","… Select","… Select","… Select","… Select","… Select","… Select","… Select","… Select","… Select","… Select","… Select","… Select","… Select","… Select","… Select","… Select","… Select","… Select","… Select","… Select","… Select","… Select","… Select","… Select","… Select","… Select","… Select","… Select","… Select","… Select","… Select","… Select","… Select","… Select","… Select","… Select","… Select","… Select","… Select","… Select","… Select","… Select","… Select","… Select","… Select","… Select","… Select","… Select","… Select","… Select","… Select","… Select","… Select","… Select","… Select","… Select","… Select","… Select","… Select","… Select","… Select","… Select","… Select","… Select","… Select","… Select","… Select","… Select","… Select","… Select","… Select","… Select","… Select","… Select","… Select","… Select","… Select","… Select","… Select","… Select","… Select","… Select","… Select","… Select","… Select","… Select","… Select","… Select","… Select","… Select","… Select","… Select","… Select","… Select","… Select","… Select","… Select","… Select","… Select","… Select","… Select","… Select","… Select","… Select","… Select","… Select","… Select","… Select","… Select","… Select","… Select","… Select","… Select","… Select","… Select","… Select","… Select","… Select","… Select","… Select","… Select","… Select","… Select","… Select","… Select","… Select","… Select","… Select","… Select","… Select","… Select","… Select","… Select","… Select","… Select","… Select","… Select","… Select","… Select","… Select","… Select","… Select","… Select","… Select","… Select","… Select","… Select","… Select","… Select","… Select","… Select","… Select","… Select","… Select","… Select","… Select","… Select","… Select","… Select","… Select","… Select","… Select","… Select","… Select","… Select","… Select","… Select","… Select","… Select","… Select","… Select","… Select","… Select","… Select"]
["024 Argentina 01 BUENOS AIRES","01 BUENOS AIRES","01","024 Argentina 01","027 Australia","No","00 CAPITAL FEDERAL","Aust Capital Terr","Burgenland","Alberta","Beijing","Copenhagen","Ain","Cork","Agriento","Hokkaido","Johor","AGS Aguascalientes","Drenthe","North Island","Østfold Fylke","Minho-Lima","SG-east","Alava","Armagh","Alaska","Schleswig-Holstein","Aargau"]
["024 Argentina 02 CATAMARCA","02 CATAMARCA","02","024 Argentina 02","030 Austria","No","01 BUENOS AIRES","New South Wales","Corinthia","British Columbia","Shanghai",null,"Aisne","Clare","Alessandria","Aomori-ken","Kedah","BCN Baja California N","Flevopolder","South Island","Akershus Fylke","Cávado","SG-north","Albacete","Antrim","Alabama","Hamburg","Appenzell Innerrh"]
["024 Argentina 03 CORDOBA","03 CORDOBA","03","024 Argentina 03","072 Canada","No","02 CATAMARCA","Northern Territory","Lower Austria","Manitoba","Tianjin",null,"Allier","Carlow","Ancona","Iwate-ken","Kelantan","BCS Baja California S","Friesland",null,"Oslo","Ave","SG-south","Alicante","Avon","Arkansas","Lower Saxony","Appenzell Ausserrh."]
["024 Argentina 04 CORRIENTES","04 CORRIENTES","04","024 Argentina 04","086 China","No","03 CORDOBA","Queensland","Upper Austria","New Brunswick","Nei Mongol",null,"Alpes (Hte-Provence)","Dublin","Aosta","Miyagi-ken","Kuala Lumpur","CHI Chihuahua","Gelderland",null,"Hedmark Fylke","Grande Porto","SG-west","Almeria","Bedfordshire","American Samoa","Bremen","Bern"]
["024 Argentina 05 ENTRE RIOS","05 ENTRE RIOS","05","024 Argentina 05","120 Denmark","No","04 CORRIENTES","South Australia","Salzburg","Newfoundland","Shanxi",null,"Alpes (Hautes)","Donegal","Ascoli Piceno","Akita-ken","Labuan","CHS Chiapas","Groningen",null,"Oppland Fylke","Tâmega",null,"Avila","Berkshire","Arizona","Nrth Rhine Westfalia","Basel Land"]
["024 Argentina 06 JUJUY","06 JUJUY","06","024 Argentina 06","147 France","No","05 ENTRE RIOS","Tasmania","Styria","Nova Scotia","Hebei",null,"Alpes-Maritimes","Galway","L'Aquila","Yamagata-ken","Melaka","CMP Campeche","Limburg",null,"Buskerud Fylke","Entre Douro e Vouga",null,"Badajoz","Borders","California","Hesse","Basel Stadt"]
["024 Argentina 07 MENDOZA","07 MENDOZA","07","024 Argentina 07","216 Ireland","No","06 JUJUY","Victoria","Tyrol","Northwest Territory","Liaoning",null,"Ardèche","Kildare","Arezzo","Fukushima-ken","Pahang","COA Coahuila","Noord-Brabant",null,"Vestfold Fylke","Douro",null,"Baleares","Buckinghamshire","Colorado","Rhineland Palatinate","Fribourg"]
["024 Argentina 08 LA RIOJA","08 LA RIOJA","08","024 Argentina 08","222 Italy","No","07 MENDOZA","Western Australia","Vorarlberg","Ontario","Jilin",null,"Ardennes","Kilkenny","Asti","Ibaragi-ken","Perlis","COL Colima","Noord-Holland",null,"Telemark Fylke","Alto Trás-os-Montes",null,"Barcelona","Cambridgeshire","Connecticut","Baden-Wurttemberg","Geneva"]
["024 Argentina 09 SALTA","09 SALTA","09","024 Argentina 09","231 Japan","No","08 LA RIOJA",null,"Vienna","Prince Edward Island","Heilongjiang",null,"Ariège","Kavan","Avellino","Tochigi-ken","Perak","DF Distrito Federal","Overijssel",null,"Aust-Agder Fylke","Baixo Vouga",null,"Burgos","Central","District of Columbia","Bavaria","Glarus"]
["024 Argentina 10 SAN JUAN","10 SAN JUAN",10,"024 Argentina 10","270 Malaysia","No","09 SALTA",null,null,"Quebec","Jiangsu",null,"Aube","Kerry","Bari","Gunma-ken","Pulau Pinang","DGO Durango","Utrecht",null,"Vest-Agder Fylke","Baixo Mondego",null,"Caceres","Cheshire","Delaware","Saarland","Graubuenden"]
["024 Argentina 11 SAN LUIS","11 SAN LUIS",11,"024 Argentina 11","285 Mexico","Yes","10 SAN JUAN",null,null,"Saskatchewan","Anhui",null,"Aude","Longford","Bergamo","Saitama-ken","Sabah","GRO Guerrero","Zeeland",null,"Rogaland Fylke","Pinhal Litoral",null,"Cadiz","Clwyd","Florida","Berlin","Jura"]
["024 Argentina 12 SANTA FE","12 SANTA FE",12,"024 Argentina 12","300 Netherlands","No","11 SAN LUIS",null,null,"Yukon","Shandong",null,"Aveyron","Limerick","Biella","Chiba-ken","Sarawak","GTO Guanajuato","Zuid-Holland",null,"Hordaland Fylke","Pinhal Interior N.",null,"Castellon","Cornwall","Georgia","Brandenburg","Lucerne"]
["024 Argentina 13 SANTIAGO DEL ESTERO","13 SANTIAGO DEL ESTERO",13,"024 Argentina 13","309 New Zealand","No","12 SANTA FE",null,null,"Outside province/Can","Zhejiang",null,"Bouches-du-Rhône","Leitrim","Belluno","Tokyo-to","Selangor","HGO Hidalgo",null,null,"Sogn og Fjordane F.","Pinhal Interior Sul",null,"Ciudad Real","Cumbria","Guam","Mecklenburg-Vorpomm.","Neuchatel"]
["024 Argentina 14 TUCUMAN","14 TUCUMAN",14,"024 Argentina 14","324 Norway","No","13 SANTIAGO DEL ESTERO",null,null,null,"Jiangxi",null,"Calvados","Laois","Benevento","Kanagawa-ken","Negeri Sembilan","JAL Jalisco",null,null,"Møre og Romsdal F.","Dão-Lafoes",null,"Cordoba","Cleveland","Hawaii","Saxony","Nidwalden"]
["024 Argentina 16 CHACO","16 CHACO",16,"024 Argentina 16","348 Portugal","No","14 TUCUMAN",null,null,null,"Fujian",null,"Cantal","Louth","Bologna","Niigata-ken","Trengganu","MCH Michoacán",null,null,"Sør-Trøndelag Fylke","Serra da Estrela",null,"La Coruña","Derbyshire","Iowa","Saxen-Anhalt","Obwalden"]
["024 Argentina 17 CHUBUT","17 CHUBUT",17,"024 Argentina 17","391 Singapore","No","16 CHACO",null,null,null,"Hunan",null,"Charente","Monaghan","Brescia","Toyama-ken",null,"MEX Estado de México",null,null,"Nord-Trøndelag Fylke","Beira Interior Norte",null,"Cuenca","Cambridgeshire","Idaho","Thueringen","St. Gallen"]
["024 Argentina 18 FORMOSA","18 FORMOSA",18,"024 Argentina 18","399 Spain","No","17 CHUBUT",null,null,null,"Hubei",null,"Charente-Maritime","Meath","Bolzano","Ishikawa-ken",null,"MOR Morelos",null,null,"Nordland Fylke","Beira Interior Sul",null,"Gerona","Down","Illinois",null,"Schaffhausen"]
["024 Argentina 19 MISIONES","19 MISIONES",19,"024 Argentina 19","453 United Kingdom","No","18 FORMOSA",null,null,null,"Henan",null,"Cher","Mayo","Cagliari","Fukui-ken",null,"NL Nuevo Léon",null,null,"Troms Fylke","Cova da Beira",null,"Granada","Dorset","Indiana",null,"Solothurn"]
["024 Argentina 20 NEUQUEN","20 NEUQUEN",20,"024 Argentina 20","456 USA","No","19 MISIONES",null,null,null,"Guangdong",null,"Corrèze","Ossally","Campobasso","Yamanashi-ken",null,"OAX Oaxaca",null,null,"Finnmark Fylke","Oeste",null,"Guadalajara","Durham","Kansas",null,"Switzerland"]
["024 Argentina 21 LA PAMPA","21 LA PAMPA",21,"024 Argentina 21","525 Germany","No","20 NEUQUEN",null,null,null,"Hainan",null,"Côte-d'Or","Rosscommon","Caserta","Nagoya-ken",null,"PUE Puebla",null,null,"Svalbard","Grande Lisboa",null,"Guipuzcoa","Devon","Kentucky",null,"Thurgau"]
["024 Argentina 22 RIO NEGRO","22 RIO NEGRO",22,"024 Argentina 22","575 Switzerland","No","21 LA PAMPA",null,null,null,"Guangxi",null,"Côtes-d'Armor","Sligo","Chieti","Gifu-ken",null,"QR Quintana Roo",null,null,null,"Península de Setúbal",null,"Huelva","Dyfed","Louisiana",null,"Ticino"]
["024 Argentina 23 SANTA CRUZ","23 SANTA CRUZ",23,"024 Argentina 23",null,null,"22 RIO NEGRO",null,null,null,"Guizhou",null,"Creuse","Tipperary","Caltanisetta","Shizuoka-ken",null,"QRO Querétaro",null,null,null,"Médio Tejo",null,"Huesca","Essex","Massachusetts",null,"Uri"]
["024 Argentina 24 TIERRA DEL FUEGO","24 TIERRA DEL FUEGO",24,"024 Argentina 24",null,null,"23 SANTA CRUZ",null,null,null,"Sichuan",null,"Dordogne","Waterford","Cuneo","Aichi-ken",null,"SIN Sinaloa",null,null,null,"Lezíria do Tejo",null,"Jaen","Fife","Maryland",null,"Vaud"]
["027 Australia Aust Capital Terr","Aust Capital Terr","ACT","027 Australia ACT",null,null,"24 TIERRA DEL FUEGO",null,null,null,"Yunnan",null,"Doubs","Wicklow","Como","Mie-ken",null,"SLP San Luis Potosí",null,null,null,"Alentejo Litoral",null,"Leon","Fermanagh","Maine",null,"Valais"]
["027 Australia New South Wales","New South Wales","NSW","027 Australia NSW",{"$nulls":6},"Shaanxi",null,"Drôme","Westmeath","Cremona","Shiga-ken",null,"SON Sonora",null,null,null,"Alto Alentejo",null,"Lerida","Gloucestershire","Michigan",null,"Zug"]
["027 Australia Northern Territory","Northern Territory","NT","027 Australia NT",{"$nulls":6},"Gansu",null,"Eure","Wexford","Cosenza","Kyoto-fu",null,"TAB Tabasco",null,null,null,"Alentejo Central",null,"La Rioja","Greater Manchester","Minnesota",null,"Zurich"]
["027 Australia Queensland","Queensland","QLD","027 Australia QLD",{"$nulls":6},"Ningxia",null,"Eure-et-Loir",null,"Catania","Osaka-fu",null,"TLX Tlaxcala",null,null,null,"Baixo Alentejo",null,"Lugo","Grampian","Missouri"]
["027 Australia South Australia","South Australia","SA","027 Australia SA",{"$nulls":6},"Qinghai",null,"Finistère",null,"Catanzaro","Hyogo-ken",null,"TMS Tamaulipas",null,null,null,"Algarve",null,"Madrid","Gwent","Northern Mariana Isl"]
["027 Australia Tasmania","Tasmania","TAS","027 Australia TAS",{"$nulls":6},"Xinjiang",null,"Corse-du-Sud",null,"Enna","Nara-ken",null,"VER Veracruz",null,null,null,"Reg. Aut. dos Açores",null,"Malaga","Gwynedd","Mississippi"]
["027 Australia Victoria","Victoria","VIC","027 Australia VIC",{"$nulls":6},"Xizang",null,"Corse-du-Nord",null,"Ferrara","Wakayama-ken",null,"YUC Yucatán",null,null,null,"Reg. Aut. da Madeira",null,"Murcia","Hampshire","Montana"]
["027 Australia Western Australia","Western Australia","WA","027 Australia WA",{"$nulls":6},"Taiwan",null,"Gard",null,"Foggia","Tottori-ken",null,"ZAC Zacatecas",{"$nulls":5},"Navarra","Highland","North Carolina"]
["030 Austria Burgenland","Burgenland","B","030 Austria B",{"$nulls":8},"Garonne (Haute)",null,"Firenze","Shimana-ken",{"$nulls":7},"Orense","Hertfordshire","North Dakota"]
["030 Austria Corinthia","Corinthia","K","030 Austria K",{"$nulls":8},"Gers",null,"Forlì","Okayama-ken",{"$nulls":7},"Asturias","Humberside","Nebraska"]
["030 Austria Lower Austria","Lower Austria","NÖ","030 Austria NÖ",{"$nulls":8},"Gironde",null,"Frosinone","Hiroshima-ken",{"$nulls":7},"Palencia","Herefd. and Worcest.","New Hampshire"]
["030 Austria Upper Austria","Upper Austria","OÖ","030 Austria OÖ",{"$nulls":8},"Hérault",null,"Genova","Yamaguchi-ken",{"$nulls":7},"Las Palmas","Isle of Man","New Jersey"]
["030 Austria Salzburg","Salzburg","S","030 Austria S",{"$nulls":8},"Ille-et-Vilaine",null,"Gorizia","Tokushima-ken",{"$nulls":7},"Pontevedra","Isle of Wight","New Mexico"]
["030 Austria Styria","Styria","ST","030 Austria ST",{"$nulls":8},"Indre",null,"Grosseto","Kagawa-ken",{"$nulls":7},"Salamanca","Kent","Nevada"]
["030 Austria Tyrol","Tyrol","T","030 Austria TAS",{"$nulls":8},"Indre-et-Loire",null,"Imperia","Ehima-ken",{"$nulls":7},"Sta. Cruz Tenerife","Lancashire","New York"]
["030 Austria Vorarlberg","Vorarlberg","V","030 Austria V",{"$nulls":8},"Isère",null,"Isernia","Kochi-ken",{"$nulls":7},"Cantabria","Londonderry","Ohio"]
["030 Austria Vienna","Vienna","W","030 Austria W",{"$nulls":8},"Jura",null,"Crotone","Fukuoka-ken",{"$nulls":7},"Segovia","Leicestershire","Oklahoma"]
["072 Canada Alberta","Alberta","AB","072 Canada AB",{"$nulls":8},"Landes",null,"Lecco","Saga-ken",{"$nulls":7},"Sevilla","Lincolnshire","Oregon"]
["072 Canada British Columbia","British Columbia","BC","072 Canada BC",{"$nulls":8},"Loir-et-Cher",null,"Lecce","Nagasaki-ken",{"$nulls":7},"Soria","Greater London","Pennsylvania"]
["072 Canada Manitoba","Manitoba","MB","072 Canada MB",{"$nulls":8},"Loire",null,"Livorno","Kumamoto-ken",{"$nulls":7},"Tarragona","Lothian","Puerto Rico"]
["072 Canada New Brunswick","New Brunswick","NB","072 Canada NB",{"$nulls":8},"Loire (Haute)",null,"Lodi","Oita-ken",{"$nulls":7},"Teruel","Mid Glamorgan","Rhode Island"]
["072 Canada Newfoundland","Newfoundland","NF","072 Canada NF",{"$nulls":8},"Loire-Atlantique",null,"Latina","Miyazaki-ken",{"$nulls":7},"Toledo","Merseyside","South Carolina"]
["072 Canada Nova Scotia","Nova Scotia","NS","072 Canada NS",{"$nulls":8},"Loiret",null,"Lucca","Kagoshima-ken",{"$nulls":7},"Valencia","Northamptonshire","South Dakota"]
["072 Canada Northwest Territory","Northwest Territory","NT","072 Canada NT",{"$nulls":8},"Lot",null,"Macerata","Okinawa-ken",{"$nulls":7},"Valladolid","Norfolk","Tennessee"]
["072 Canada Ontario","Ontario","ON","072 Canada ON",{"$nulls":8},"Lot-et-Garonne",null,"Messina",{"$nulls":8},"Vizcaya","Nottinghamshire","Texas"]
["072 Canada Prince Edward Island","Prince Edward Island","PE","072 Canada PE",{"$nulls":8},"Lozère",null,"Milan",{"$nulls":8},"Zamora","Northumberland","Utah"]
["072 Canada Quebec","Quebec","QC","072 Canada QC",{"$nulls":8},"Maine-et-Loire",null,"Mantova",{"$nulls":8},"Zaragoza","Oxfordshire","Virginia"]
["072 Canada Saskatchewan","Saskatchewan","SK","072 Canada SK",{"$nulls":8},"Manche",null,"Modena",{"$nulls":9},"Powys","Virgin Islands"]
["072 Canada Yukon","Yukon","YT","072 Canada YT",{"$nulls":8},"Marne",null,"Massa Carrara",{"$nulls":9},"Strathclyde","Vermont"]
["072 Canada Outside province/Can","Outside province/Can","ZZ","072 Canada ZZ",{"$nulls":8},"Marne (Haute)",null,"Matera",{"$nulls":9},"South Glamorgan","Washington"]
["086 China Beijing","Beijing","010","086 China 010",{"$nulls":8},"Mayenne",null,"Napoli",{"$nulls":9},"Shropshire","Wisconsin"]
["086 China Shanghai","Shanghai","020","086 China 020",{"$nulls":8},"Meurthe-et-Moselle",null,"Novara",{"$nulls":9},"Suffolk","West Virginia"]
["086 China Tianjin","Tianjin","030","086 China 030",{"$nulls":8},"Meuse",null,"Nuoro",{"$nulls":9},"Somerset","Wyoming"]
["086 China Nei Mongol","Nei Mongol","040","086 China 040",{"$nulls":8},"Morbihan",null,"Oristano",{"$nulls":9},"Staffordshire"]
["086 China Shanxi","Shanxi","050","086 China 050",{"$nulls":8},"Moselle",null,"Palermo",{"$nulls":9},"Suffolk"]
["086 China Hebei","Hebei","060","086 China 060",{"$nulls":8},"Nièvre",null,"Piacenza",{"$nulls":9},"Sussex"]
["086 China Liaoning","Liaoning","070","086 China 070",{"$nulls":8},"Nord",null,"Padova",{"$nulls":9},"Surrey"]
["086 China Jilin","Jilin","080","086 China 080",{"$nulls":8},"Oise",null,"Pescara",{"$nulls":9},"Tayside"]
["086 China Heilongjiang","Heilongjiang","090","086 China 090",{"$nulls":8},"Orne",null,"Perugia",{"$nulls":9},"Tyne and Wear"]
["086 China Jiangsu","Jiangsu",100,"086 China 100",{"$nulls":8},"Pas-de-Calais",null,"Pisa",{"$nulls":9},"Tyrone"]
["086 China Anhui","Anhui",110,"086 China 110",{"$nulls":8},"Puy-de-Dôme",null,"Pordenone",{"$nulls":9},"Warwickshire"]
["086 China Shandong","Shandong",120,"086 China 120",{"$nulls":8},"Pyrénées-Atlantiques",null,"Prato",{"$nulls":9},"West Glamorgan"]
["086 China Zhejiang","Zhejiang",130,"086 China 130",{"$nulls":8},"Pyrénées (Hautes)",null,"Parma",{"$nulls":9},"Wiltshire"]
["086 China Jiangxi","Jiangxi",140,"086 China 140",{"$nulls":8},"Pyrénées-Orientales",null,"Pesaro",{"$nulls":9},"West Midlands"]
["086 China Fujian","Fujian",150,"086 China 150",{"$nulls":8},"Bas-Rhin",null,"Pistoia",{"$nulls":9},"Worcestershire"]
["086 China Hunan","Hunan",160,"086 China 160",{"$nulls":8},"Haut-Rhin",null,"Pavia",{"$nulls":9},"Yorkshire"]
["086 China Hubei","Hubei",170,"086 China 170",{"$nulls":8},"Rhône",null,"Potenza",{"$nulls":9},"North Yorkshire"]
["086 China Henan","Henan",180,"086 China 180",{"$nulls":8},"Saône (Haute)",null,"Ravenna",{"$nulls":9},"South Yorkshire"]
["086 China Guangdong","Guangdong",190,"086 China 190",{"$nulls":8},"Saône-et-Loire",null,"Reggio Calabria",{"$nulls":9},"West Yorkshire"]
["086 China Hainan","Hainan",200,"086 China 200",{"$nulls":8},"Savoie",null,"Ragusa"]
["086 China Guangxi","Guangxi",210,"086 China 210",{"$nulls":8},"Savoie (Haute)",null,"Rieti"]
["086 China Guizhou","Guizhou",220,"086 China 220",{"$nulls":8},"Paris",null,"Rome"]
["086 China Sichuan","Sichuan",230,"086 China 230",{"$nulls":8},"Seine-Maritime",null,"Rimini"]
["086 China Yunnan","Yunnan",240,"086 China 240",{"$nulls":8},"Seine-et-Marne",null,"Rovigo"]
["086 China Shaanxi","Shaanxi",250,"086 China 250",{"$nulls":8},"Yvelines",null,"Rovigo"]
["086 China Gansu","Gansu",260,"086 China 260",{"$nulls":8},"Sèvres (Deux)",null,"Salerno"]
["086 China Ningxia","Ningxia",270,"086 China 270",{"$nulls":8},"Somme",null,"Siena"]
["086 China Qinghai","Qinghai",280,"086 China 280",{"$nulls":8},"Tarn",null,"Sondrio"]
["086 China Xinjiang","Xinjiang",290,"086 China 290",{"$nulls":8},"Tarn-et-Garonne",null,"La Spezia"]
["086 China Xizang","Xizang",300,"086 China 300",{"$nulls":8},"Var",null,"Siracusa"]
["086 China Taiwan","Taiwan",310,"086 China 310",{"$nulls":8},"Vaucluse",null,"Sassari"]
["102 DenmarkCopenhagen","Copenhagen","101","120 Denmark 001",{"$nulls":8},"Vendée",null,"Savona"]
["147 France Ain","Ain","01","147 France 01",{"$nulls":8},"Vienne",null,"Taranto"]
["147 France Aisne","Aisne","02","147 France 02",{"$nulls":8},"Vienne (Haute)",null,"Teramo"]
["147 France Allier","Allier","03","147 France 03",{"$nulls":8},"Vosges",null,"Trento"]
["147 France Alpes (Hte-Provence)","Alpes (Hte-Provence)","04","147 France 04",{"$nulls":8},"Yonne",null,"Turin"]
["147 France Alpes (Hautes)","Alpes (Hautes)","05","147 France 05",{"$nulls":8},"Territ.-de-Belfort",null,"Trapani"]
["147 France Alpes-Maritimes","Alpes-Maritimes","06","147 France 06",{"$nulls":8},"Essonne",null,"Terni"]
["147 France Ardèche","Ardèche","07","147 France 07",{"$nulls":8},"Hauts-de-Seine",null,"Trieste"]
["147 France Ardennes","Ardennes","08","147 France 08",{"$nulls":8},"Seine-Saint-Denis",null,"Treviso"]
["147 France Ariège","Ariège","09","147 France 09",{"$nulls":8},"Val-de-Marne",null,"Udine"]
["147 France Aube","Aube",10,"147 France 10",{"$nulls":8},"Val-d'Oise",null,"Varese"]
["147 France Aude","Aude",11,"147 France 11",{"$nulls":8},"D.O.M.-T.O.M.",null,"Vercelli"]
["147 France Aveyron","Aveyron",12,"147 France 12",{"$nulls":8},"Guadeloupe",null,"Venice"]
["147 France Bouches-du-Rhône","Bouches-du-Rhône",13,"147 France 13",{"$nulls":8},"Martinique",null,"Vicenza"]
["147 France Calvados","Calvados",14,"147 France 14",{"$nulls":8},"Guyane",null,"Verona"]
["147 France Cantal","Cantal",15,"147 France 15",{"$nulls":8},"Réunion",null,"Viterbo"]
["147 France Charente","Charente",16,"147 France 16",{"$nulls":8},"Saint-Pierre-et-Miq.",null,"Vibo Valentia"]
["147 France Charente-Maritime","Charente-Maritime",17,"147 France 17",{"$nulls":8},"Wallis-et-Futuna"]
["147 France Cher","Cher",18,"147 France 18",{"$nulls":8},"Hors-France"]
["147 France Corrèze","Corrèze",19,"147 France 19"]
["147 FranceCôte-d'Or","Côte-d'Or",21,"147 France 20"]
["147 FranceCôtes-d'Armor","Côtes-d'Armor",22,"147 France 21"]
["147 FranceCreuse","Creuse",23,"147 France 22"]
["147 FranceDordogne","Dordogne",24,"147 France 23"]
["147 FranceDoubs","Doubs",25,"147 France 24"]
["147 FranceDrôme","Drôme",26,"147 France 25"]
["147 FranceEure","Eure",27,"147 France 26"]
["147 FranceEure-et-Loir","Eure-et-Loir",28,"147 France 27"]
["147 FranceFinistère","Finistère",29,"147 France 28"]
["147 FranceCorse-du-Sud","Corse-du-Sud","2A","147 France 29"]
["147 FranceCorse-du-Nord","Corse-du-Nord","2B","147 France 30"]
["147 FranceGard","Gard",30,"147 France 31"]
["147 FranceGaronne (Haute)","Garonne (Haute)",31,"147 France 32"]
["147 FranceGers","Gers",32,"147 France 33"]
["147 FranceGironde","Gironde",33,"147 France 34"]
["147 FranceHérault","Hérault",34,"147 France 35"]
["147 FranceIlle-et-Vilaine","Ille-et-Vilaine",35,"147 France 36"]
["147 FranceIndre","Indre",36,"147 France 37"]
["147 FranceIndre-et-Loire","Indre-et-Loire",37,"147 France 38"]
["147 FranceIsère","Isère",38,"147 France 39"]
["147 FranceJura","Jura",39,"147 France 40"]
["147 FranceLandes","Landes",40,"147 France 41"]
["147 FranceLoir-et-Cher","Loir-et-Cher",41,"147 France 42"]
["147 FranceLoire","Loire",42,"147 France 43"]
["147 FranceLoire (Haute)","Loire (Haute)",43,"147 France 44"]
["147 FranceLoire-Atlantique","Loire-Atlantique",44,"147 France 45"]
["147 FranceLoiret","Loiret",45,"147 France 46"]
["147 FranceLot","Lot",46,"147 France 47"]
["147 FranceLot-et-Garonne","Lot-et-Garonne",47,"147 France 48"]
["147 FranceLozère","Lozère",48,"147 France 49"]
["147 FranceMaine-et-Loire","Maine-et-Loire",49,"147 France 50"]
["147 FranceManche","Manche",50,"147 France 51"]
["147 FranceMarne","Marne",51,"147 France 52"]
["147 FranceMarne (Haute)","Marne (Haute)",52,"147 France 53"]
["147 FranceMayenne","Mayenne",53,"147 France 54"]
["147 FranceMeurthe-et-Moselle","Meurthe-et-Moselle",54,"147 France 55"]
["147 FranceMeuse","Meuse",55,"147 France 56"]
["147 FranceMorbihan","Morbihan",56,"147 France 57"]
["147 FranceMoselle","Moselle",57,"147 France 58"]
["147 FranceNièvre","Nièvre",58,"147 France 59"]
["147 FranceNord","Nord",59,"147 France 60"]
["147 FranceOise","Oise",60,"147 France 61"]
["147 FranceOrne","Orne",61,"147 France 62"]
["147 FrancePas-de-Calais","Pas-de-Calais",62,"147 France 63"]
["147 FrancePuy-de-Dôme","Puy-de-Dôme",63,"147 France 64"]
["147 FrancePyrénées-Atlantiques","Pyrénées-Atlantiques",64,"147 France 65"]
["147 FrancePyrénées (Hautes)","Pyrénées (Hautes)",65,"147 France 66"]
["147 FrancePyrénées-Orientales","Pyrénées-Orientales",66,"147 France 67"]
["147 FranceBas-Rhin","Bas-Rhin",67,"147 France 68"]
["147 FranceHaut-Rhin","Haut-Rhin",68,"147 France 69"]
["147 FranceRhône","Rhône",69,"147 France 70"]
["147 FranceSaône (Haute)","Saône (Haute)",70,"147 France 71"]
["147 FranceSaône-et-Loire","Saône-et-Loire",71,"147 France 72"]
["147 FranceSarthe","Sarthe",72,"147 France 73"]
["147 FranceSavoie","Savoie",73,"147 France 74"]
["147 FranceSavoie (Haute)","Savoie (Haute)",74,"147 France 75"]
["147 FranceParis","Paris",75,"147 France 76"]
["147 FranceSeine-Maritime","Seine-Maritime",76,"147 France 77"]
["147 FranceSeine-et-Marne","Seine-et-Marne",77,"147 France 78"]
["147 FranceYvelines","Yvelines",78,"147 France 79"]
["147 FranceSèvres (Deux)","Sèvres (Deux)",79,"147 France 80"]
["147 FranceSomme","Somme",80,"147 France 81"]
["147 FranceTarn","Tarn",81,"147 France 82"]
["147 FranceTarn-et-Garonne","Tarn-et-Garonne",82,"147 France 83"]
["147 FranceVar","Var",83,"147 France 84"]
["147 FranceVaucluse","Vaucluse",84,"147 France 85"]
["147 FranceVendée","Vendée",85,"147 France 86"]
["147 FranceVienne","Vienne",86,"147 France 87"]
["147 FranceVienne (Haute)","Vienne (Haute)",87,"147 France 88"]
["147 FranceVosges","Vosges",88,"147 France 89"]
["147 FranceYonne","Yonne",89,"147 France 90"]
["147 FranceTerrit.-de-Belfort","Territ.-de-Belfort",90,"147 France 91"]
["147 FranceEssonne","Essonne",91,"147 France 92"]
["147 FranceHauts-de-Seine","Hauts-de-Seine",92,"147 France 93"]
["147 FranceSeine-Saint-Denis","Seine-Saint-Denis",93,"147 France 94"]
["147 FranceVal-de-Marne","Val-de-Marne",94,"147 France 95"]
["147 FranceVal-d'Oise","Val-d'Oise",95,"147 France 96"]
["147 France D.O.M.-T.O.M.","D.O.M.-T.O.M.",97,"147 France 97"]
["147 France Guadeloupe","Guadeloupe",971,"147 France 971"]
["147 France Martinique","Martinique",972,"147 France 972"]
["147 France Guyane","Guyane",973,"147 France 973"]
["147 France Réunion","Réunion",974,"147 France 974"]
["147 France Saint-Pierre-et-Miq.","Saint-Pierre-et-Miq.",975,"147 France 975"]
["147 France Wallis-et-Futuna","Wallis-et-Futuna",976,"147 France 976"]
["147 France Hors-France","Hors-France",99,"147 France 99"]
["216 Ireland Cork","Cork","CK","216 Ireland CK"]
["216 Ireland Clare","Clare","CL","216 Ireland CL"]
["216 Ireland Carlow","Carlow","CW","216 Ireland CW"]
["216 Ireland Dublin","Dublin","DB","216 Ireland DB"]
["216 Ireland Donegal","Donegal","DG","216 Ireland DG"]
["216 Ireland Galway","Galway","GW","216 Ireland GW"]
["216 Ireland Kildare","Kildare","KD","216 Ireland KD"]
["216 Ireland Kilkenny","Kilkenny","KK","216 Ireland KK"]
["216 Ireland Kavan","Kavan","KV","216 Ireland KV"]
["216 Ireland Kerry","Kerry","KY","216 Ireland KY"]
["216 Ireland Longford","Longford","LF","216 Ireland LF"]
["216 Ireland Limerick","Limerick","LI","216 Ireland LI"]
["216 Ireland Leitrim","Leitrim","LM","216 Ireland LM"]
["216 Ireland Laois","Laois","LS","216 Ireland LS"]
["216 Ireland Louth","Louth","LT","216 Ireland LT"]
["216 Ireland Monaghan","Monaghan","MH","216 Ireland MH"]
["216 Ireland Meath","Meath","MT","216 Ireland MT"]
["216 Ireland Mayo","Mayo","MY","216 Ireland MY"]
["216 Ireland Ossally","Ossally","OS","216 Ireland OS"]
["216 Ireland Rosscommon","Rosscommon","RC","216 Ireland RC"]
["216 Ireland Sligo","Sligo","SG","216 Ireland SG"]
["216 Ireland Tipperary","Tipperary","TP","216 Ireland TP"]
["216 Ireland Waterford","Waterford","WF","216 Ireland WF"]
["216 Ireland Wicklow","Wicklow","WK","216 Ireland WK"]
["216 Ireland Westmeath","Westmeath","WM","216 Ireland WM"]
["216 Ireland Wexford","Wexford","WX","216 Ireland WX"]
["222 Italy Agriento","Agriento","AG","222 Italy AG"]
["222 Italy Alessandria","Alessandria","AL","222 Italy AL"]
["222 Italy Ancona","Ancona","AN","222 Italy AN"]
["222 Italy Aosta","Aosta","AO","222 Italy AO"]
["222 Italy Ascoli Piceno","Ascoli Piceno","AP","222 Italy AP"]
["222 Italy L'Aquila","L'Aquila","AQ","222 Italy AQ"]
["222 Italy Arezzo","Arezzo","AR","222 Italy AR"]
["222 Italy Asti","Asti","AT","222 Italy AT"]
["222 Italy Avellino","Avellino","AV","222 Italy AV"]
["222 Italy Bari","Bari","BA","222 Italy BA"]
["222 Italy Bergamo","Bergamo","BG","222 Italy BG"]
["222 Italy Biella","Biella","BI","222 Italy BI"]
["222 Italy Belluno","Belluno","BL","222 Italy BL"]
["222 Italy Benevento","Benevento","BN","222 Italy BN"]
["222 Italy Bologna","Bologna","BO","222 Italy BO"]
["222 Italy Brescia","Brescia","BS","222 Italy BS"]
["222 Italy Bolzano","Bolzano","BZ","222 Italy BZ"]
["222 Italy Cagliari","Cagliari","CA","222 Italy CA"]
["222 Italy Campobasso","Campobasso","CB","222 Italy CB"]
["222 Italy Caserta","Caserta","CE","222 Italy CE"]
["222 Italy Chieti","Chieti","CH","222 Italy CH"]
["222 Italy Caltanisetta","Caltanisetta","CL","222 Italy CL"]
["222 Italy Cuneo","Cuneo","CN","222 Italy CN"]
["222 Italy Como","Como","CO","222 Italy CO"]
["222 Italy Cremona","Cremona","CR","222 Italy CR"]
["222 Italy Cosenza","Cosenza","CS","222 Italy CS"]
["222 Italy Catania","Catania","CT","222 Italy CT"]
["222 Italy Catanzaro","Catanzaro","CZ","222 Italy CZ"]
["222 Italy Enna","Enna","EN","222 Italy EN"]
["222 Italy Ferrara","Ferrara","FE","222 Italy FE"]
["222 Italy Foggia","Foggia","FG","222 Italy FG"]
["222 Italy Firenze","Firenze","FI","222 Italy FI"]
["222 Italy Forlì","Forlì","FO","222 Italy FO"]
["222 Italy Frosinone","Frosinone","FR","222 Italy FR"]
["222 Italy Genova","Genova","GE","222 Italy GE"]
["222 Italy Gorizia","Gorizia","GO","222 Italy GO"]
["222 Italy Grosseto","Grosseto","GR","222 Italy GR"]
["222 Italy Imperia","Imperia","IM","222 Italy IM"]
["222 Italy Isernia","Isernia","IS","222 Italy IS"]
["222 Italy Crotone","Crotone","KR","222 Italy KR"]
["222 Italy Lecco","Lecco","LC","222 Italy LC"]
["222 Italy Lecce","Lecce","LE","222 Italy LE"]
["222 Italy Livorno","Livorno","LI","222 Italy LI"]
["222 Italy Lodi","Lodi","LO","222 Italy LO"]
["222 Italy Latina","Latina","LT","222 Italy LT"]
["222 Italy Lucca","Lucca","LU","222 Italy LU"]
["222 Italy Macerata","Macerata","MC","222 Italy MC"]
["222 Italy Messina","Messina","ME","222 Italy ME"]
["222 Italy Milan","Milan","MI","222 Italy MI"]
["222 Italy Mantova","Mantova","MN","222 Italy MN"]
["222 Italy Modena","Modena","MO","222 Italy MO"]
["222 Italy Massa Carrara","Massa Carrara","MS","222 Italy MS "]
["222 Italy Matera","Matera","MT","222 Italy MT"]
["222 Italy Napoli","Napoli","NA","222 Italy NA"]
["222 Italy Novara","Novara","NO","222 Italy NO"]
["222 Italy Nuoro","Nuoro","NU","222 Italy NU"]
["222 Italy Oristano","Oristano","OR","222 Italy OR"]
["222 Italy Palermo","Palermo","PA","222 Italy PA"]
["222 Italy Piacenza","Piacenza","PC","222 Italy PC"]
["222 Italy Padova","Padova","PD","222 Italy PD"]
["222 Italy Pescara","Pescara","PE","222 Italy PE"]
["222 Italy Perugia","Perugia","PG","222 Italy PG"]
["222 Italy Pisa","Pisa","PI","222 Italy PI"]
["222 Italy Pordenone","Pordenone","PN","222 Italy PN"]
["222 Italy Prato","Prato","PO","222 Italy PO"]
["222 Italy Parma","Parma","PR","222 Italy PR"]
["222 Italy Pesaro","Pesaro","PS","222 Italy PS"]
["222 Italy Pistoia","Pistoia","PT","222 Italy PT"]
["222 Italy Pavia","Pavia","PV","222 Italy PV"]
["222 Italy Potenza","Potenza","PZ","222 Italy PZ"]
["222 Italy Ravenna","Ravenna","RA","222 Italy RA"]
["222 Italy Reggio Calabria","Reggio Calabria","RC","222 Italy RC"]
["222 Italy Ragusa","Ragusa","RE","222 Italy RE"]
["222 Italy Rieti","Rieti","RG","222 Italy RG"]
["222 Italy Rome","Rome","RI","222 Italy RI"]
["222 Italy Rimini","Rimini","RM","222 Italy RM"]
["222 Italy Rovigo","Rovigo","RN","222 Italy RN"]
["222 Italy Rovigo","Rovigo","RO","222 Italy RO"]
["222 Italy Salerno","Salerno","RV","222 Italy RV"]
["222 Italy Siena","Siena","SA","222 Italy SA"]
["222 Italy Sondrio","Sondrio","SI","222 Italy SI"]
["222 Italy La Spezia","La Spezia","SO","222 Italy SO"]
["222 Italy Siracusa","Siracusa","SP","222 Italy SP"]
["222 Italy Sassari","Sassari","SR","222 Italy SR"]
["222 Italy Savona","Savona","SS","222 Italy SS"]
["222 Italy Taranto","Taranto","SV","222 Italy SV"]
["222 Italy Teramo","Teramo","TA","222 Italy TA"]
["222 Italy Trento","Trento","TE","222 Italy TE"]
["222 Italy Turin","Turin","TN","222 Italy TN"]
["222 Italy Trapani","Trapani","TO","222 Italy TO"]
["222 Italy Terni","Terni","TP","222 Italy TP"]
["222 Italy Trieste","Trieste","TR","222 Italy TR"]
["222 Italy Treviso","Treviso","TS","222 Italy TS"]
["222 Italy Udine","Udine","TV","222 Italy TV"]
["222 Italy Varese","Varese","UD","222 Italy UD"]
["222 Italy Vercelli","Vercelli","VA","222 Italy VA"]
["222 Italy Venice","Venice","VC","222 Italy VC"]
["222 Italy Vicenza","Vicenza","VE","222 Italy VE"]
["222 Italy Verona","Verona","VI","222 Italy VI"]
["222 Italy Viterbo","Viterbo","VR","222 Italy VR"]
["222 Italy Vibo Valentia","Vibo Valentia","VT","222 Italy VT"]
["222 Italy VV Vibo Valentia","VV Vibo Valentia","VV","222 Italy VV"]
["231 Japan Hokkaido","Hokkaido","01","231 Japan 01"]
["231 Japan Aomori-ken","Aomori-ken","02","231 Japan 02"]
["231 Japan Iwate-ken","Iwate-ken","03","231 Japan 03"]
["231 Japan Miyagi-ken","Miyagi-ken","04","231 Japan 04"]
["231 Japan Akita-ken","Akita-ken","05","231 Japan 05"]
["231 Japan Yamagata-ken","Yamagata-ken","06","231 Japan 06"]
["231 Japan Fukushima-ken","Fukushima-ken","07","231 Japan 07"]
["231 Japan Ibaragi-ken","Ibaragi-ken","08","231 Japan 08"]
["231 Japan Tochigi-ken","Tochigi-ken","09","231 Japan 09"]
["231 Japan Gunma-ken","Gunma-ken",10,"231 Japan 10"]
["231 Japan Saitama-ken","Saitama-ken",11,"231 Japan 11"]
["231 Japan Chiba-ken","Chiba-ken",12,"231 Japan 12"]
["231 Japan Tokyo-to","Tokyo-to",13,"231 Japan 13"]
["231 Japan Kanagawa-ken","Kanagawa-ken",14,"231 Japan 14"]
["231 Japan Niigata-ken","Niigata-ken",15,"231 Japan 15"]
["231 Japan Toyama-ken","Toyama-ken",16,"231 Japan 16"]
["231 Japan Ishikawa-ken","Ishikawa-ken",17,"231 Japan 17"]
["231 Japan Fukui-ken","Fukui-ken",18,"231 Japan 18"]
["231 Japan Yamanashi-ken","Yamanashi-ken",19,"231 Japan 19"]
["231 Japan Nagoya-ken","Nagoya-ken",20,"231 Japan 20"]
["231 Japan Gifu-ken","Gifu-ken",21,"231 Japan 21"]
["231 Japan Shizuoka-ken","Shizuoka-ken",22,"231 Japan 22"]
["231 JapanAichi-ken","Aichi-ken",23,"231 Japan 23"]
["231 Japan Mie-ken","Mie-ken",24,"231 Japan 24"]
["231 Japan Shiga-ken","Shiga-ken",25,"231 Japan 25"]
["231 Japan Kyoto-fu","Kyoto-fu",26,"231 Japan 26"]
["231 Japan Osaka-fu","Osaka-fu",27,"231 Japan 27"]
["231 Japan Hyogo-ken","Hyogo-ken",28,"231 Japan 28"]
["231 Japan Nara-ken","Nara-ken",29,"231 Japan 29"]
["231 Japan Wakayama-ken","Wakayama-ken",30,"231 Japan 30"]
["231 JapanTottori-ken","Tottori-ken",31,"231 Japan 31"]
["231 Japan Shimana-ken","Shimana-ken",32,"231 Japan 32"]
["231 Japan Okayama-ken","Okayama-ken",33,"231 Japan 33"]
["231 Japan Hiroshima-ken","Hiroshima-ken",34,"231 Japan 34"]
["231 Japan Yamaguchi-ken","Yamaguchi-ken",35,"231 Japan 35"]
["231 Japan Tokushima-ken","Tokushima-ken",36,"231 Japan 36"]
["231 Japan Kagawa-ken","Kagawa-ken",37,"231 Japan 37"]
["231 Japan Ehima-ken","Ehima-ken",38,"231 Japan 38"]
["231 Japan Kochi-ken","Kochi-ken",39,"231 Japan 39"]
["231 Japan Fukuoka-ken","Fukuoka-ken",40,"231 Japan 40"]
["231 Japan Saga-ken","Saga-ken",41,"231 Japan 41"]
["231 Japan Nagasaki-ken","Nagasaki-ken",42,"231 Japan 42"]
["231 Japan Kumamoto-ken","Kumamoto-ken",43,"231 Japan 43"]
["231 Japan Oita-ken","Oita-ken",44,"231 Japan 44"]
["231 Japan Miyazaki-ken","Miyazaki-ken",45,"231 Japan 45"]
["231 Japan Kagoshima-ken","Kagoshima-ken",46,"231 Japan 46"]
["231 Japan Okinawa-ken","Okinawa-ken",47,"231 Japan 47"]
["270 Malaysia Johor","Johor","JOH","270 Malaysia JOH"]
["270 Malaysia Kedah","Kedah","KED","270 Malaysia KED"]
["270 Malaysia Kelantan","Kelantan","KEL","270 Malaysia KEL"]
["270 Malaysia Kuala Lumpur","Kuala Lumpur","KUL","270 Malaysia KUL"]
["270 Malaysia Labuan","Labuan","LAB","270 Malaysia LAB"]
["270 Malaysia Melaka","Melaka","MEL","270 Malaysia MEL"]
["270 Malaysia Pahang","Pahang","PAH","270 Malaysia PAH"]
["270 Malaysia Perlis","Perlis","PEL","270 Malaysia PEL"]
["270 Malaysia Perak","Perak","PER","270 Malaysia PER"]
["270 Malaysia Pulau Pinang","Pulau Pinang","PIN","270 Malaysia PIN"]
["270 Malaysia Sabah","Sabah","SAB","270 Malaysia SAB"]
["270 Malaysia Sarawak","Sarawak","SAR","270 Malaysia SAR"]
["270 Malaysia Selangor","Selangor","SEL","270 Malaysia SEL"]
["270 Malaysia Negeri Sembilan","Negeri Sembilan","SER","270 Malaysia SER"]
["270 Malaysia Trengganu","Trengganu","TRE","270 Malaysia TRE"]
["285 Mexico AGS Aguascalientes","AGS Aguascalientes","AGS","285 Mexico AGS"]
["285 Mexico BCN Baja California N","BCN Baja California N","BCN","285 Mexico BCN"]
["285 Mexico BCS Baja California S","BCS Baja California S","BCS","285 Mexico BCS"]
["285 Mexico CHI Chihuahua","CHI Chihuahua","CHI","285 Mexico CHI"]
["285 Mexico CHS Chiapas","CHS Chiapas","CHS","285 Mexico CHS"]
["285 Mexico CMP Campeche","CMP Campeche","CMP","285 Mexico CMP"]
["285 Mexico COA Coahuila","COA Coahuila","COA","285 Mexico COA"]
["285 Mexico COL Colima","COL Colima","COL","285 Mexico COL"]
["285 Mexico DF Distrito Federal","DF Distrito Federal","DF","285 Mexico DF"]
["285 Mexico DGO Durango","DGO Durango","DGO","285 Mexico DGO"]
["285 Mexico GRO Guerrero","GRO Guerrero","GRO","285 Mexico GRO"]
["285 Mexico GTO Guanajuato","GTO Guanajuato","GTO","285 Mexico GTO"]
["285 Mexico HGO Hidalgo","HGO Hidalgo","HGO","285 Mexico HGO"]
["285 Mexico JAL Jalisco","JAL Jalisco","JAL","285 Mexico JAL"]
["285 Mexico MCH Michoacán","MCH Michoacán","MCH","285 Mexico MCH"]
["285 Mexico MEX Estado de México","MEX Estado de México","MEX","285 Mexico MEX"]
["285 Mexico MOR Morelos","MOR Morelos","MOR","285 Mexico MOR"]
["285 Mexico NL Nuevo Léon","NL Nuevo Léon","NL","285 Mexico NL"]
["285 Mexico OAX Oaxaca","OAX Oaxaca","OAX","285 Mexico OAX"]
["285 Mexico PUE Puebla","PUE Puebla","PUE","285 Mexico PUE"]
["285 Mexico QR Quintana Roo","QR Quintana Roo","QR","285 Mexico QR"]
["285 Mexico QRO Querétaro","QRO Querétaro","QRO","285 Mexico QRO"]
["285 Mexico SIN Sinaloa","SIN Sinaloa","SIN","285 Mexico SIN"]
["285 Mexico SLP San Luis Potosí","SLP San Luis Potosí","SLP","285 Mexico SLP"]
["285 Mexico SON Sonora","SON Sonora","SON","285 Mexico SON"]
["285 Mexico TAB Tabasco","TAB Tabasco","TAB","285 Mexico TAB"]
["285 Mexico TLX Tlaxcala","TLX Tlaxcala","TLX","285 Mexico TLX"]
["285 Mexico TMS Tamaulipas","TMS Tamaulipas","TMS","285 Mexico TMS"]
["285 Mexico VER Veracruz","VER Veracruz","VER","285 Mexico VER"]
["285 Mexico YUC Yucatán","YUC Yucatán","YUC","285 Mexico YUC"]
["285 Mexico ZAC Zacatecas","ZAC Zacatecas","ZAC","285 Mexico ZAC"]
["300 Netherlands Drenthe","Drenthe","DR","300 Netherlands DR"]
["300 Netherlands Flevopolder","Flevopolder","FL","300 Netherlands FL"]
["300 Netherlands Friesland","Friesland","FR","300 Netherlands FR"]
["300 Netherlands Gelderland","Gelderland","GE","300 Netherlands GE"]
["300 Netherlands Groningen","Groningen","GR","300 Netherlands GR"]
["300 Netherlands Limburg","Limburg","LI","300 Netherlands LI"]
["300 Netherlands Noord-Brabant","Noord-Brabant","NB","300 Netherlands NB"]
["300 Netherlands Noord-Holland","Noord-Holland","NH","300 Netherlands NH"]
["300 Netherlands Overijssel","Overijssel","OV","300 Netherlands OV"]
["300 Netherlands Utrecht","Utrecht","UT","300 Netherlands UT"]
["300 Netherlands Zeeland","Zeeland","ZE","300 Netherlands ZE"]
["300 Netherlands Zuid-Holland","Zuid-Holland","ZH","300 Netherlands ZH"]
["309 New Zealand North Island","North Island","NI","309 New Zealand NI"]
["309 New Zealand South Island","South Island","SI","309 New Zealand SI"]
["324 Norway Østfold Fylke","Østfold Fylke","01","324 Norway 01"]
["324 Norway Akershus Fylke","Akershus Fylke","02","324 Norway 02"]
["324 Norway Oslo","Oslo","03","324 Norway 03"]
["324 Norway Hedmark Fylke","Hedmark Fylke","04","324 Norway 04"]
["324 Norway Oppland Fylke","Oppland Fylke","05","324 Norway 05"]
["324 Norway Buskerud Fylke","Buskerud Fylke","06","324 Norway 06"]
["324 Norway Vestfold Fylke","Vestfold Fylke","07","324 Norway 07"]
["324 Norway Telemark Fylke","Telemark Fylke","08","324 Norway 08"]
["324 Norway Aust-Agder Fylke","Aust-Agder Fylke","09","324 Norway 09"]
["324 Norway Vest-Agder Fylke","Vest-Agder Fylke",10,"324 Norway 10"]
["324 Norway Rogaland Fylke","Rogaland Fylke",11,"324 Norway 11"]
["324 Norway Hordaland Fylke","Hordaland Fylke",12,"324 Norway 12"]
["324 Norway Sogn og Fjordane F.","Sogn og Fjordane F.",14,"324 Norway 14"]
["324 Norway Møre og Romsdal F.","Møre og Romsdal F.",15,"324 Norway 15"]
["324 Norway Sør-Trøndelag Fylke","Sør-Trøndelag Fylke",16,"324 Norway 16"]
["324 Norway Nord-Trøndelag Fylke","Nord-Trøndelag Fylke",17,"324 Norway 17"]
["324 Norway Nordland Fylke","Nordland Fylke",18,"324 Norway 18"]
["324 Norway Troms Fylke","Troms Fylke",19,"324 Norway 19"]
["324 Norway Finnmark Fylke","Finnmark Fylke",20,"324 Norway 20"]
["324 Norway Svalbard","Svalbard",21,"324 Norway 21"]
["348 Portugal Minho-Lima","Minho-Lima",10,"348 Portugal 10"]
["348 Portugal Cávado","Cávado",11,"348 Portugal 11"]
["348 Portugal Ave","Ave",12,"348 Portugal 12"]
["348 Portugal Grande Porto","Grande Porto",13,"348 Portugal 13"]
["348 Portugal Tâmega","Tâmega",14,"348 Portugal 14"]
["348 Portugal Entre Douro e Vouga","Entre Douro e Vouga",15,"348 Portugal 15"]
["348 Portugal Douro","Douro",16,"348 Portugal 16"]
["348 Portugal Alto Trás-os-Montes","Alto Trás-os-Montes",17,"348 Portugal 17"]
["348 Portugal Baixo Vouga","Baixo Vouga",20,"348 Portugal 20"]
["348 Portugal Baixo Mondego","Baixo Mondego",21,"348 Portugal 21"]
["348 Portugal Pinhal Litoral","Pinhal Litoral",22,"348 Portugal 22"]
["348 Portugal Pinhal Interior N.","Pinhal Interior N.",23,"348 Portugal 23"]
["348 Portugal Pinhal Interior Sul","Pinhal Interior Sul",24,"348 Portugal 24"]
["348 Portugal Dão-Lafoes","Dão-Lafoes",25,"348 Portugal 25"]
["348 Portugal Serra da Estrela","Serra da Estrela",26,"348 Portugal 26"]
["348 Portugal Beira Interior Norte","Beira Interior Norte",27,"348 Portugal 27"]
["348 Portugal Beira Interior Sul","Beira Interior Sul",28,"348 Portugal 28"]
["348 Portugal Cova da Beira","Cova da Beira",29,"348 Portugal 29"]
["348 Portugal Oeste","Oeste",30,"348 Portugal 30"]
["348 Portugal Grande Lisboa","Grande Lisboa",31,"348 Portugal 31"]
["348 Portugal Península de Setúbal","Península de Setúbal",32,"348 Portugal 32"]
["348 Portugal Médio Tejo","Médio Tejo",33,"348 Portugal 33"]
["348 PortugalLezíria do Tejo","Lezíria do Tejo",34,"348 Portugal 34"]
["348 Portugal Alentejo Litoral","Alentejo Litoral",40,"348 Portugal 40"]
["348 Portugal Alto Alentejo","Alto Alentejo",41,"348 Portugal 41"]
["348 Portugal Alentejo Central","Alentejo Central",42,"348 Portugal 42"]
["348 Portugal Baixo Alentejo","Baixo Alentejo",43,"348 Portugal 43"]
["348 Portugal Algarve","Algarve",50,"348 Portugal 50"]
["348 Portugal Reg. Aut. dos Açores","Reg. Aut. dos Açores",60,"348 Portugal 60"]
["348 Portugal Reg. Aut. da Madeira","Reg. Aut. da Madeira",70,"348 Portugal 70"]
["391 Singapore SG-east","SG-east","SE","391 Singapore SE"]
["391 Singapore SG-north","SG-north","SN","391 Singapore SN"]
["391 Singapore SG-south","SG-south","SS","391 Singapore SS"]
["391 Singapore SG-west","SG-west","SW","391 Singapore SW"]
["399 Spain Alava","Alava","01","399 Spain 01"]
["399 Spain Albacete","Albacete","02","399 Spain 02"]
["399 Spain Alicante","Alicante","03","399 Spain 03"]
["399 Spain Almeria","Almeria","04","399 Spain 04"]
["399 Spain Avila","Avila","05","399 Spain 05"]
["399 Spain Badajoz","Badajoz","06","399 Spain 06"]
["399 Spain Baleares","Baleares","07","399 Spain 07"]
["399 Spain Barcelona","Barcelona","08","399 Spain 08"]
["399 Spain Burgos","Burgos","09","399 Spain 09"]
["399 Spain Caceres","Caceres",10,"399 Spain 10"]
["399 Spain Cadiz","Cadiz",11,"399 Spain 11"]
["399 Spain Castellon","Castellon",12,"399 Spain 12"]
["399 Spain Ciudad Real","Ciudad Real",13,"399 Spain 13"]
["399 Spain Cordoba","Cordoba",14,"399 Spain 14"]
["399 Spain La Coruña","La Coruña",15,"399 Spain 15"]
["399 Spain Cuenca","Cuenca",16,"399 Spain 16"]
["399 Spain Gerona","Gerona",17,"399 Spain 17"]
["399 Spain Granada","Granada",18,"399 Spain 18"]
["399 Spain Guadalajara","Guadalajara",19,"399 Spain 19"]
["399 Spain Guipuzcoa","Guipuzcoa",20,"399 Spain 20"]
["399 Spain Huelva","Huelva",21,"399 Spain 21"]
["399 Spain Huesca","Huesca",22,"399 Spain 22"]
["399 Spain Jaen","Jaen",23,"399 Spain 23"]
["399 Spain Leon","Leon",24,"399 Spain 24"]
["399 Spain Lerida","Lerida",25,"399 Spain 25"]
["399 Spain La Rioja","La Rioja",26,"399 Spain 26"]
["399 Spain Lugo","Lugo",27,"399 Spain 27"]
["399 Spain Madrid","Madrid",28,"399 Spain 28"]
["399 Spain Malaga","Malaga",29,"399 Spain 29"]
["399 Spain Murcia","Murcia",30,"399 Spain 30"]
["399 Spain Navarra","Navarra",31,"399 Spain 31"]
["399 Spain Orense","Orense",32,"399 Spain 32"]
["399 Spain Asturias","Asturias",33,"399 Spain 33"]
["399 Spain Palencia","Palencia",34,"399 Spain 34"]
["399 Spain Las Palmas","Las Palmas",35,"399 Spain 35"]
["399 Spain Pontevedra","Pontevedra",36,"399 Spain 36"]
["399 Spain Salamanca","Salamanca",37,"399 Spain 37"]
["399 Spain Sta. Cruz Tenerife","Sta. Cruz Tenerife",38,"399 Spain 38"]
["399 SpainCantabria","Cantabria",39,"399 Spain 39"]
["399 Spain Segovia","Segovia",40,"399 Spain 40"]
["399 Spain Sevilla","Sevilla",41,"399 Spain 41"]
["399 Spain Soria","Soria",42,"399 Spain 42"]
["399 Spain Tarragona","Tarragona",43,"399 Spain 43"]
["399 Spain Teruel","Teruel",44,"399 Spain 44"]
["399 Spain Toledo","Toledo",45,"399 Spain 45"]
["399 Spain Valencia","Valencia",46,"399 Spain 46"]
["399 Spain Valladolid","Valladolid",47,"399 Spain 47"]
["399 Spain Vizcaya","Vizcaya",48,"399 Spain 48"]
["399 Spain Zamora","Zamora",49,"399 Spain 49"]
["399 Spain Zaragoza","Zaragoza",50,"399 Spain 50"]
["453 United Kingdom Armagh","Armagh","AM","453 United Kingdom AM"]
["453 United Kingdom Antrim","Antrim","AT","453 United Kingdom AT"]
["453 United Kingdom Avon","Avon","AV","453 United Kingdom AV"]
["453 United Kingdom Bedfordshire","Bedfordshire","BE","453 United Kingdom BE"]
["453 United Kingdom Berkshire","Berkshire","BK","453 United Kingdom BK"]
["453 United Kingdom Borders","Borders","BO","453 United Kingdom BO"]
["453 United Kingdom Buckinghamshire","Buckinghamshire","BU","453 United Kingdom BU"]
["453 United Kingdom Cambridgeshire","Cambridgeshire","CA","453 United Kingdom CA"]
["453 United Kingdom Central","Central","CE","453 United Kingdom CE"]
["453 United Kingdom Cheshire","Cheshire","CH","453 United Kingdom CH"]
["453 United Kingdom Clwyd","Clwyd","CL","453 United Kingdom CL"]
["453 United Kingdom Cornwall","Cornwall","CO","453 United Kingdom CO"]
["453 United Kingdom Cumbria","Cumbria","CU","453 United Kingdom CU"]
["453 United Kingdom Cleveland","Cleveland","CV","453 United Kingdom CV"]
["453 United Kingdom Derbyshire","Derbyshire","DB","453 United Kingdom DB"]
["453 United Kingdom Cambridgeshire","Cambridgeshire","DF","453 United Kingdom DF"]
["453 United Kingdom Down","Down","DN","453 United Kingdom DN"]
["453 United Kingdom Dorset","Dorset","DO","453 United Kingdom DO"]
["453 United Kingdom Durham","Durham","DU","453 United Kingdom DU"]
["453 United Kingdom Devon","Devon","DV","453 United Kingdom DV"]
["453 United Kingdom Dyfed","Dyfed","DY","453 United Kingdom DY"]
["453 United Kingdom Essex","Essex","ES","453 United Kingdom ES"]
["453 United Kingdom Fife","Fife","FI","453 United Kingdom FI"]
["453 United Kingdom Fermanagh","Fermanagh","FM","453 United Kingdom FM"]
["453 United Kingdom Gloucestershire","Gloucestershire","GL","453 United Kingdom GL"]
["453 United Kingdom Greater Manchester","Greater Manchester","GM","453 United Kingdom GM"]
["453 United Kingdom Grampian","Grampian","GR","453 United Kingdom GR"]
["453 United Kingdom Gwent","Gwent","GW","453 United Kingdom GW"]
["453 United Kingdom Gwynedd","Gwynedd","GY","453 United Kingdom GY"]
["453 United Kingdom Hampshire","Hampshire","HA","453 United Kingdom HA"]
["453 United Kingdom Highland","Highland","HI","453 United Kingdom HI"]
["453 United Kingdom Hertfordshire","Hertfordshire","HT","453 United Kingdom HT"]
["453 United Kingdom Humberside","Humberside","HU","453 United Kingdom HU"]
["453 United Kingdom Herefd. and Worcest.","Herefd. and Worcest.","HW","453 United Kingdom HW"]
["453 United Kingdom Isle of Man","Isle of Man","IM","453 United Kingdom IM"]
["453 United Kingdom Isle of Wight","Isle of Wight","IW","453 United Kingdom IW"]
["453 United Kingdom Kent","Kent","KE","453 United Kingdom KE"]
["453 United Kingdom Lancashire","Lancashire","LA","453 United Kingdom LA"]
["453 United Kingdom Londonderry","Londonderry","LD","453 United Kingdom LD"]
["453 United Kingdom Leicestershire","Leicestershire","LE","453 United Kingdom LE"]
["453 United Kingdom Lincolnshire","Lincolnshire","LI","453 United Kingdom LI"]
["453 United Kingdom Greater London","Greater London","LO","453 United Kingdom LO"]
["453 United Kingdom Lothian","Lothian","LT","453 United Kingdom LT"]
["453 United Kingdom Mid Glamorgan","Mid Glamorgan","MG","453 United Kingdom MG"]
["453 United Kingdom Merseyside","Merseyside","MY","453 United Kingdom MY"]
["453 United Kingdom Northamptonshire","Northamptonshire","NH","453 United Kingdom NH"]
["453 United Kingdom Norfolk","Norfolk","NK","453 United Kingdom NK"]
["453 United Kingdom Nottinghamshire","Nottinghamshire","NT","453 United Kingdom NT"]
["453 United Kingdom Northumberland","Northumberland","NU","453 United Kingdom NU"]
["453 United Kingdom Oxfordshire","Oxfordshire","OX","453 United Kingdom OX"]
["453 United Kingdom Powys","Powys","PO","453 United Kingdom PO"]
["453 United Kingdom Strathclyde","Strathclyde","SC","453 United Kingdom SC"]
["453 United Kingdom South Glamorgan","South Glamorgan","SG","453 United Kingdom SG"]
["453 United Kingdom Shropshire","Shropshire","SH","453 United Kingdom SH"]
["453 United Kingdom Suffolk","Suffolk","SK","453 United Kingdom SK"]
["453 United Kingdom Somerset","Somerset","SO","453 United Kingdom SO"]
["453 United Kingdom Staffordshire","Staffordshire","ST","453 United Kingdom ST"]
["453 United Kingdom Suffolk","Suffolk","SU","453 United Kingdom SU"]
["453 United Kingdom Sussex","Sussex","SX","453 United Kingdom SX"]
["453 United Kingdom Surrey","Surrey","SY","453 United Kingdom SY"]
["453 United Kingdom Tayside","Tayside","TA","453 United Kingdom TA"]
["453 United Kingdom Tyne and Wear","Tyne and Wear","TW","453 United Kingdom TW"]
["453 United Kingdom Tyrone","Tyrone","TY","453 United Kingdom TY"]
["453 United Kingdom Warwickshire","Warwickshire","WA","453 United Kingdom WA"]
["453 United Kingdom West Glamorgan","West Glamorgan","WG","453 United Kingdom WG"]
["453 United Kingdom Wiltshire","Wiltshire","WI","453 United Kingdom WI"]
["453 United Kingdom West Midlands","West Midlands","WM","453 United Kingdom WM"]
["453 United Kingdom Worcestershire","Worcestershire","WO","453 United Kingdom WO"]
["453 United Kingdom Yorkshire","Yorkshire","YK","453 United Kingdom YK"]
["453 United Kingdom North Yorkshire","North Yorkshire","YN","453 United Kingdom YN"]
["453 United Kingdom South Yorkshire","South Yorkshire","YS","453 United Kingdom YS"]
["453 United Kingdom West Yorkshire","West Yorkshire","YW","453 United Kingdom YW"]
["456 USA Alaska","Alaska","AK","456 USA AK"]
["456 USA Alabama","Alabama","AL","456 USA AL"]
["456 USA Arkansas","Arkansas","AR","456 USA AR"]
["456 USA American Samoa","American Samoa","AS","456 USA AS"]
["456 USA Arizona","Arizona","AZ","456 USA AZ"]
["456 USA California","California","CA","456 USA CA"]
["456 USA Colorado","Colorado","CO","456 USA CO"]
["456 USA Connecticut","Connecticut","CT","456 USA CT"]
["456 USA District of Columbia","District of Columbia","DC","456 USA DC"]
["456 USA Delaware","Delaware","DE","456 USA DE"]
["456 USA Florida","Florida","FL","456 USA FL"]
["456 USA Georgia","Georgia","GA","456 USA GA"]
["456 USA Guam","Guam","GU","456 USA GU"]
["456 USA Hawaii","Hawaii","HI","456 USA HI"]
["456 USA Iowa","Iowa","IA","456 USA IA"]
["456 USA Idaho","Idaho","ID","456 USA ID"]
["456 USA Illinois","Illinois","IL","456 USA IL"]
["456 USA Indiana","Indiana","IN","456 USA IN"]
["456 USA Kansas","Kansas","KS","456 USA KS"]
["456 USA Kentucky","Kentucky","KY","456 USA KY"]
["456 USA Louisiana","Louisiana","LA","456 USA LA"]
["456 USA Massachusetts","Massachusetts","MA","456 USA MA"]
["456 USA Maryland","Maryland","MD","456 USA MD"]
["456 USA Maine","Maine","ME","456 USA ME"]
["456 USA Michigan","Michigan","MI","456 USA MI"]
["456 USA Minnesota","Minnesota","MN","456 USA MN"]
["456 USA Missouri","Missouri","MO","456 USA MO"]
["456 USA Northern Mariana Isl","Northern Mariana Isl","MP","456 USA MP"]
["456 USA Mississippi","Mississippi","MS","456 USA MS"]
["456 USA Montana","Montana","MT","456 USA MT"]
["456 USA North Carolina","North Carolina","NC","456 USA NC"]
["456 USA North Dakota","North Dakota","ND","456 USA ND"]
["456 USA Nebraska","Nebraska","NE","456 USA NE"]
["456 USA New Hampshire","New Hampshire","NH","456 USA NH"]
["456 USA New Jersey","New Jersey","NJ","456 USA NJ"]
["456 USA New Mexico","New Mexico","NM","456 USA NM"]
["456 USA Nevada","Nevada","NV","456 USA NV"]
["456 USA New York","New York","NY","456 USA NY"]
["456 USA Ohio","Ohio","OH","456 USA OH"]
["456 USA Oklahoma","Oklahoma","OK","456 USA OK"]
["456 USA Oregon","Oregon","OR","456 USA OR"]
["456 USA Pennsylvania","Pennsylvania","PA","456 USA PA"]
["456 USA Puerto Rico","Puerto Rico","PR","456 USA PR"]
["456 USA Rhode Island","Rhode Island","RI","456 USA RI"]
["456 USA South Carolina","South Carolina","SC","456 USA SC"]
["456 USA South Dakota","South Dakota","SD","456 USA SD"]
["456 USA Tennessee","Tennessee","TN","456 USA TN"]
["456 USA Texas","Texas","TX","456 USA TX"]
["456 USA Utah","Utah","UT","456 USA UT"]
["456 USA Virginia","Virginia","VA","456 USA VA"]
["456 USA Virgin Islands","Virgin Islands","VI","456 USA VI"]
["456 USA Vermont","Vermont","VT","456 USA VT"]
["456 USA Washington","Washington","WA","456 USA WA"]
["456 USA Wisconsin","Wisconsin","WI","456 USA WI"]
["456 USA West Virginia","West Virginia","WV","456 USA WV"]
["456 USA Wyoming","Wyoming","WY","456 USA WY"]
["525 Germany Schleswig-Holstein","Schleswig-Holstein","01","525 Germany 01"]
["525 Germany Hamburg","Hamburg","02","525 Germany 02"]
["525 Germany Lower Saxony","Lower Saxony","03","525 Germany 03"]
["525 Germany Bremen","Bremen","04","525 Germany 04"]
["525 Germany Nrth Rhine Westfalia","Nrth Rhine Westfalia","05","525 Germany 05"]
["525 Germany Hesse","Hesse","06","525 Germany 06"]
["525 Germany Rhineland Palatinate","Rhineland Palatinate","07","525 Germany 07"]
["525 Germany Baden-Wurttemberg","Baden-Wurttemberg","08","525 Germany 08"]
["525 Germany Bavaria","Bavaria","09","525 Germany 09"]
["525 Germany Saarland","Saarland",10,"525 Germany 10"]
["525 Germany Berlin","Berlin",11,"525 Germany 11"]
["525 Germany Brandenburg","Brandenburg",12,"525 Germany 12"]
["525 Germany Mecklenburg-Vorpomm.","Mecklenburg-Vorpomm.",13,"525 Germany 13"]
["525 Germany Saxony","Saxony",14,"525 Germany 14"]
["525 Germany Saxen-Anhalt","Saxen-Anhalt",15,"525 Germany 15"]
["525 Germany Thueringen","Thueringen",16,"525 Germany 16"]
["575 Switzerland Aargau","Aargau","AG","575 Switzerland AG"]
["575 Switzerland Appenzell Innerrh","Appenzell Innerrh","AI","575 Switzerland AI"]
["575 Switzerland Appenzell Ausserrh.","Appenzell Ausserrh.","AR","575 Switzerland AR"]
["575 Switzerland Bern","Bern","BE","575 Switzerland BE"]
["575 Switzerland Basel Land","Basel Land","BL","575 Switzerland BL"]
["575 Switzerland Basel Stadt","Basel Stadt","BS","575 Switzerland BS"]
["575 Switzerland Fribourg","Fribourg","FR","575 Switzerland FR"]
["575 Switzerland Geneva","Geneva","GE","575 Switzerland GE"]
["575 Switzerland Glarus","Glarus","GL","575 Switzerland GL"]
["575 Switzerland Graubuenden","Graubuenden","GR","575 Switzerland GR"]
["575 Switzerland Jura","Jura","JU","575 Switzerland JU"]
["575 Switzerland Lucerne","Lucerne","LU","575 Switzerland LU"]
["575 Switzerland Neuchatel","Neuchatel","NE","575 Switzerland NE"]
["575 Switzerland Nidwalden","Nidwalden","NW","575 Switzerland NW"]
["575 Switzerland Obwalden","Obwalden","OW","575 Switzerland OW"]
["575 Switzerland St. Gallen","St. Gallen","SG","575 Switzerland SG"]
["575 Switzerland Schaffhausen","Schaffhausen","SH","575 Switzerland SH"]
["575 Switzerland Solothurn","Solothurn","SO","575 Switzerland SO"]
["575 Switzerland Switzerland","Switzerland","SZ","575 Switzerland SZ"]
["575 Switzerland Thurgau","Thurgau","TG","575 Switzerland TG"]
["575 Switzerland Ticino","Ticino","TI","575 Switzerland TI"]
["575 Switzerland Uri","Uri","UR","575 Switzerland UR"]
["575 Switzerland Vaud","Vaud","VD","575 Switzerland VD"]
["575 Switzerland Valais","Valais","VS","575 Switzerland VS"]
["575 Switzerland Zug","Zug","ZG","575 Switzerland ZG"]
["575 Switzerland Zurich","Zurich","ZH","575 Switzerland ZH"]

{"sheet":"Tax_Number","index":6,"n_rows":257,"n_cols":21,"rows_kept":257,"cut":false,"hidden":true,"merged":[]}
["Country Key (3 digits)","Permitted Length for Tax Number 1","Check rule for tax code 1",null,"Mandatory_countries",{"$nulls":10},"Check Rule for Postal Code","Short Description","Status","No space","No letter","Special"]
["000","0",0,null,"024 Argentina",{"$nulls":10},1,"Maximum value length, without gaps",null,"X"]
["001","0",0,null,"054 Brazil",{"$nulls":10},2,"Maximum value length, numerical, without gaps",null,"X","X"]
["004","0",0,null,"084 Chile",{"$nulls":10},3,"Length to be kept to exactly, without gaps",null,"X"]
["006","0",0,null,"093 Colombia",{"$nulls":10},4,"Length to be kept to exactly, numerical, without gaps",null,"X","X"]
["009","0",0,null,"102 Costa Rica",{"$nulls":10},5,"Maximum value length"]
["012","0",0,null,"126 Dominican Rep."]
["024","0",0,null,"135 Ecuador"]
["025","0",0,null,"168 Guatemala"]
["026","0",0,null,"183 Haiti"]
["027","16","5",null,"186 Honduras"]
["030","7","2",null,"228 Jamaica",{"$nulls":9},"TEST"]
["031","0",0,null,"285 Mexico"]
["042","0",0,null,"312 Nicaragua"]
["048","0",0,null,"333 Panama"]
["049","0",0,null,"339 Peru"]
["051","0",0,null,"462 Uruguay"]
["052","0",0]
["053","0",0]
["054","0",0]
["057","0",0]
["060","0",0]
["061","0",0]
["063","0",0]
["066","0",0]
["069","0",0]
["071","0",0]
["072","10","5"]
["075","0",0]
["078","0",0]
["081","0",0]
["084","0",0]
["086","15","5"]
["093","0",0]
["099","0",0]
["102","0",0]
["103","0",0]
["105","0",0]
["111","0",0]
["113","0",0]
["117","0",0]
["120","7","2"]
["126","0",0]
["135","0",0]
["138","0",0]
["139","0",0]
["140","0",0]
["141","0",0]
["142","0",0]
["143","0",0]
["144","0",0]
["147","0",0]
["153","0",0]
["156","0",0]
["160","0",0]
["162","0",0]
["163","0",0]
["165","0",0]
["168","0",0]
["177","0",0]
["180","0",0]
["183","0",0]
["186","0",0]
["195","0",0]
["198","0",0]
["204","0",0]
["207","0",0]
["210","0",0]
["213","0",0]
["216","0",0]
["219","0",0]
["222","16","1"]
["225","0",0]
["228","0",0]
["231","0",0]
["234","0",0]
["239","0",0]
["240","0",0]
["243","0",0]
["245","0",0]
["246","0",0]
["247","0",0]
["249","0",0]
["252","0",0]
["255","0",0]
["258","0",0]
["260","0",0]
["264","0",0]
["266","0",0]
["267","0",0]
["269","0",0]
["270","0",0]
["274","0",0]
["276","0",0]
["279","0",0]
["282","0",0]
["283","0",0]
["285","13","1"]
["288","0",0]
["291","0",0]
["297","0",0]
["300","0",0]
["309","0",0]
["312","0",0]
["318","0",0]
["321","0",0]
["324","0",0]
["330","0",0]
["333","0",0]
["336","0",0]
["338","0",0]
["339","0",0]
["342","0",0]
["345","0",0]
["348","9","4"]
["366","0",0]
["370","0",0]
["375","0",0]
["378","0",0]
["381","0",0]
["390","0",0]
["391","16","5"]
["392","0",0]
["393","0",0]
["394","0",0]
["395","0",0]
["399","9","3"]
["402","0",0]
["403","0",0]
["404","0",0]
["411","0",0]
["414","0",0]
["415","0",0]
["420","0",0]
["423","0",0]
["429","0",0]
["432","0",0]
["435","0",0]
["436","0",0]
["438","0",0]
["441","0",0]
["449","0",0]
["450","0",0]
["453","0",0]
["455","0",0]
["456","11","5"]
["459","0",0]
["462","0",0]
["463","0",0]
["471","0",0]
["492","0",0]
["495","0",0]
["498","0",0]
["499","0",0]
["505","0",0]
["507","0",0]
["515","0",0]
["520","0",0]
["525","0",0]
["535","0",0]
["555","0",0]
["564","0",0]
["565","0",0]
["567","0",0]
["570","0",0]
["575","7","2"]
["590","0",0]
["601","0",0]
["602","0",0]
["603","0",0]
["604","0",0]
["605","0",0]
["610","0",0]
["611","0",0]
["612","0",0]
["615","0",0]
["616","0",0]
["617","0",0]
["618","0",0]
["620","0",0]
["623","0",0]
["624","0",0]
["625","0",0]
["626","0",0]
["627","0",0]
["628","0",0]
["629","0",0]
["630","0",0]
["631","0",0]
["634","0",0]
["635","0",0]
["636","0",0]
["640","0",0]
["645","0",0]
["648","0",0]
["649","0",0]
["655","0",0]
["656","0",0]
["660","0",0]
["661","0",0]
["662","0",0]
["663","0",0]
["664","0",0]
["665","0",0]
["666","0",0]
["667","0",0]
["668","0",0]
["669","0",0]
["672","0",0]
["678","0",0]
["679","0",0]
["680","0",0]
["681","0",0]
["682","0",0]
["683","0",0]
["685","0",0]
["688","0",0]
["689","0",0]
["690","0",0]
["691","0",0]
["692","0",0]
["693","0",0]
["695","0",0]
["696","0",0]
["697","0",0]
["698","0",0]
["700","0",0]
["701","0",0]
["705","0",0]
["706","0",0]
["891","0",0]
["895","0",0]
["897","0",0]
["999","0",0]
["AT","0",0]
["BE","0",0]
["CH","0",0]
["CN","0",0]
["DE","0",0]
["DK","0",0]
["ES","0",0]
["FI","0",0]
["FR","0",0]
["GB","0",0]
["ID","0",0]
["IE","0",0]
["IT","0",0]
["JP","0",0]
["LU","0",0]
["MC","0",0]
["NL","0",0]
["NO","0",0]
["RO","0",0]
["RU","0",0]
["SE","0",0]
["UN","0",0]
["… S","0",0]

{"sheet":"Bank_key","index":7,"n_rows":230,"n_cols":7,"rows_kept":230,"cut":false,"hidden":true,"merged":[]}
["Bank_Country","Local_Payment","Int_Payment","Is_IBAN_country?","Bank_Country","Local _Currency","Local _Currency_2"]
["… Select","Bank key","Bank key","-","… Select","… Select"]
["001 Greenland","SWIFT Code","SWIFT Code","YES*","001 Greenland","DKK Danish Krone"]
["004 Guam","SWIFT Code","SWIFT Code","NO","004 Guam","USD US Dollar"]
["006 Afghanistan","SWIFT Code","SWIFT Code","NO","006 Afghanistan","AFN Afghani"]
["009 Albania","Bank key","SWIFT Code","YES*","009 Albania","ALL Albanian Lek(e)"]
["012 Algeria","Local Branch code","SWIFT Code","YES","012 Algeria","DZD Algerian Dinar"]
["024 Argentina","Routing number (first 7 digits of CBU)","SWIFT Code (enter 22 digit CBU in account number)","NO","024 Argentina","ARS Argentine Peso"]
["025 Aruba","SWIFT Code","SWIFT Code","NO","025 Aruba","AWG Aruban Guilder"]
["026 Armenia","SWIFT Code","SWIFT Code","NO","026 Armenia","AMD Armenian Dram"]
["027 Australia","SWIFT Code (insert BSB code in front of account number)","SWIFT Code (insert BSB code in front of account number)","NO","027 Australia","AUD Australian Dollar"]
["030 Austria","SWIFT Code","SWIFT Code","YES*","030 Austria","EUR Euro"]
["031 Azerbaijan","Bank key","SWIFT Code","YES*","031 Azerbaijan","AZN New Azerbaijan Manat"]
["042 Barbados","Local Branch code","SWIFT Code","NO","042 Barbados","BBD Barbados Dollar"]
["048 Belgium","SWIFT Code","SWIFT Code","YES*","048 Belgium","EUR Euro"]
["049 Bhutan","Bank key","SWIFT Code","NO","049 Bhutan","INR Indian Rupee"]
["051 Bolivia","SWIFT Code","SWIFT Code","NO","051 Bolivia","BOB Boliviano"]
["052 Botswana","Local Branch code (6 digit)","SWIFT Code","NO","052 Botswana","BWP Botswana Pula"]
["053 Bosnia-Herz.","SWIFT Code","SWIFT Code","YES","053 Bosnia-Herz.","BAM Bosnia-Herzegovina Mark"]
["054 Brazil","Local Branch code (7 digit)","SWIFT Code","YES","054 Brazil","BRL Brazilian Real"]
["057 Bulgaria","SWIFT Code","SWIFT Code","YES","057 Bulgaria","BGN Bulgarian Lev(a)"]
["060 Myanmar","SWIFT Code","SWIFT Code","YES","060 Myanmar","MMK Myanmar Kyat"]
["061 Burundi","SWIFT Code","SWIFT Code","YES","061 Burundi","BIF Burundi Franc"]
["063 Belarus","SWIFT Code","SWIFT Code","YES","063 Belarus","BYN New Belarusian Ruble"]
["066 Cambodia","SWIFT Code","SWIFT Code","YES","066 Cambodia","KHR Cambodian Riel"]
["069 Cameroon","SWIFT Code","SWIFT Code","YES*","069 Cameroon","XAF C.F.A. Franc (BEAC)"]
["071 Canary Islands","Bank key","SWIFT Code","NO","071 Canary Islands","EUR Euro"]
["072 Canada","SWIFT Code (insert 8 digit transit number in front of account number)","SWIFT Code (insert 8 digit transit number in front of account number)","NO","072 Canada","CAD Canadian Dollar"]
["075 Central Afr.Rep","SWIFT Code","SWIFT Code","YES","075 Central Afr.Rep","XAF C.F.A. Franc (BEAC)"]
["078 Sri Lanka","Local Branch code (7 digit)","SWIFT Code","NO","078 Sri Lanka","LKR Sri Lankan Rupee"]
["081 Chad","SWIFT Code","SWIFT Code","DO NOT USE","081 Chad","XAF C.F.A. Franc (BEAC)"]
["084 Chile","SWIFT Code","SWIFT Code","NO","084 Chile","CLP Chilean Peso"]
["086 China","Branch specific SWIFT or CNAPS code","SWIFT Code","NO","086 China","CNY Chinese Yuan Renminbi"]
["093 Colombia","SWIFT Code","SWIFT Code","NO","093 Colombia","COP Colombian Peso"]
["099 Congo, Dem. Rep","SWIFT Code","SWIFT Code","NO","099 Congo, Dem. Rep","USD US Dollar"]
["102 Costa Rica","SWIFT Code","SWIFT Code","YES","102 Costa Rica","CRC Costa Rica Colon"]
["103 Croatia","SWIFT Code","SWIFT Code","YES*","103 Croatia","HRK Croatian Kuna"]
["105 Cuba","SWIFT Code","SWIFT Code","NO","105 Cuba","CUC Cuban Peso"]
["111 Cyprus","SWIFT Code","SWIFT Code","YES*","111 Cyprus","EUR Euro"]
["113 Czech Republic","SWIFT Code","SWIFT Code","YES*","113 Czech Republic","CZK Czech Koruna"]
["117 Benin","SWIFT Code","SWIFT Code","DO NOT USE","117 Benin","XOF C.F.A. Franc (BCEAO)"]
["120 Denmark","SWIFT Code","SWIFT Code","YES*","120 Denmark","DKK Danish Krone"]
["126 Dominican Rep.","SWIFT Code","SWIFT Code","DO NOT USE","126 Dominican Rep.","DOP Dominican Peso"]
["135 Ecuador","SWIFT Code","SWIFT Code","NO","135 Ecuador","USD US Dollar"]
["138 El Salvador","SWIFT Code","SWIFT Code","YES","138 El Salvador","USD US Dollar"]
["139 Equatorial Guin","SWIFT Code","SWIFT Code","YES","139 Equatorial Guin","XAF C.F.A. Franc (BEAC)"]
["140 Estonia","SWIFT Code","SWIFT Code","YES*","140 Estonia","EUR Euro"]
["141 Ethiopia","Local Branch code or name of branch","SWIFT Code","NO","141 Ethiopia","ETB Ethiopian Birr"]
["142 Eritrea","Local Branch code or name of branch","SWIFT Code","NO","142 Eritrea","ERN Eritrean Nakfa"]
["143 Fiji","SWIFT Code","SWIFT Code","NO","143 Fiji","FJD Fiji Dollar"]
["144 Finland","SWIFT Code","SWIFT Code","YES*","144 Finland","EUR Euro"]
["147 France","SWIFT Code","Head office SWIFT Code (BIC + 'XXX')","YES*","147 France","EUR Euro"]
["153 Gabon","SWIFT Code","SWIFT Code","YES","153 Gabon","XAF C.F.A. Franc (BEAC)"]
["156 Gambia","Local Branch code (6 digit)","SWIFT Code","NO","156 Gambia","GMD Gambian Dalasi"]
["160 Georgia","Bank key","SWIFT Code","YES*","160 Georgia","GEL Georgian Lari"]
["162 Ghana","Local Branch code (6 digit)","SWIFT Code","NO","162 Ghana","GHS Ghana Cedi (new)"]
["163 Gibraltar","SWIFT Code","SWIFT Code","YES*","163 Gibraltar","GIP Gibraltar Pound"]
["165 Greece","SWIFT Code","SWIFT Code","YES*","165 Greece","EUR Euro"]
["168 Guatemala","SWIFT Code","SWIFT Code","DO NOT USE","168 Guatemala","GTQ Guatemalan Quetzal"]
["177 Guinea","SWIFT Code","SWIFT Code","NO","177 Guinea","GNF Guinean Franc"]
["180 Guyana","Bank key","SWIFT Code","NO","180 Guyana","GYD Guyanese Dollar"]
["183 Haiti","SWIFT Code","SWIFT Code","NO","183 Haiti","USD US Dollar"]
["186 Honduras","SWIFT Code","SWIFT Code","YES","186 Honduras","HNL Honduran Lempira"]
["195 Hungary","Local Branch code (first 8 digit - \"bankfiók-azonosító\")","SWIFT Code","YES*","195 Hungary","HUF Hungarian Forint"]
["198 Iceland","SWIFT Code","SWIFT Code","YES*","198 Iceland","ISK Iceland Krona"]
["204 India","IFSC code","SWIFT Code","NO","204 India","INR Indian Rupee"]
["207 Indonesia","Local Branch code (7 digit)","SWIFT Code","NO","207 Indonesia","IDR Indonesian Rupiah"]
["210 Iran","Bank key","SWIFT Code","YES","210 Iran","IRR Iranian Rial"]
["213 Iraq","SWIFT Code","SWIFT Code","YES","213 Iraq","IQD Iraqui Dinar"]
["216 Ireland","SWIFT Code","SWIFT Code","YES*","216 Ireland","EUR Euro"]
["219 Israel","SWIFT Code","SWIFT Code","YES*","219 Israel","ILS Israeli Shekel"]
["222 Italy","SWIFT Code","SWIFT Code","YES*","222 Italy","EUR Euro"]
["225 Cote d'Ivoire","SWIFT Code","SWIFT Code","DO NOT USE","225 Cote d'Ivoire","XOF C.F.A. Franc (BCEAO)"]
["228 Jamaica","Local Branch code (8 digit)","SWIFT Code","NO","228 Jamaica","JMD Jamaican Dollar"]
["231 Japan","SWIFT Code (insert 3 digit branch code in front of account number)","SWIFT Code (insert 3 digit branch code in front of account number)","NO","231 Japan","JPY Japanese Yen"]
["234 Jordan","Bank key","SWIFT Code","YES*","234 Jordan","JOD Jordanian Dinar"]
["239 Kazakhstan","SWIFT Code","SWIFT Code","YES","239 Kazakhstan","KZT Kazakhstani Tenge"]
["240 Kenya","Local Branch code (5 digit)","SWIFT Code","NO","240 Kenya","KES Kenyan Shilling"]
["243 Kuwait","SWIFT Code","SWIFT Code","YES*","243 Kuwait","KWD Kuwaiti Dinar"]
["245 Kyrgyzstan","Local Branch code (first 6 digits of account number)","SWIFT Code","NO","245 Kyrgyzstan","KGS Kyrgyzstan Som"]
["246 Lao,Peo.Dem.Rep","SWIFT Code","SWIFT Code","NO","246 Lao,Peo.Dem.Rep","LAK Laotian Kip"]
["247 Latvia","SWIFT Code","SWIFT Code","YES*","247 Latvia","EUR Euro"]
["249 Lebanon","SWIFT Code","SWIFT Code","YES*","249 Lebanon","LBP Lebanese Pound"]
["252 Lesotho","Local Branch code (6 digit)","SWIFT Code","NO","252 Lesotho","ZAR South African Rand"]
["255 Liberia","SWIFT Code","SWIFT Code","NO","255 Liberia","LRD Liberian Dollar"]
["258 Libya","SWIFT Code","SWIFT Code","NO","258 Libya","LYD Libyan Dinar"]
["260 Lithuania","SWIFT Code","SWIFT Code","YES*","260 Lithuania","EUR Euro"]
["264 Luxembourg","SWIFT Code","SWIFT Code","YES*","264 Luxembourg","EUR Euro"]
["266 Macedonia, TFYR","SWIFT Code","SWIFT Code","YES*","266 Macedonia, TFYR","MKD Macedonian Denar"]
["267 Madagascar","SWIFT Code","SWIFT Code","DO NOT USE","267 Madagascar","MGA Malagasy Ariary"]
["269 Malawi","Local Branch code of Head Office","SWIFT Code","NO","269 Malawi","MWK Malawi Kwacha"]
["270 Malaysia","SWIFT Code","SWIFT Code","NO","270 Malaysia","MYR Malaysian Ringgit"]
["274 Maldives,Rep of","SWIFT Code","SWIFT Code","NO","274 Maldives,Rep of","MVR Maldive Rufiyaa"]
["276 Mali","SWIFT Code","SWIFT Code","DO NOT USE","276 Mali","XOF C.F.A. Franc (BCEAO)"]
["279 Malta","SWIFT Code","SWIFT Code","YES*","279 Malta","EUR Euro"]
["282 Mauritania","SWIFT Code","SWIFT Code","YES*","282 Mauritania","MRU Mauritanian Ouguiya"]
["283 Mauritius","SWIFT Code","SWIFT Code","YES","283 Mauritius","MUR Mauritius Rupee"]
["285 Mexico","SWIFT Code","SWIFT Code","NO","285 Mexico","MXN Mexican Peso"]
["288 Mongolia","SWIFT Code","SWIFT Code","NO","288 Mongolia","MNT Mongolian Tugrik"]
["291 Morocco","Bank key","SWIFT Code","NO","291 Morocco","MAD Moroccan Dirham"]
["297 Nepal","Local Branch code (8 digit)","SWIFT Code","NO","297 Nepal","NPR Nepalese Rupee"]
["300 Netherlands","SWIFT Code","SWIFT Code","YES*","300 Netherlands","EUR Euro"]
["309 New Zealand","SWIFT Code","SWIFT Code","NO","309 New Zealand","NZD New Zealand Dollar"]
["312 Nicaragua","SWIFT Code","SWIFT Code","YES","312 Nicaragua","NIO Nicaraguan Cordoba Oro"]
["318 Niger","SWIFT Code","SWIFT Code","DO NOT USE","318 Niger","XOF C.F.A. Franc (BCEAO)"]
["321 Nigeria","Local Branch code of Head Office","SWIFT Code","NO","321 Nigeria","NGN Nigerian Naira"]
["324 Norway","SWIFT Code","SWIFT Code","YES*","324 Norway","NOK Norwegian Krone"]
["330 Pakistan","Bank & Branch Code\n(3 digit Bank code + 4 digit branch code)","SWIFT Code","YES*","330 Pakistan","PKR Pakistani Rupee"]
["333 Panama","SWIFT Code","SWIFT Code","NO","333 Panama","USD US Dollar"]
["336 Paraguay","SWIFT Code","SWIFT Code","NO","336 Paraguay","PYG Paraguayan Guarani"]
["338 Congo","SWIFT Code","SWIFT Code","YES","338 Congo","XAF C.F.A. Franc (BEAC)"]
["339 Peru","SWIFT Code","SWIFT Code","NO","339 Peru","PEN Peruvian Nuevo Sol"]
["342 Philippines","SWIFT Code","SWIFT Code","NO","342 Philippines","PHP Philippine Peso"]
["345 Poland","SWIFT Code","SWIFT Code","YES*","345 Poland","PLN Poland Zloty"]
["348 Portugal","SWIFT Code","SWIFT Code","YES*","348 Portugal","EUR Euro"]
["366 Romania","SWIFT Code","SWIFT Code","YES*","366 Romania","RON New Romanian Leu"]
["370 Russian Fed.","SWIFT Code","SWIFT Code","NO","370 Russian Fed.","RUB Russian Rouble"]
["375 Rwanda","SWIFT Code","SWIFT Code","NO","375 Rwanda","RWF Rwanda Franc"]
["378 Saudi Arabia","SWIFT Code","SWIFT Code","YES*","378 Saudi Arabia","SAR Saudi Riyal"]
["381 Senegal","SWIFT Code","SWIFT Code","DO NOT USE","381 Senegal","XOF C.F.A. Franc (BCEAO)"]
["390 Sierra Leone","Local Branch code (first 6 digits of account number)","SWIFT Code","NO","390 Sierra Leone","SLL Sierra Leone"]
["391 Singapore","SWIFT Code","SWIFT Code","NO","391 Singapore","SGD Singapore Dollar"]
["392 Somalia","Bank key","SWIFT Code","NO","392 Somalia","USD US Dollar"]
["393 South Africa","SWIFT Code (insert 6 digit electronic branch code in front of account number)","SWIFT Code (insert 6 digit electronic branch code in front of account number)","NO","393 South Africa","ZAR South African Rand"]
["394 Slovenia","SWIFT Code","SWIFT Code","YES*","394 Slovenia","EUR Euro"]
["395 Slovak Republic","SWIFT Code","SWIFT Code","YES*","395 Slovak Republic","EUR Euro"]
["399 Spain","SWIFT Code","SWIFT Code","YES*","399 Spain","EUR Euro"]
["402 Sudan","Local Branch code or name of branch","SWIFT Code","NO","402 Sudan","SDG Sudanese Pound (new)","USD US Dollar"]
["403 Swaziland","Local Branch code (6 digit)","SWIFT Code","NO","403 Swaziland","SZL Swaziland Lilangeni"]
["404 South Sudan","SWIFT Code","SWIFT Code","NO","404 South Sudan","SSP South Sudanese Pound"]
["411 Sweden","SWIFT Code","SWIFT Code","YES*","411 Sweden","SEK Swedish Krona"]
["414 Syria, Arab Rep","Local Branch code or name of branch","SWIFT Code","NO","414 Syria, Arab Rep","SYP Syrian Pound"]
["415 Tajikistan","Local Branch code (9 digit - 'РМБ')","SWIFT Code","NO","415 Tajikistan","TJS Tajik Somoni"]
["420 Thailand","Local Branch code (7 digit)","SWIFT Code","NO","420 Thailand","THB Thailand Baht"]
["423 Togo","SWIFT Code","SWIFT Code","DO NOT USE","423 Togo","XOF C.F.A. Franc (BCEAO)"]
["429 Trinidad,Tobago","Bank key","SWIFT Code","NO","429 Trinidad,Tobago","TTD Trinidad and Tobago Dollar"]
["432 Tunisia","SWIFT Code","SWIFT Code","YES*","432 Tunisia","TND Tunisian Dinar"]
["435 Turkey","SWIFT Code","SWIFT Code","YES*","435 Turkey","TRY New Turkish Lira"]
["436 Turkmenistan","Local Branch code (9 digit - 'MFO')","SWIFT Code","NO","436 Turkmenistan","TMT Turkmenistan Manat"]
["438 Uganda","Local Branch code of Head Office","SWIFT Code","NO","438 Uganda","UGX Ugandan Shilling","USD US Dollar"]
["441 Ukraine","SWIFT Code","SWIFT Code","YES","441 Ukraine","UAH Ukrainian Hryvnia"]
["449 Utd.Arab.Emir.","SWIFT Code","SWIFT Code","YES*","449 Utd.Arab.Emir.","AED United Arab Emirates Dirham"]
["450 Egypt","Local Branch code","SWIFT Code","YES","450 Egypt","EGP Egyptian Pound"]
["453 United Kingdom","Head office SWIFT Code (BIC + 'XXX')","Head office SWIFT Code (BIC + 'XXX')","YES*","453 United Kingdom","GBP Pound Sterling"]
["455 Tanzania,Uni.Re","Local Branch code (6 digit)","SWIFT Code","NO","455 Tanzania,Uni.Re","TZS Tanzanian Shilling","USD US Dollar"]
["456 USA","ACH routing number","ACH routing number","NO","456 USA","USD US Dollar"]
["459 Burkina-Faso","SWIFT Code","SWIFT Code","DO NOT USE","459 Burkina-Faso","XOF C.F.A. Franc (BCEAO)"]
["462 Uruguay","SWIFT Code","SWIFT Code","NO","462 Uruguay","UYU Uruguayan Peso"]
["463 Uzbekistan","Bank key","SWIFT Code","NO","463 Uzbekistan","UZS Uzbekistan Som"]
["471 Venezuela","SWIFT Code","SWIFT Code","NO","471 Venezuela","VES Venezuela Bolivar Soberano"]
["492 Yemen, Rep of","SWIFT Code","SWIFT Code","NO","492 Yemen, Rep of","YER Yemeni Rial"]
["498 Zambia","Local Branch code (6 digit)","SWIFT Code","NO","498 Zambia","ZMW Zambian Kwacha"]
["505 Andorra","SWIFT Code","SWIFT Code","YES*","505 Andorra","EUR Euro"]
["507 Bangladesh","Local Branch code (9 digit)","SWIFT Code","NO","507 Bangladesh","BDT Bangladesh Taka"]
["515 D.P.R. of Korea","SWIFT Code","SWIFT Code","NO","515 D.P.R. of Korea","KPW01 KPW"]
["520 Vietnam","CITAD code (8 digit)","SWIFT Code","NO","520 Vietnam","VND Vietnamese Dong"]
["525 Germany","SWIFT Code","Head office SWIFT Code (BIC + 'XXX')","YES*","525 Germany","EUR Euro"]
["535 Vatican City","SWIFT Code","SWIFT Code","YES","535 Vatican City","EUR Euro"]
["555 Liechtenstein","SWIFT Code","SWIFT Code","YES*","555 Liechtenstein","CHF Swiss Franc"]
["564 Moldova, Rep of","SWIFT Code","SWIFT Code","YES*","564 Moldova, Rep of","MDL Moldavan Leu"]
["565 Monaco","SWIFT Code","SWIFT Code","YES*","565 Monaco","EUR Euro"]
["567 South Korea,Rep","SWIFT Code","SWIFT Code","NO","567 South Korea,Rep","KRW South Korean Won"]
["570 San Marino","SWIFT Code","SWIFT Code","YES*","570 San Marino","EUR Euro"]
["575 Switzerland","SWIFT Code","SWIFT Code","YES*","575 Switzerland","CHF Swiss Franc"]
["590 Samoa","SWIFT Code","SWIFT Code","NO","590 Samoa","WST Samoan Tala"]
["601 Antigua/Barbuda","SWIFT Code","SWIFT Code","NO","601 Antigua/Barbuda","XCD East Carribean Dollar"]
["602 Brunei Darussal","SWIFT Code","SWIFT Code","NO","602 Brunei Darussal","BND Brunei Dollar"]
["603 Bahamas","SWIFT Code","SWIFT Code","NO","603 Bahamas","BSD Bahamian Dollar"]
["604 Bahrain","SWIFT Code","SWIFT Code","YES*","604 Bahrain","BHD Bahrain Dinar"]
["605 Bermuda","SWIFT Code","SWIFT Code","NO","605 Bermuda","BMD Bermudan Dollar"]
["610 Dominica","SWIFT Code","SWIFT Code","NO","610 Dominica","XCD East Carribean Dollar"]
["611 Belize","SWIFT Code","SWIFT Code","NO","611 Belize","BZD Belize Dollar"]
["612 Hong Kong","SWIFT Code","SWIFT Code","NO","612 Hong Kong","HKD Hong Kong Dollar"]
["615 Cayman Islands","SWIFT Code","SWIFT Code","NO","615 Cayman Islands","KYD Cayman Dollar"]
["616 Grenada","SWIFT Code","SWIFT Code","NO","616 Grenada","XCD East Carribean Dollar"]
["617 Kiribati","SWIFT Code","SWIFT Code","NO","617 Kiribati","AUD Australian Dollar"]
["618 Tuvalu","SWIFT Code","SWIFT Code","NO","618 Tuvalu","AUD Australian Dollar"]
["620 Montserrat","SWIFT Code","SWIFT Code","NO","620 Montserrat","XCD East Carribean Dollar"]
["623 Anguilla","SWIFT Code","SWIFT Code","NO","623 Anguilla","XCD East Carribean Dollar"]
["624 Qatar","SWIFT Code","SWIFT Code","YES*","624 Qatar","QAR Qatari Rial"]
["625 St. Helena","SWIFT Code","SWIFT Code","NO","625 St. Helena","SHP St.Helena Pound"]
["626 Zimbabwe","Local Branch code (5 digit)","SWIFT Code","NO","626 Zimbabwe","ZWL Zimbabwe Dollar","USD US Dollar"]
["627 St Kitts&Nevis","SWIFT Code","SWIFT Code","NO","627 St Kitts&Nevis","XCD East Carribean Dollar"]
["628 Seychelles","SWIFT Code","SWIFT Code","YES","628 Seychelles","SCR Seychelles Rupee"]
["629 St. Lucia","SWIFT Code","SWIFT Code","YES","629 St. Lucia","XCD East Carribean Dollar"]
["630 St. Vincent","SWIFT Code","SWIFT Code","NO","630 St. Vincent","XCD East Carribean Dollar"]
["631 Solomon Islands","SWIFT Code","SWIFT Code","NO","631 Solomon Islands","SBD Solomon Islands Dollar"]
["634 Tonga","SWIFT Code","SWIFT Code","NO","634 Tonga","TOP Tongan Pa'anga"]
["635 Oman","SWIFT Code","SWIFT Code","NO","635 Oman","OMR Omani Rial"]
["636 Turks& Caicosin","SWIFT Code","SWIFT Code","NO","636 Turks& Caicosin","USD US Dollar"]
["640 Brit.Virgin Is.","SWIFT Code","SWIFT Code","YES","640 Brit.Virgin Is.","USD US Dollar"]
["645 Sikkim","Bank key","Bank key","NO","645 Sikkim","INR Indian Rupee"]
["648 Nauru","Bank key","Bank key","NO","648 Nauru","AUD Australian Dollar"]
["649 Pap. New Guinea","Local Branch code (6 digit)","SWIFT Code","NO","649 Pap. New Guinea","PGK Papua New Guinea Kina"]
["655 Vanuatu","SWIFT Code","SWIFT Code","NO","655 Vanuatu","VUV Vanuatu Vatu"]
["656 Tokelau Islands","Bank key","Bank key","NO","656 Tokelau Islands","NZD New Zealand Dollar"]
["660 French Antilles","Bank key","Bank key","NO","660 French Antilles","ANG Netherlands Antillean Gulder"]
["661 Wallis,Futuna","Bank key","Bank key","YES","661 Wallis,Futuna","XPF CFP Franc"]
["662 Comoros","SWIFT Code","SWIFT Code","YES","662 Comoros","KMF Comoros Franc"]
["663 Reunion","SWIFT Code","SWIFT Code","YES","663 Reunion","EUR Euro"]
["664 Martinique","SWIFT Code","SWIFT Code","YES","664 Martinique","EUR Euro"]
["665 French Guiana","SWIFT Code","SWIFT Code","YES","665 French Guiana","EUR Euro"]
["666 Guadeloupe","SWIFT Code","SWIFT Code","YES","666 Guadeloupe","EUR Euro"]
["667 New Caledonia","SWIFT Code","SWIFT Code","YES","667 New Caledonia","XPF CFP Franc"]
["668 Frenc.Polynesia","SWIFT Code","SWIFT Code","YES","668 Frenc.Polynesia","XPF CFP Franc"]
["669 Djibouti","SWIFT Code","SWIFT Code","YES","669 Djibouti","DJF Djibouti Franc"]
["672 Netherlands Ant","SWIFT Code","SWIFT Code","NO","672 Netherlands Ant","EUR Euro"]
["678 Suriname","SWIFT Code","SWIFT Code","NO","678 Suriname","SRD Surinamese Dollar"]
["679 Cook Islands","SWIFT Code","SWIFT Code","NO","679 Cook Islands","NZD New Zealand Dollar"]
["680 Niue","Bank key","Bank key","NO","680 Niue","NZD New Zealand Dollar"]
["681 Angola","Local Branch code (8 digit: 5th-12th digit of the IBAN)","SWIFT Code","YES*","681 Angola","AOA Angolan Kwanza"]
["682 Cabo Verde","SWIFT Code","SWIFT Code","YES","682 Cabo Verde","CVE Cape Verde Escudo"]
["683 S.Tome&Principe","SWIFT Code","SWIFT Code","YES","683 S.Tome&Principe","STN Sao Tome and Principe Dobra"]
["685 Guinea-Bissau","SWIFT Code","SWIFT Code","DO NOT USE","685 Guinea-Bissau","XOF C.F.A. Franc (BCEAO)"]
["688 Macau","SWIFT Code","SWIFT Code","NO","688 Macau","MOP Macao Pataca"]
["689 Mozambique","Local Branch code (6 digit: 5th-10th digit of the IBAN)","SBICMZMXXXX for Standard bank\nLocal Branch code for all other banks","YES*","689 Mozambique","MZN Mozambique Metical (new)"]
["690 Palau, Rep of","Bank key","Bank key","NO","690 Palau, Rep of","USD US Dollar"]
["691 Western Sahara","SWIFT Code","SWIFT Code","NO","691 Western Sahara","MAD Moroccan Dirham"]
["692 Marshall Islnds","SWIFT Code","SWIFT Code","NO","692 Marshall Islnds","USD US Dollar"]
["693 Micronesia","Bank key","Bank key","NO","693 Micronesia","USD US Dollar"]
["695 Puerto Rico","SWIFT Code","SWIFT Code","NO","695 Puerto Rico","USD US Dollar"]
["696 Samoa,American","SWIFT Code","SWIFT Code","NO","696 Samoa,American","USD US Dollar"]
["697 Amer.Virgin Is.","Bank key","Bank key","NO","697 Amer.Virgin Is.","USD US Dollar"]
["698 Namibia","Local Branch code (6 digit)","SWIFT Code","NO","698 Namibia","NAD Namibian dollar"]
["700 N.Mariana Is.","Bank key","Bank key","NO","700 N.Mariana Is.","USD US Dollar"]
["705 Palestine","Bank key","SWIFT Code","YES*","705 Palestine","ILS Israeli Shekel"]
["706 Timor-Leste","Local branch code when available\nSWIFT code otherwise","Local branch code when available\nSWIFT code otherwise","YES","706 Timor-Leste","USD US Dollar"]
["891 Serbia & Monten","SWIFT Code","SWIFT Code","NO","891 Serbia & Monten","RSD Serbia Dinar"]
["895 Montenegro","SWIFT Code","SWIFT Code","YES","895 Montenegro","EUR Euro"]
["897 Serbia","SWIFT Code","SWIFT Code","YES","897 Serbia","RSD Serbia Dinar"]

{"sheet":"IBAN_requirments","index":8,"n_rows":236,"n_cols":4,"rows_kept":236,"cut":false,"hidden":true,"merged":[]}
["Country code","IBAN mandatory","IBAN length","First digits"]
["000 Unknown","NO","-",{"$f":"IF(C2=\"-\",\"-\")","v":"-"}]
["001 Greenland","YES*","18","GL"]
["004 Guam","NO","-","-"]
["006 Afghanistan","NO","-","-"]
["009 Albania","YES*","28","AL"]
["012 Algeria","YES","26","DZ"]
["024 Argentina","NO","-","-"]
["025 Aruba","NO","-","-"]
["026 Armenia","NO","-","-"]
["027 Australia","NO","-","-"]
["030 Austria","YES*","20","AT"]
["031 Azerbaijan","YES*","28","AZ"]
["042 Barbados","NO","-","-"]
["048 Belgium","YES*","16","BE"]
["049 Bhutan","NO","-","-"]
["051 Bolivia","NO","-","-"]
["052 Botswana","NO","-","-"]
["053 Bosnia-Herz.","YES","20","BA"]
["054 Brazil","YES","29","BR"]
["057 Bulgaria","YES*","22","BG"]
["060 Myanmar","NO","-","-"]
["061 Burundi","DO NOT USE","16","BI"]
["063 Belarus","YES*","28","BY"]
["066 Cambodia","NO","-","-"]
["069 Cameroon","YES*","27","CM"]
["071 Canary Islands","NO","-","-"]
["072 Canada","NO","-","-"]
["075 Central Afr.Rep","YES","27","CF"]
["078 Sri Lanka","NO","-","-"]
["081 Chad","DO NOT USE","27","-"]
["084 Chile","NO","-","-"]
["086 China","NO","-","-"]
["093 Colombia","NO","-","-"]
["099 Congo, Dem. Rep","NO","-","-"]
["102 Costa Rica","YES","22","CR"]
["103 Croatia","YES*","21","HR"]
["105 Cuba","NO","-","-"]
["111 Cyprus","YES*","28","CY"]
["113 Czech Republic","YES*","24","CZ"]
["117 Benin","DO NOT USE","28","-"]
["120 Denmark","YES*","18","DK"]
["126 Dominican Rep.","DO NOT USE","28","-"]
["135 Ecuador","NO","-","-"]
["138 El Salvador","YES","28","SV"]
["139 Equatorial Guin","DO NOT USE","27","CQ"]
["140 Estonia","YES*","20","EE"]
["141 Ethiopia","NO","-","-"]
["142 Eritrea","NO","-","-"]
["143 Fiji","NO","-","-"]
["144 Finland","YES*","18","FI"]
["147 France","YES*","27","FR"]
["153 Gabon","YES","27","GA"]
["156 Gambia","NO","-","-"]
["160 Georgia","YES*","22","GE"]
["162 Ghana","NO","-","-"]
["163 Gibraltar","YES*","23","GI"]
["165 Greece","YES*","27","GR"]
["168 Guatemala","DO NOT USE","28","-"]
["177 Guinea","NO","-","-"]
["180 Guyana","NO","-","-"]
["183 Haiti","NO","-","-"]
["186 Honduras","YES","28","HN"]
["195 Hungary","YES*","28","HU"]
["198 Iceland","YES*","26","IS"]
["204 India","NO","-","-"]
["207 Indonesia","NO","-","-"]
["210 Iran","YES","26","IR"]
["213 Iraq","YES","23","IQ"]
["216 Ireland","YES*","22","IE"]
["219 Israel","YES*","23","IL"]
["222 Italy","YES*","27","IT"]
["225 Cote d'Ivoire","DO NOT USE","-","-"]
["228 Jamaica","NO","-","-"]
["231 Japan","NO","-","-"]
["234 Jordan","YES*","30","JO"]
["239 Kazakhstan","YES","20","KZ"]
["240 Kenya","NO","-","-"]
["243 Kuwait","YES*","30","KW"]
["245 Kyrgyzstan","NO","-","-"]
["246 Lao,Peo.Dem.Rep","NO","-","-"]
["247 Latvia","YES*","21","LV"]
["249 Lebanon","YES*","28","LB"]
["252 Lesotho","NO","-","-"]
["255 Liberia","NO","-","-"]
["258 Libya","NO","-","-"]
["260 Lithuania","YES*","20","LT"]
["264 Luxembourg","YES*","20","LU"]
["266 Macedonia, TFYR","YES","19","MK"]
["267 Madagascar","DO NOT USE","27","-"]
["269 Malawi","NO","-","-"]
["270 Malaysia","NO","-","-"]
["274 Maldives,Rep of","NO","-","-"]
["276 Mali","DO NOT USE","28","-"]
["279 Malta","YES*","31","MT"]
["282 Mauritania","YES*","27","MR"]
["283 Mauritius","YES","30","MU"]
["285 Mexico","NO","-","-"]
["288 Mongolia","NO","-","-"]
["291 Morocco","NO","-","-"]
["297 Nepal","NO","-","-"]
["300 Netherlands","YES*","18","NL"]
["309 New Zealand","NO","-","-"]
["312 Nicaragua","YES","32","NI"]
["318 Niger","DO NOT USE","28","-"]
["321 Nigeria","NO","-","-"]
["324 Norway","YES*","15","NO"]
["330 Pakistan","YES*","24","PK"]
["333 Panama","NO","-","-"]
["336 Paraguay","NO","-","-"]
["338 Congo","YES","27","CG"]
["339 Peru","NO","-","-"]
["342 Philippines","NO","-","-"]
["345 Poland","YES*","28","PL"]
["348 Portugal","YES*","25","PT"]
["366 Romania","YES*","24","RO"]
["370 Russian Fed.","NO","-","-"]
["375 Rwanda","NO","-","-"]
["378 Saudi Arabia","YES*","24","SA"]
["381 Senegal","DO NOT USE","28","-"]
["390 Sierra Leone","NO","-","-"]
["391 Singapore","NO","-","-"]
["392 Somalia","NO","-","-"]
["393 South Africa","NO","-","-"]
["394 Slovenia","YES*","19","SI"]
["395 Slovak Republic","YES*","24","SK"]
["399 Spain","YES*","24","ES"]
["402 Sudan","NO","-","-"]
["403 Swaziland","NO","-","-"]
["404 South Sudan","NO","-","-"]
["411 Sweden","YES*","24","SE"]
["414 Syria, Arab Rep","NO","-","-"]
["415 Tajikistan","NO","-","-"]
["420 Thailand","NO","-","-"]
["423 Togo","DO NOT USE","28","-"]
["429 Trinidad,Tobago","NO","-","-"]
["432 Tunisia","YES*","24","TN"]
["435 Turkey","YES*","26","TR"]
["436 Turkmenistan","NO","-","-"]
["438 Uganda","NO","-","-"]
["441 Ukraine","YES","29","UA"]
["449 Utd.Arab.Emir.","YES*","23","AE"]
["450 Egypt","YES","27","EG"]
["453 United Kingdom","YES*","22","GB"]
["455 Tanzania,Uni.Re","NO","-","-"]
["456 USA","NO","-","-"]
["459 Burkina-Faso","DO NOT USE","28","-"]
["462 Uruguay","NO","-","-"]
["463 Uzbekistan","NO","-","-"]
["471 Venezuela","NO","-","-"]
["492 Yemen, Rep of","NO","-","-"]
["495 Yugoslavia","NO","-","-"]
["498 Zambia","NO","-","-"]
["499 Stateless","NO","-","-"]
["505 Andorra","YES*","24","AD"]
["507 Bangladesh","NO","-","-"]
["515 D.P.R. of Korea","NO","-","-"]
["520 Vietnam","NO","-","-"]
["525 Germany","YES*","22","DE"]
["535 Vatican City","YES","22","VA"]
["555 Liechtenstein","YES*","21","LI"]
["564 Moldova, Rep of","YES*","24","MD"]
["565 Monaco","YES*","27","MC"]
["567 South Korea,Rep","NO","-","-"]
["570 San Marino","YES*","27","SM"]
["575 Switzerland","YES*","21","CH"]
["590 Samoa","NO","-","-"]
["601 Antigua/Barbuda","NO","-","-"]
["602 Brunei Darussal","NO","-","-"]
["603 Bahamas","NO","-","-"]
["604 Bahrain","YES*","22","BH"]
["605 Bermuda","NO","-","-"]
["610 Dominica","NO","-","-"]
["611 Belize","NO","-","-"]
["612 Hong Kong","NO","-","-"]
["615 Cayman Islands","NO","-","-"]
["616 Grenada","NO","-","-"]
["617 Kiribati","NO","-","-"]
["618 Tuvalu","NO","-","-"]
["620 Montserrat","NO","-","-"]
["623 Anguilla","NO","-","-"]
["624 Qatar","YES*","29","QA"]
["625 St. Helena","NO","-","-"]
["626 Zimbabwe","NO","-","-"]
["627 St Kitts&Nevis","NO","-","-"]
["628 Seychelles","YES","31","SC"]
["629 St. Lucia","YES","32","LC"]
["630 St. Vincent","NO","-","-"]
["631 Solomon Islands","NO","-","-"]
["634 Tonga","NO","-","-"]
["635 Oman","NO","-","-"]
["636 Turks& Caicosin","NO","-","-"]
["640 Brit.Virgin Is.","YES","24","VG"]
["645 Sikkim","NO","-","-"]
["648 Nauru","NO","-","-"]
["649 Pap. New Guinea","NO","-","-"]
["655 Vanuatu","NO","-","-"]
["656 Tokelau Islands","NO","-","-"]
["660 French Antilles","NO","-","-"]
["661 Wallis,Futuna","YES","27","RE"]
["662 Comoros","DO NOT USE","27","KM"]
["663 Reunion","YES","27","WF"]
["664 Martinique","YES","27","MQ"]
["665 French Guiana","YES","27","GF"]
["666 Guadeloupe","YES","27","GP"]
["667 New Caledonia","YES","27","NC"]
["668 Frenc.Polynesia","YES","27","PF"]
["669 Djibouti","YES","27","DJ"]
["672 Netherlands Ant","NO","-","-"]
["678 Suriname","NO","-","-"]
["679 Cook Islands","NO","-","-"]
["680 Niue","NO","-","-"]
["681 Angola","YES","25","AO"]
["682 Cabo Verde","YES","25","CV"]
["683 S.Tome&Principe","YES","25","ST"]
["685 Guinea-Bissau","DO NOT USE","25","-"]
["688 Macau","NO","-","-"]
["689 Mozambique","YES*","25","MZ"]
["690 Palau, Rep of","NO","-","-"]
["691 Western Sahara","NO","-","-"]
["692 Marshall Islnds","NO","-","-"]
["693 Micronesia","NO","-","-"]
["695 Puerto Rico","NO","-","-"]
["696 Samoa,American","NO","-","-"]
["697 Amer.Virgin Is.","NO","-","-"]
["698 Namibia","NO","-","-"]
["700 N.Mariana Is.","NO","-","-"]
["701 Not Applicable","NO","-","-"]
["705 Palestine","YES*","29","PS"]
["706 Timor-Leste","YES","23","TL"]
["891 Serbia & Monten","NO","-","-"]
["895 Montenegro","YES","22","ME"]
["897 Serbia","YES","22","RS"]
["999 United Nations","NO","-","-"]
["… Select","DO NOT USE"]
[0,"DO NOT USE"]

{"sheet":"e.g. different language","index":9,"n_rows":20,"n_cols":4,"rows_kept":20,"cut":false,"hidden":true,"merged":[[0,0,0,3],[17,2,17,3],[18,1,18,3],[19,0,20,0],[19,1,20,3]]}
["Información del Vendor General:  UNICEF Panamá"]
["Last name/Apellidos","DE SOUZA PEIXOTO","Account Type/Tipo de cuenta","CORRIENTE"]
["First name/Primer Nombre","CLARA LUZ","SWIFT Code /Código Swift Bank Key"]
["Organisation's  name/Nombre de la Compañía",null,"Vendor's Bank Account No./No. cuenta bancaria del vendor"]
["Street Address/Dirección / House number/Casa No.","PH SONESTA","Account holder's name/ Nombre de la cuenta","Clara de Souza Peixoto"]
["District/Barrio, Reparto","PAITILLA","Name of Bank/Nombre de la institución bancaria","BANISTMO"]
["Province/Municipio/City/Ciudad","PANAMA","Branch/Sucursal","MARBELLA"]
["State / Departamento","PANAMA","Routing No.","N/A"]
["Country/País","PANAMA","Bank Address/Dirección del banco","Av. Aquilino de la Guardia. Calle 47 Este"]
["P. O.  Box/Apartado postal/ Zip / Postal Code","0843-03092","City /Ciudad","Panama"]
["Office Telephone/Teléfono de oficina",2128114,"State/Departamento","Panama"]
["Home Telephone/Teléfono casa",2150501,"Postal code/Código postal"]
["Fax/No. Fax",null,"Country/País","Panama"]
["Name of Contact/Nombre de Contacto","CLARA LUZ","Currency of the Bank Account/Moneda de la cuenta bancaria","dólares"]
["Contact person's E-mail Address/Persona de contacto/Dirección electrónica  "]
["E-mail Address/Dirección electrónica (Payment advice) (Notificación de pago)  ",null,"Any other details/Cualquier otra información"]
["WEB Site/Sitio WEB"]
["TAX ID #/No. RUC",null,"Please provide proof of Bank Account - copy of cancelled check or bank statement/Favor proveer evidencia de la cuenta bancaria-copia de cheque anulado o estado de cuenta"]
["Prepared by (Name/Section)/Preparado por (Nombre/Cargo) :       ","Clara de Souza Peixoto. Consultora"]
["Approved by (Name/Section)/Aprobado por (Nombre/Cargo):"]

{"sheet":"Validation","index":10,"n_rows":753,"n_cols":13,"rows_kept":753,"cut":false,"hidden":true,"merged":[[2,11,3,11]]}
["Business_Area","Organizational_unit",{"$nulls":10},"Business_Area"]
["… Select","… Select",{"$nulls":8},"0520 - Botswana","5964 - Programme Section, Yerevan","… Select"]
["0060 - Afghanistan","1505 - Jalalabad, Afghanistan","0060H00000","006","0064","006400001505        ",{"$nulls":6},"0060 - Afghanistan"]
["0060 - Afghanistan","1601 - Mezar-I-Sharif, Afghanistan","0060I00000","006","0061","006100001601        ",{"$nulls":6},"0090 - Albania"]
["0060 - Afghanistan","1705 - Herat, Afghanistan","0060O00000","006","0062","006200001705        ",{"$nulls":6},"0120 - Algeria"]
["0060 - Afghanistan","1706 - Faizabad, Afghanistan","0060J00000","006","006C","006C00001706        ",{"$nulls":6},"0240 - Argentina"]
["0060 - Afghanistan","1720 - Kandahar, Afghanistan","0060M00000","006","0063","006300001720        ",{"$nulls":6},"0260 - Armenia"]
["0060 - Afghanistan","2062 - Afghanistan","0060A00000","006","0060","006000002062        ",{"$nulls":6},"0310 - Azerbaijan"]
["0060 - Afghanistan","325 - Kabul, Afghanistan","0060B00000","006","0060","006000000325        ",{"$nulls":6},"0420 - Barbados"]
["0060 - Afghanistan","3263 - Daikundi, Afghanistan","0060E00000","006","006I","006I00003263        ",{"$nulls":6},"0490 - Bhutan"]
["0060 - Afghanistan","3267 - Ghor, Afghanistan","0060R00000","006","006K","006K00003267        ",{"$nulls":6},"0510 - Bolivia"]
["0060 - Afghanistan","3275 - Faryab, Afghanistan","0060K00000","006","006J","006J00003275        ",{"$nulls":6},"0520 - Botswana"]
["0060 - Afghanistan","3577 - Nimroz, Afghanistan","0060N00000","006","006S","006S00003577        ",{"$nulls":6},"0530 - Bosnia and Herzegovina"]
["0060 - Afghanistan","4004 - Kabul Central Zone","0060C00000","006","0060","006000004004        ",{"$nulls":6},"0540 - Brazil"]
["0060 - Afghanistan","8899 - Badghis, Afghanistan","0060P00000","006","006H","006H00008899        ",{"$nulls":6},"0570 - Bulgaria"]
["0060 - Afghanistan","8901 - Farah, Afghanistan","0060Q00000","006","006R","006R00008901        ",{"$nulls":6},"0600 - Myanmar"]
["0060 - Afghanistan","8903 - Gardez, Afghanistan","0060F00000","006","006F","006F00008903        ",{"$nulls":6},"0610 - Burundi"]
["0060 - Afghanistan","8907 - Bamyan, Afghanistan","0060D00000","006","0066","006600008907        ",{"$nulls":6},"0630 - Belarus"]
["0090 - Albania","2100 - Albania","0090A00000","009","0090","009000002100        ",{"$nulls":6},"0660 - Cambodia"]
["0090 - Albania","380 - Tirana, Albania","0090B00000","009","0090","009000000380        ",{"$nulls":6},"0690 - Republic of Cameroon"]
["0120 - Algeria","2068 - Algeria","0120A00000","012","0120","012000002068        ",{"$nulls":6},"0750 - Central African Republic"]
["0120 - Algeria","355 - Algiers, Algeria","0120B00000","012","0120","012000000355        ",{"$nulls":6},"0780 - Sri Lanka"]
["0240 - Argentina","1600 - Buenos Aires, Argentina","0240B00000","024","0240","024000001600        ",{"$nulls":6},"0810 - Chad"]
["0240 - Argentina","2108 - Argentina","0240A00000","024","0240","024000002108        ",{"$nulls":6},"0840 - Chile"]
["0240 - Argentina","2226 - Southern Cone Hub","0240C00000","024","0240","024000002226        ",{"$nulls":6},"0860 - China"]
["0260 - Armenia","1607 - Yerevan, Armenia","0260B00000","026","0260","026000001607        ",{"$nulls":6},"0930 - Colombia"]
["0260 - Armenia","2101 - Armenia","0260A00000","026","0260","026000002101        ",{"$nulls":6},"0990 - Democratic Republic of Congo"]
["0310 - Azerbaijan","1608 - Baku, Azerbaijan","0310B00000","031","0310","031000001608        ",{"$nulls":6},"1020 - Costa Rica"]
["0310 - Azerbaijan","2086 - Azerbaijan","0310A00000","031","0310","031000002086        ",{"$nulls":6},"1030 - Croatia"]
["0420 - Barbados","2107 - Barbados (Caribbean Group)","0420A00000","042","0420","042000002107        ",{"$nulls":6},"1050 - Cuba"]
["0420 - Barbados","310 - Bridgetown, Barbados","0420B00000","042","0420","042000000310        ",{"$nulls":6},"1170 - Benin"]
["0420 - Barbados","9004 - Port of Spain, Trinidad & Tobago","0420C00000","429","4290","429000009004        ",{"$nulls":6},"1200 - Denmark"]
["0490 - Bhutan","2065 - Bhutan","0490A00000","049","0490","049000002065        ",{"$nulls":6},"1260 - Dominican Republic"]
["0490 - Bhutan","361 - Thimphu, Bhutan","0490B00000","049","0490","049000000361        ",{"$nulls":6},"1350 - Ecuador"]
["0510 - Bolivia","1688 - Cochabamba, Bolivia","0510C00000","051","0511","051100001688        ",{"$nulls":6},"1380 - El Salvador"]
["0510 - Bolivia","2114 - Bolivia","0510A00000","051","0510","051000002114        ",{"$nulls":6},"1390 - Equatorial Guinea"]
["0510 - Bolivia","2512 - Sucre,Bolivia","0510D00000","051","0512","051200002512        ",{"$nulls":6},"1410 - Ethiopia"]
["0510 - Bolivia","2513 - Programme Section, Sucre Bolivia","3120D00000","051","0512","051200002513        ",{"$nulls":6},"1420 - Eritrea"]
["0510 - Bolivia","376 - La Paz, Bolivia","0510B00000","051","0510","051000000376        ",{"$nulls":6},"1430 - Fiji (Pacific Islands)"]
["0520 - Botswana","2030 - Botswana","0520A00000","052","0520","052000002030        ",{"$nulls":6},"1530 - Gabon"]
["0520 - Botswana","349 - Gaborone, Botswana","0520B00000","052","0520","052000000349        ",{"$nulls":6},"1560 - Gambia"]
["0530 - Bosnia and Herzegovina","1755 - Banja Luka, Bosnia & Herzegovina","0530C00000","053","0532","053200001755        ",{"$nulls":6},"1600 - Georgia"]
["0530 - Bosnia and Herzegovina","2095 - Bosnia and Herzegovina","0530A00000","053","0530","053000002095        ",{"$nulls":6},"1620 - Ghana"]
["0530 - Bosnia and Herzegovina","322 - Sarajevo, Bosnia & Herzegovina","0530B00000","053","0530","053000000322        ",{"$nulls":6},"1680 - Guatemala"]
["0540 - Brazil","1529 - Recife, Brazil","0540F00000","054","0546","054600001529        ",{"$nulls":6},"1770 - Guinea"]
["0540 - Brazil","1530 - Sao Luis, Brazil","0540H00000","054","0547","054700001530        ",{"$nulls":6},"1800 - Guyana"]
["0540 - Brazil","1546 - Salvador, Brazil","0540G00000","054","0548","054800001546        ",{"$nulls":6},"1830 - Haiti"]
["0540 - Brazil","1556 - Rio de Janeiro, Brazil","0540J00000","054","0541","054100001556        ",{"$nulls":6},"1860 - Honduras"]
["0540 - Brazil","1557 - Sao Paulo, Brazil","0540I00000","054","0545","054500001557        ",{"$nulls":6},"1950 - Global Shared Service Center"]
["0540 - Brazil","1578 - Belem, Brazil","0540C00000","054","054C","054C00001578        ",{"$nulls":6},"2040 - India"]
["0540 - Brazil","1583 - Fortaleza, Brazil","0540D00000","054","054A","054A00001583        ",{"$nulls":6},"2070 - Indonesia"]
["0540 - Brazil","2106 - Brazil","0540A00000","054","0540","054000002106        ",{"$nulls":6},"2100 - Iran"]
["0540 - Brazil","352 - Brasilia, Brazil","0540B00000","054","0540","054000000352        ",{"$nulls":6},"2130 - Iraq"]
["0540 - Brazil","3976 - Manaus, Brazil","0540E00000","054","054D","054D00003976        ",{"$nulls":6},"2220 - Office of Research, Italy"]
["0570 - Bulgaria","2097 - Bulgaria","0570A00000","057","0570","057000002097        ",{"$nulls":6},"2250 - Cote D'Ivoire"]
["0570 - Bulgaria","8920 - Sofia, Bulgaria","0570B00000","057","0570","057000008920        ",{"$nulls":6},"2280 - Jamaica"]
["0600 - Myanmar","2057 - Myanmar","0600A00000","060","0600","060000002057        ",{"$nulls":6},"2340 - Jordan"]
["0600 - Myanmar","2475 - Hakha, Myanmar","0600L00000","060","0605","060500002475        ",{"$nulls":6},"234R - MENA, Jordan"]
["0600 - Myanmar","2478 - Dawei, Myanmar","0600M00000","060","060B","060B00002478        ",{"$nulls":6},"2390 - Kazakhstan"]
["0600 - Myanmar","3165 - Maungdaw, Myanmar","0600J00000","060","060D","060D00003165        ",{"$nulls":6},"2400 - Kenya"]
["0600 - Myanmar","3168 - Lashio, Myanmar","0600K00000","060","0609","060900003168        ",{"$nulls":6},"240B - Office of Global Innovation"]
["0600 - Myanmar","3226 - Kengtung, Myanmar","0600D00000","060","060J","060J00003226        ",{"$nulls":6},"240R - ESARO, Kenya"]
["0600 - Myanmar","3228 - Mawlamyine, Myanmar","0600F00000","060","060K","060K00003228        ",{"$nulls":6},"2450 - Republic of Kyrgyzstan"]
["0600 - Myanmar","347 - Yangon, Myanmar","0600B00000","060","0600","060000000347        ",{"$nulls":6},"2460 - Lao People's Dem Rep."]
["0600 - Myanmar","4207 - Myeik, Myanmar","0600G00000","060","060R","060R00004207        ",{"$nulls":6},"2490 - Lebanon"]
["0600 - Myanmar","8778 - Mandalay, Myanmar","0600E00000","060","0608","060800008778        ",{"$nulls":6},"2520 - Lesotho"]
["0600 - Myanmar","8779 - Taunggyi, Myanmar","0600I00000","060","060A","060A00008779        ",{"$nulls":6},"2550 - Liberia"]
["0600 - Myanmar","8782 - Myitkyina, Myanmar","0600H00000","060","0607","060700008782        ",{"$nulls":6},"2580 - Libya"]
["0600 - Myanmar","8797 - Kalay, Myanmar","0600C00000","060","060C","060C00008797        ",{"$nulls":6},"2660 - Macedonia"]
["0610 - Burundi","2028 - Burundi","0610A00000","061","0610","061000002028        ",{"$nulls":6},"2670 - Madagascar"]
["0610 - Burundi","326 - Bujumbura, Burundi","0610B00000","061","0610","061000000326        ",{"$nulls":6},"2690 - Malawi"]
["0610 - Burundi","4640 - Gitega, Burundi","0610C00000","061","0611","061100004640        ",{"$nulls":6},"2700 - Malaysia"]
["0630 - Belarus","1767 - Minsk, Belarus","0630B00000","063","0630","063000001767        ",{"$nulls":6},"2740 - Maldives"]
["0630 - Belarus","2092 - Belarus","0630A00000","063","0630","063000002092        ",{"$nulls":6},"2760 - Mali"]
["0660 - Cambodia","1727 - Battambang, Cambodia","0660C00000","066","0661","066100001727        ",{"$nulls":6},"2820 - Mauritania"]
["0660 - Cambodia","2052 - Cambodia","0660A00000","066","0660","066000002052        ",{"$nulls":6},"2850 - Mexico"]
["0660 - Cambodia","3153 - Preah Sihanouk, Cambodia","0660D00000","066","0669","066900003153        ",{"$nulls":6},"2880 - Mongolia"]
["0660 - Cambodia","3156 - Siem Reap, Cambodia","0660E00000","066","0664","066400003156        ",{"$nulls":6},"2910 - Morocco"]
["0660 - Cambodia","3159 - Kampong Cham, Cambodia","0660F00000","066","0669","066900003159        ",{"$nulls":6},"2970 - Nepal"]
["0660 - Cambodia","3162 - Phnom Penh Zone - South Eastern Province","0660G00000","066","0660","066000003162        ",{"$nulls":6},"297R - ROSA, Nepal"]
["0660 - Cambodia","370 - Phnom Penh, Cambodia","0660B00000","066","0660","066000000370        ",{"$nulls":6},"3120 - Nicaragua"]
["0690 - Republic of Cameroon","2023 - Republic of Cameroon","0690A00000","069","0690","069000002023        ",{"$nulls":6},"3180 - Niger"]
["0690 - Republic of Cameroon","2962 - Maroua, Cameroon","0690G00000","069","0696","069600002962        ",{"$nulls":6},"3210 - Nigeria"]
["0690 - Republic of Cameroon","303 - Yaounde, Republic of Cameroon","0690B00000","069","0690","069000000303        ",{"$nulls":6},"3300 - Pakistan"]
["0690 - Republic of Cameroon","3788 - Bertoua, Cameroon","0690E00000","069","0694","069400003788        ",{"$nulls":6},"3330 - Panama"]
["0690 - Republic of Cameroon","4502 - Douala, Cameroon","0690C00000","069","0691","069100004502        ",{"$nulls":6},"333R - LACRO, Panama"]
["0750 - Central African Republic","1581 - Bossangoa, Central African Republic","0750C00000","075","0751","075100001581        ",{"$nulls":6},"3360 - Paraguay"]
["0750 - Central African Republic","2008 - Central African Republic","0750A00000","075","0750","075000002008        ",{"$nulls":6},"3380 - Congo"]
["0750 - Central African Republic","2275 - Bambari, Central African Republic","0750E00000","075","0757","075700002275        ",{"$nulls":6},"3390 - Peru"]
["0750 - Central African Republic","2377 - Bouar, Central African Republic","0750F00000","075","075B","075B00002377        ",{"$nulls":6},"3420 - Philippines"]
["0750 - Central African Republic","2380 - Ndele, Central African Republic","0750G00000","075","075G","075G00002380        ",{"$nulls":6},"3660 - Romania"]
["0750 - Central African Republic","2383 - Zemio, Central African Republic","0750H00000","075","075I","075I00002383        ",{"$nulls":6},"3750 - Rwanda"]
["0750 - Central African Republic","348 - Bangui, Central African Republic","0750B00000","075","0750","075000000348        ",{"$nulls":6},"3780 - Saudi Arabia"]
["0750 - Central African Republic","8773 - Kanga Bandoro, Central African Republic","0750D00000","075","0752","075200008773        ",{"$nulls":6},"3810 - Senegal"]
["0780 - Sri Lanka","2059 - Sri Lanka","0780A00000","078","0780","078000002059        ",{"$nulls":6},"381R - WCARO, Senegal"]
["0780 - Sri Lanka","315 - Colombo, Sri Lanka","0780B00000","078","0780","078000000315        ",{"$nulls":6},"3900 - Sierra Leone"]
["0780 - Sri Lanka","8860 - Battilcaloa, Sri Lanka","0780C00000","078","0785","078500008860        ",{"$nulls":6},"3920 - Somalia"]
["0780 - Sri Lanka","8862 - Killinochchi, Sri Lanka","0780F00000","078","0786","078600008862        ",{"$nulls":6},"3930 - South Africa"]
["0810 - Chad","2018 - Chad","0810A00000","081","0810","081000002018        ",{"$nulls":6},"4020 - Sudan"]
["0810 - Chad","2550 - Sarh, CHAD","0810G00000","081","0812","081200002550        ",{"$nulls":6},"4030 - Swaziland"]
["0810 - Chad","2958 - Bol, Chad","0810H00000","081","0819","081900002958        ",{"$nulls":6},"4040 - South Sudan"]
["0810 - Chad","2965 - Bagassola, Chad","0810I00000","081","0819","081900002965        ",{"$nulls":6},"4140 - Syria"]
["0810 - Chad","360 - N'Djamena, Chad","0810B00000","081","0810","081000000360        ",{"$nulls":6},"4150 - Tajikistan"]
["0810 - Chad","3791 - Moundou, Chad","0810D00000","081","081R","081R00003791        ",{"$nulls":6},"4200 - Thailand"]
["0810 - Chad","3794 - Mongo, Chad","0810E00000","081","0813","081300003794        ",{"$nulls":6},"420R - EAPRO, Thailand"]
["0810 - Chad","3797 - Mao, Chad","0810F00000","081","0814","081400003797        ",{"$nulls":6},"4230 - Togo"]
["0810 - Chad","9019 - Abeche, Chad","0810C00000","081","0811","081100009019        ",{"$nulls":6},"4320 - Tunisia"]
["0840 - Chile","2123 - Chile","0840A00000","084","0840","084000002123        ",{"$nulls":6},"4350 - Turkey"]
["0840 - Chile","314 - Santiago, Chile","0840B00000","084","0840","084000000314        ",{"$nulls":6},"4360 - Rep. of Turkmenistan"]
["0860 - China","2045 - China","0860A00000","086","0860","086000002045        ",{"$nulls":6},"4380 - Uganda"]
["0860 - China","317 - Beijing, China","0860B00000","086","0860","086000000317        ",{"$nulls":6},"4410 - Ukraine"]
["0860 - China","3279 - Shanghai, China","0860C00000","086","0869","086900003279        ",{"$nulls":6},"4500 - Egypt"]
["0930 - Colombia","2105 - Colombia","0930A00000","093","0930","093000002105        ",{"$nulls":6},"4550 - United Rep. of Tanzania"]
["0930 - Colombia","2202 - Cali Zone Office, Colombia","0930F00000","093","0931","093100002202        ",{"$nulls":6},"456B - Executive Director's Office"]
["0930 - Colombia","309 - Bogota, Colombia","0930B00000","093","0930","093000000309        ",{"$nulls":6},"456C - Data, Research and Policy"]
["0930 - Colombia","4280 - Quibdo, Colombia","0930D00000","093","0939","093900004280        ",{"$nulls":6},"456D - Programme Division"]
["0990 - Democratic Republic of Congo","1528 - Bukavu, Democratic Republic of Congo","0990D00000","099","0991","099100001528        ",{"$nulls":6},"456F - Office of Emergency Prog."]
["0990 - Democratic Republic of Congo","1554 - Lubumbashi, Democratic Republic of Congo","0990K00000","099","0993","099300001554        ",{"$nulls":6},"456G - Division of Communication"]
["0990 - Democratic Republic of Congo","1585 - Mbuji Mayi, Democratic Republic of Congo","0990N00000","099","0997","099700001585        ",{"$nulls":6},"456H - Gov. & Multilateral  Affairs"]
["0990 - Democratic Republic of Congo","1763 - Kananga, Democratic Republic of Congo","0990I00000","099","0998","099800001763        ",{"$nulls":6},"456I - Public Partnerships Division"]
["0990 - Democratic Republic of Congo","1764 - Goma, Democratic Republic of Congo","0990G00000","099","099A","099A00001764        ",{"$nulls":6},"456J - Div. of Finance & Admin Mgmt"]
["0990 - Democratic Republic of Congo","2015 - Democratic Republic of Congo","0990A00000","099","0990","099000002015        ",{"$nulls":6},"456K - Division of Human Resources"]
["0990 - Democratic Republic of Congo","2556 - Libenge, Democratic Republic of Congo","0990P00000","099","099T","099T00002556        ",{"$nulls":6},"456L - InfoTech Solutions & Services"]
["0990 - Democratic Republic of Congo","2559 - Beni, Democratic Republic of Congo","0990Q00000","099","099J","099J00002559        ",{"$nulls":6},"456N - Int. Audit & Invest (OIAI)"]
["0990 - Democratic Republic of Congo","333 - Kinshasa, Dem. Rep. of Congo","0990B20000","099","0990","099000000333        ",{"$nulls":6},"456O - Evaluation Office"]
["0990 - Democratic Republic of Congo","3556 - Bandundu, Dem Republic of Congo","0990C00000","099","B099","B09900003556        ",{"$nulls":6},"456Q - GSSC Project"]
["0990 - Democratic Republic of Congo","3800 - Maniema, Democratic Republic of Congo","0990O00000","099","0999","099900003800        ",{"$nulls":6},"456R - Field Results Group Office"]
["0990 - Democratic Republic of Congo","3916 - Kalemie, Dem. Republic of Congo","0990H00000","099","099H","099H00003916        ",{"$nulls":6},"456S - OSEB"]
["0990 - Democratic Republic of Congo","3922 - Mbandaka, Dem Republic of Congo","0990M00000","099","099L","099L00003922        ",{"$nulls":6},"456T - UNICEF Hosted Funds"]
["0990 - Democratic Republic of Congo","4802 - Dungu, Democratic Rep of Congo","0990F00000","099","I099","I09900004802        ",{"$nulls":6},"4590 - Burkina Faso"]
["0990 - Democratic Republic of Congo","8552 - Kisangani, Democratic Republic of Congo","0990J00000","099","099B","099B00008552        ",{"$nulls":6},"4620 - Uruguay"]
["0990 - Democratic Republic of Congo","8771 - Matadi, Democratic Republic of Congo","0990L00000","099","099D","099D00008771        ",{"$nulls":6},"4630 - Rep of Uzbekistan"]
["0990 - Democratic Republic of Congo","8968 - Bunia, Democratic Republic of Congo","0990E00000","099","099G","099G00008968        ",{"$nulls":6},"4710 - Venezuela"]
["1020 - Costa Rica","1573 - San Jose, Costa Rica","1020B00000","102","1020","102000001573        ",{"$nulls":6},"4920 - Yemen"]
["1020 - Costa Rica","2121 - Costa Rica","1020A00000","102","1020","102000002121        ",{"$nulls":6},"4980 - Zambia"]
["1030 - Croatia","1730 - Zagreb, Croatia","1030B00000","103","1031","103100001730        ",{"$nulls":6},"5070 - Bangladesh"]
["1030 - Croatia","2150 - Croatia","1030A00000","575","5750","575000002150        ",{"$nulls":6},"5150 - DP Republic of Korea"]
["1050 - Cuba","1716 - Havana, Cuba","1050B00000","105","1050","105000001716        ",{"$nulls":6},"5200 - Vietnam"]
["1050 - Cuba","2112 - Cuba","1050A00000","105","1050","105000002112        ",{"$nulls":6},"5640 - Moldova"]
["1170 - Benin","2013 - Benin","1170A00000","117","1170","117000002013        ",{"$nulls":6},"5750 - Switzerland"]
["1170 - Benin","354 - Cotonou, Benin","1170B00000","117","1170","117000000354        ",{"$nulls":6},"575R - CEE/CIS"]
["1170 - Benin","8917 - Parakou, Benin","1170C00000","117","1174","117400008917        ",{"$nulls":6},"6110 - Belize"]
["1200 - Denmark","2326 - Markets,Finance & Strategic Data Unit","1200A03100","120","1200","120000002326        ",{"$nulls":6},"6260 - Zimbabwe"]
["1200 - Denmark","2327 - International Transport Unit","1200A03200","120","1200","120000002327        ",{"$nulls":6},"6350 - Oman"]
["1200 - Denmark","2986 - Supply Chain Strengthening","1200A03000","120","1200","120000002986        ",{"$nulls":6},"6490 - Papua New Guinea"]
["1200 - Denmark","3080 - Supply Division, COPENHAGEN","1200A00000","120","1200","120000003080        ",{"$nulls":6},"6620 - Comoros"]
["1200 - Denmark","3402 - Country Support Centre, Copenhagen","1200A01300","120","1200","120000003402        ",{"$nulls":6},"6690 - Djibouti"]
["1200 - Denmark","3403 - Vaccine Centre, Copenhagen","1200A02300","120","1200","120000003403        ",{"$nulls":6},"6810 - Angola"]
["1200 - Denmark","3404 - Medical & Nutrition Centre, Copenhagen","1200A02400","120","1200","120000003404        ",{"$nulls":6},"6830 - Sao Tome & Principe"]
["1200 - Denmark","3405 - Water, Sanit & Educ Centre, Copenhagen","1200A02500","120","1200","120000003405        ",{"$nulls":6},"6850 - Guinea Bissau"]
["1200 - Denmark","3764 - Innovation Unit","1200A02800","120","1200","120000003764        ",{"$nulls":6},"6890 - Republic of Mozambique"]
["1200 - Denmark","3765 - Emergency Unit II","1200A02900","120","1200","120000003765        ",{"$nulls":6},"6980 - Namibia"]
["1200 - Denmark","4402 - Health Technology Centre","1200A02600","120","1200","120000004402        ",{"$nulls":6},"7050 - Palestine, State of"]
["1200 - Denmark","4402 - Medical & Nutrition Centre, CPH","1200A02600","120","1200","120000004402        ",{"$nulls":6},"7060 - Timor-Leste"]
["1200 - Denmark","4629 - Knowledge Management Centre","1200A02700","120","1200","120000004629        ",{"$nulls":6},"8950 - Republic of Montenegro"]
["1200 - Denmark","6069 - Fin Mgmt and Budget Centre, COPENHAGEN","1200A00800","120","1200","120000006069        ",{"$nulls":6},"8970 - Serbia"]
["1200 - Denmark","6072 - Contracting Centre, COPENHAGEN","1200A00400","120","1200","120000006072        ",{"$nulls":6},"8971 - Kosovo"]
["1200 - Denmark","6075 - Director's Office, COPENHAGEN","1200A00100","120","1200","120000006075        "]
["1200 - Denmark","6076 - Operational Analysis & Technology Centre","1200A00900","120","1200","120000006076        "]
["1200 - Denmark","6077 - Quality Assurance Centre, COPENHAGEN","1200A00600","120","1200","120000006077        "]
["1200 - Denmark","6080 - Logistics Centre, COPENHAGEN","1200A00300","120","1200","120000006080        "]
["1200 - Denmark","6083 - Human Resources and Admin Centre, CPH","1200A00700","120","1200","120000006083        "]
["1200 - Denmark","8444 - Procurement Services Team, Copenhagen","120XA00000","120","1200","120000008444        "]
["1200 - Denmark","8759 - New York Supply Centre (Supply Division)","1200A02000","456","4560","456000008759        "]
["1260 - Dominican Republic","2124 - Dominican Republic","1260A00000","126","1260","126000002124        "]
["1260 - Dominican Republic","339 - Santo Domingo, Dominican Republic","1260B00000","126","1260","126000000339        "]
["1350 - Ecuador","2120 - Ecuador","1350A00000","135","1350","135000002120        "]
["1350 - Ecuador","2878 - Esmeralda, Ecuador","1350D00000","135","1358","135800002878        "]
["1350 - Ecuador","2883 - Pedernales, Ecuador","1350E00000","135","135B","135B00002883        "]
["1350 - Ecuador","338 - Quito, Ecuador","1350B00000","135","1350","135000000338        "]
["1350 - Ecuador","8955 - Guayaquil, Ecuador","1350C00000","135","1351","135100008955        "]
["1380 - El Salvador","1592 - San Salvador, El Salvador","1380B00000","138","1380","138000001592        "]
["1380 - El Salvador","2122 - El Salvador","1380A00000","138","1380","138000002122        "]
["1390 - Equatorial Guinea","1577 - Malabo, Equatorial Guinea","1390B00000","139","1390","139000001577        "]
["1390 - Equatorial Guinea","2002 - Equatorial Guinea","1390A00000","139","1390","139000002002        "]
["1410 - Ethiopia","1532 - Bahir Dar, Ethiopia","1410E00000","141","141D","141D00001532        "]
["1410 - Ethiopia","1655 - Awasa, Ethiopia","1410D00000","141","1417","141700001655        "]
["1410 - Ethiopia","1760 - Mekelle, Ethiopia","1410H00000","141","141L","141L00001760        "]
["1410 - Ethiopia","2025 - Ethiopia","1410A00000","141","1410","141000002025        "]
["1410 - Ethiopia","2336 - Oromiya (Addis Ababa Zone), Ethiopia","1410B10000","141","1410","141000002336        "]
["1410 - Ethiopia","328 - Addis Ababa, Ethiopia","1410B00000","141","1410","141000000328        "]
["1410 - Ethiopia","3677 - Semera, Ethiopia","1410I00000","141","B141","B14100003677        "]
["1410 - Ethiopia","3805 - Gode, Ethiopia","1410J00000","141","F141","F14100003805        "]
["1410 - Ethiopia","3808 - Kebridehar, Ethiopia","1410K00000","141","G141","G14100003808        "]
["1410 - Ethiopia","3954 - Dollo Ado, Ethiopia","1410L00000","141","D141","D14100003954        "]
["1410 - Ethiopia","7025 - Asosa, Ethiopia","1410C00000","141","1416","141600007025        "]
["1410 - Ethiopia","8745 - Jijiga, Ethiopia","1410G00000","141","1418","141800008745        "]
["1410 - Ethiopia","9079 - Gambela, Ethiopia","1410F00000","141","1412","141200009079        "]
["1420 - Eritrea","2027 - Eritrea","1420A00000","142","1413","141300002027        "]
["1420 - Eritrea","385 - Asmara, Eritrea","1420B00000","142","1413","141300000385        "]
["1430 - Fiji (Pacific Islands)","1574 - Pacific Office, Suva, Fiji","1430H00000","143","1430","143000001574        "]
["1430 - Fiji (Pacific Islands)","1636 - Tarawa, Kiribati","1430F00000","617","6170","617000001636        "]
["1430 - Fiji (Pacific Islands)","1643 - Port Vila, Vanuatu","1430E00000","655","6550","655000001643        "]
["1430 - Fiji (Pacific Islands)","2051 - Fiji (Pacific Islands) - MCP","1430A00000","143","1430","143000002051        "]
["1430 - Fiji (Pacific Islands)","4077 - Apia, Samoa","1430C00000","590","5900","590000004077        "]
["1430 - Fiji (Pacific Islands)","8864 - Honiara, Solomon Islands","1430D00000","631","6310","631000008864        "]
["1530 - Gabon","1741 - Libreville, Gabon","1530B00000","153","1530","153000001741        "]
["1530 - Gabon","2001 - Gabon","1530A00000","153","1530","153000002001        "]
["1560 - Gambia","1610 - Banjul, Gambia","1560B00000","156","1560","156000001610        "]
["1560 - Gambia","2009 - Gambia","1560A00000","156","1560","156000002009        "]
["1600 - Georgia","2099 - Georgia","1600A00000","160","1600","160000002099        "]
["1600 - Georgia","323 - Tblisi, Georgia","1600B00000","160","1600","160000000323        "]
["1600 - Georgia","3381 - Sukhumi, Georgia","1600C00000","160","1604","160400003381        "]
["1620 - Ghana","1652 - Tamale, Ghana","1620C00000","162","1621","162100001652        "]
["1620 - Ghana","2006 - Ghana","1620A00000","162","1620","162000002006        "]
["1620 - Ghana","351 - Accra, Ghana","1620B00000","162","1620","162000000351        "]
["1680 - Guatemala","2111 - Guatemala","1680A00000","168","1680","168000002111        "]
["1680 - Guatemala","311 - Guatemala City, Guatemala","1680B00000","168","1680","168000000311        "]
["1770 - Guinea","2012 - Guinea","1770A00000","177","1770","177000002012        "]
["1770 - Guinea","3243 - Kankan, Guinea","1770D00000","177","1777","177700003243        "]
["1770 - Guinea","381 - Conakry, Guinea","1770B10000","177","1770","177000000381        "]
["1770 - Guinea","7063 - Nzerekore, Guinea","1770C00000","177","1771","177100007063        "]
["1800 - Guyana","1526 - Georgetown, Guyana","1800B00000","180","1800","180000001526        "]
["1800 - Guyana","2110 - Guyana","1800A00000","180","1800","180000002110        "]
["1800 - Guyana","8684 - Paramaribo, Suriname","1800C00000","678","6780","678000008684        "]
["1830 - Haiti","2119 - Haiti","1830A00000","183","1830","183000002119        "]
["1830 - Haiti","2776 - Gonaives, Haiti","1830C00000","183","1835","183500002776        "]
["1830 - Haiti","2870 - Les Cayes, Haiti","1830E00000","183","183C","183C00002870        "]
["1830 - Haiti","2885 - Jeremie, Haiti","1830D00000","183","183B","183B00002885        "]
["1830 - Haiti","367 - Port Au Prince, Haiti","1830B00000","183","1830","183000000367        "]
["1860 - Honduras","2125 - Honduras","1860A00000","186","1860","186000002125        "]
["1860 - Honduras","356 - Tegucigalpa, Honduras","1860B00000","186","1860","186000000356        "]
["1950 - Global Shared Service Center","2850 - Global Shared Services Centre","1950A00000","195","1950","195000002850        "]
["1950 - Global Shared Service Center","2851 - Director's Office, GSSC","1950A00100","195","1950","195000002851        "]
["1950 - Global Shared Service Center","2852 - HR Admin Section, GSSC","1950A00200","195","1950","195000002852        "]
["1950 - Global Shared Service Center","2853 - HR Payroll Section, GSSC","1950A00300","195","1950","195000002853        "]
["1950 - Global Shared Service Center","2854 - Global Help Desk Section","1950A00400","195","1950","195000002854        "]
["1950 - Global Shared Service Center","2855 - Finance Section, GSSC","1950A00500","195","1950","195000002855        "]
["1950 - Global Shared Service Center","2856 - Service Management Section","1950A00600","195","1950","195000002856        "]
["2040 - India","1504 - Lucknow, India","2040J00000","204","2045","204500001504        "]
["2040 - India","1511 - Mumbai, India","2040K00000","204","2041","204100001511        "]
["2040 - India","1512 - Calcutta, India","2040E00000","204","2043","204300001512        "]
["2040 - India","1513 - Hyderabad, India","2040H00000","204","2047","204700001513        "]
["2040 - India","1514 - Chennai, India","2040F00000","204","2046","204600001514        "]
["2040 - India","1515 - Patna, India","2040L00000","204","204B","204B00001515        "]
["2040 - India","1542 - Jaipur, India","2040I00000","204","204C","204C00001542        "]
["2040 - India","1543 - Bhopal, India","2040C00000","204","204D","204D00001543        "]
["2040 - India","1632 - Bhubaneshwar, India","2040D00000","204","204F","204F00001632        "]
["2040 - India","1712 - Gandhinagar, India","2040G00000","204","204I","204I00001712        "]
["2040 - India","2064 - India","2040A00000","204","2040","204000002064        "]
["2040 - India","3257 - Guwahati, India","2040M00000","204","204R","204R00003257        "]
["2040 - India","3259 - Raipur, India","2040N00000","204","204T","204T00003259        "]
["2040 - India","3261 - Ranchi, India","2040O00000","204","204S","204S00003261        "]
["2040 - India","327 - New Delhi, India","2040B00000","204","2040","204000000327        "]
["2070 - Indonesia","1548 - Surabaya, Indonesia","2070J00000","207","207D","207D00001548        "]
["2070 - Indonesia","1700 - Makassar, Indonesia","2070C00000","207","207J","207J00001700        "]
["2070 - Indonesia","1701 - Kupang, Indonesia","2070G00000","207","207C","207C00001701        "]
["2070 - Indonesia","1766 - Semarang, Indonesia","2070I00000","207","2074","207400001766        "]
["2070 - Indonesia","1776 - Ambon, Indonesia","2070D00000","207","207H","207H00001776        "]
["2070 - Indonesia","2048 - Indonesia","2070A00000","207","2070","207000002048        "]
["2070 - Indonesia","343 - Jakarta, Indonesia","2070B00000","207","2070","207000000343        "]
["2070 - Indonesia","3891 - Manokwari, Indonesia","2070H00000","207","C207","C20700003891        "]
["2070 - Indonesia","8449 - Jayapura, Irian Jaya, Indonesia","2070F00000","207","2072","207200008449        "]
["2070 - Indonesia","8694 - Banda Aceh, Indonesia","2070E00000","207","207I","207I00008694        "]
["2100 - Iran","2078 - Iran","2100A00000","210","2100","210000002078        "]
["2100 - Iran","382 - Teheran, Iran (Islamic Rep. of)","2100B00000","210","2100","210000000382        "]
["2130 - Iraq","1747 - Zone Office North, Erbil, Iraq","2130G00000","213","2137","213700001747        "]
["2130 - Iraq","2069 - Iraq","2130A00000","213","2130","213000002069        "]
["2130 - Iraq","3460 - Dohuk, Iraq","2130H00000","213","213M","213M00003460        "]
["2130 - Iraq","3463 - Kut, Iraq","2130I00000","213","213G","213G00003463        "]
["2130 - Iraq","3466 - Amarah, Iraq","2130J00000","213","213C","213C00003466        "]
["2130 - Iraq","368 - Baghdad, Iraq","2130B00000","213","2130","213000000368        "]
["2130 - Iraq","4804 - Ar Ramadi, Iraq","2130D00000","213","213J","213J00004804        "]
["2130 - Iraq","4807 - An Najaf, Iraq","2130C00000","213","    ","    00004807        "]
["2130 - Iraq","4810 - Kirkuk, Iraq","2130E00000","213","2139","213900004810        "]
["2130 - Iraq","7067 - Zone Office South, Basrah, Iraq","2130F00000","213","2131","213100007067        "]
["2130 - Iraq","8950 - Iraq Supp Center, Amman (ISCA)","2130K00000","234","2340","234000008950        "]
["2220 - Office of Research, Italy","3323 - Office of Research","2220A00000","222","2224","222400003323        "]
["2220 - Office of Research, Italy","6000 - Research, Florence","2220A00100","222","2224","222400006000        "]
["2250 - Cote D'Ivoire","2004 - Cote D'Ivoire","2250A00000","225","2250","225000002004        "]
["2250 - Cote D'Ivoire","2954 - Korhogo, Cote D'Ivoire","2250E00000","225","2259","225900002954        "]
["2250 - Cote D'Ivoire","350 - Abidjan, Cote d'Ivoire","2250B00000","225","2250","225000000350        "]
["2250 - Cote D'Ivoire","7069 - Bouake, Cote D'Ivoire","2250C00000","225","2252","225200007069        "]
["2250 - Cote D'Ivoire","9027 - Man, Cote d'Ivoire","2250D00000","225","2258","225800009027        "]
["2280 - Jamaica","1506 - Kingston, Jamaica","2280B00000","228","2280","228000001506        "]
["2280 - Jamaica","2113 - Jamaica","2280A00000","228","2280","228000002113        "]
["2340 - Jordan","2066 - Jordan","2340A00000","234","2340","234000002066        "]
["2340 - Jordan","2627 - Ruwayshid, Jordan","2340C00000","234","2341","234100002627        "]
["2340 - Jordan","308 - Amman, Jordan","2340B00000","234","2340","234000000308        "]
["234R - MENA, Jordan","3022 - Reg Serv Division, Amman","234RB00000","234","2340","234000003022        "]
["234R - MENA, Jordan","59 - Amman(MENA)","234RA00000","234","2340","234000000059        "]
["2390 - Kazakhstan","1742 - Astana, Kazakhstan","2390B00000","239","2391","239100001742        "]
["2390 - Kazakhstan","2085 - Kazakstan","2390A00000","239","2390","239000002085        "]
["2390 - Kazakhstan","8670 - Almaty, Kazakhstan","2390C00000","239","2390","239000008670        "]
["2400 - Kenya","1667 - Garissa, Kenya","2400C00000","240","2405","240500001667        "]
["2400 - Kenya","2024 - Kenya","2400A00000","240","2400","240000002024        "]
["2400 - Kenya","2536 - Lodwar, Kenya","2400F00000","240","240E","240E00002536        "]
["2400 - Kenya","331 - Nairobi, Kenya","2400B00000","240","2400","240000000331        "]
["2400 - Kenya","3955 - Dadaab, Kenya","2400E00000","240","240D","240D00003955        "]
["2400 - Kenya","4212 - Kisumu, Kenya","2400D00000","240","2402","240200004212        "]
["240B - Office of Global Innovation","2375 - Office of Global Innovation","240BB00000","456","4560","456000002375        "]
["240B - Office of Global Innovation","2376 - Innovation Section, Kenya, Nairobi","240BB00100","240","2400","240000002376        "]
["240B - Office of Global Innovation","2387 - Innovation Section, O/P Bangkok,Thailand","240BB00200","420","4200","420000002387        "]
["240B - Office of Global Innovation","2388 - Innovation Section, O/P Kampala, Uganda","240BB00300","438","4380","438000002388        "]
["240B - Office of Global Innovation","2576 - Office of Global Innovation, New York","240BB00400","456","4560","456000002576        "]
["240B - Office of Global Innovation","2826 - Innovation Section, Copenhagen Denmark","240BB00500","120","1200","120000002826        "]
["240B - Office of Global Innovation","2827 - Innovation Section, Suva, Fiji","240BB00600","143","1430","143000002827        "]
["240R - ESARO, Kenya","3089 - Reg Serv Division, Nairobi Regn'l","240RB00000","240","2400","240000003089        "]
["240R - ESARO, Kenya","63 - Nairobi Regn'l(ESARO)","240RA00000","240","2400","240000000063        "]
["2450 - Republic of Kyrgyzstan","1743 - Bishkek, Kyrgyzstan Republic","2450B00000","245","2450","245000001743        "]
["2450 - Republic of Kyrgyzstan","2087 - Republic of Kyrgyzstan","2450A00000","245","2450","245000002087        "]
["2450 - Republic of Kyrgyzstan","3482 - Osh, Kyrgyzstan","2450C00000","245","2452","245200003482        "]
["2460 - Lao People's Dem Rep.","2056 - Lao People's Democratic Republic","2460A00000","246","2460","246000002056        "]
["2460 - Lao People's Dem Rep.","344 - Vientiane, Lao People's Dem. Rep.","2460B00000","246","2460","246000000344        "]
["2490 - Lebanon","2070 - Lebanon","2490A00000","249","2490","249000002070        "]
["2490 - Lebanon","2709 - Mount Lebanon, Beirut Lebanon office","2490B01000","249","2490","249000002709        "]
["2490 - Lebanon","3180 - Tyre, Lebanon","2490C00000","249","249D","249D00003180        "]
["2490 - Lebanon","330 - Beirut, Lebanon","2490B00000","249","2490","249000000330        "]
["2520 - Lesotho","2038 - Lesotho","2520A00000","252","2520","252000002038        "]
["2520 - Lesotho","378 - Maseru, Lesotho","2520B00000","252","2520","252000000378        "]
["2550 - Liberia","2017 - Liberia","2550A00000","255","2550","255000002017        "]
["2550 - Liberia","2700 - Zwedru, Liberia","2550C00000","255","2551","255100002700        "]
["2550 - Liberia","2703 - Harper, Liberia","2550D00000","255","2553","255300002703        "]
["2550 - Liberia","374 - Monrovia, Liberia","2550B00000","255","2550","255000000374        "]
["2580 - Libya","1770 - Tripoli, Libyan Arab Rep.","2580B00000","258","2580","258000001770        "]
["2580 - Libya","2079 - Libya","2580A00000","258","2580","258000002079        "]
["2580 - Libya","3860 - Benghazi, Libyan Arab Rep.","2580C00000","258","2582","258200003860        "]
["2660 - Macedonia","1735 - Skopje, Former Yugoslav Rep of Macedonia","2660B00000","266","2660","266000001735        "]
["2660 - Macedonia","2096 - Former Yugoslav Republic of Macedonia","2660A00000","266","2660","266000002096        "]
["2670 - Madagascar","2026 - Madagascar","2670A00000","267","2670","267000002026        "]
["2670 - Madagascar","2521 - Fort Dauphin, Madagascar","2670D00000","267","2673","267300002521        "]
["2670 - Madagascar","304 - Antananarivo, Madagascar","2670B00000","267","2670","267000000304        "]
["2670 - Madagascar","3343 - Ambovombe, Madagascar","2670C00000","267","267A","267A00003343        "]
["2690 - Malawi","2034 - Malawi","2690A00000","269","2692","269200002034        "]
["2690 - Malawi","365 - Lilongwe, Malawi","2690B00000","269","2692","269200000365        "]
["2700 - Malaysia","1524 - Kuala Lumpur, Malaysia","2700B00000","270","2700","270000001524        "]
["2700 - Malaysia","2049 - Malaysia","2700A00000","270","2700","270000002049        "]
["2740 - Maldives","1510 - Male, Maldives","2740B00000","274","2740","274000001510        "]
["2740 - Maldives","2063 - Maldives","2740A00000","274","2740","274000002063        "]
["2760 - Mali","1622 - Mopti, Mali","2760E00000","276","2763","276300001622        "]
["2760 - Mali","1623 - Segou, Mali","2760F00000","276","2764","276400001623        "]
["2760 - Mali","1699 - Kayes, Mali","2760C00000","276","2767","276700001699        "]
["2760 - Mali","1703 - Koulikoro, Mali","2760D00000","276","2768","276800001703        "]
["2760 - Mali","2007 - Mali","2760A00000","276","2760","276000002007        "]
["2760 - Mali","2761 - Gao, Mali","2760G00000","276","2766","276600002761        "]
["2760 - Mali","2764 - Sikasso, Mali","2760H00000","276","276B","276B00002764        "]
["2760 - Mali","2926 - Tombouctou, Mali","2760I00000","276","2765","276500002926        "]
["2760 - Mali","371 - Bamako, Mali","2760B00000","276","2760","276000000371        "]
["2820 - Mauritania","2020 - Mauritania","2820A00000","282","2820","282000002020        "]
["2820 - Mauritania","2227 - Kiffa, Mauritania","2820E00000","282","2822","282200002227        "]
["2820 - Mauritania","2936 - Bassikounou, Mauritania","2820D00000","282","282A","282A00002936        "]
["2820 - Mauritania","3246 - Aioun, Mauritania","2820C00000","282","2829","282900003246        "]
["2820 - Mauritania","334 - Nouakchott, Mauritania","2820B00000","282","2820","282000000334        "]
["2850 - Mexico","2117 - Mexico","2850A00000","285","2850","285000002117        "]
["2850 - Mexico","313 - Mexico City, Mexico","2850B00000","285","2850","285000000313        "]
["2880 - Mongolia","1612 - Ulaanbaatar, Mongolia","2880B00000","288","2880","288000001612        "]
["2880 - Mongolia","2055 - Mongolia","2880A00000","288","2880","288000002055        "]
["2880 - Mongolia","2211 - Khuvsgul, Mongolia","2880D00000","288","2889","288900002211        "]
["2880 - Mongolia","3553 - Khovd City, Mongolia","2880C00000","288","2883","288300003553        "]
["2910 - Morocco","2076 - Morocco","2910A00000","291","2910","291000002076        "]
["2910 - Morocco","337 - Rabat, Morocco","2910B00000","291","2910","291000000337        "]
["2970 - Nepal","1520 - Nepalgunj, Nepal","2970J00000","297","2972","297200001520        "]
["2970 - Nepal","1549 - Biratnager, Nepal","2970D00000","297","2975","297500001549        "]
["2970 - Nepal","2058 - Nepal","2970A00000","297","2970","297000002058        "]
["2970 - Nepal","2136 - Gorkha, Nepal","2970R00000","297","297R","297R00002136        "]
["2970 - Nepal","2138 - Programme Sec, Singhupalchowk, Nepal","2970P00000","297","2979","297900002138        "]
["2970 - Nepal","2139 - Programme Section, Dolakha, Nepal","2970Q00000","297","2979","297900002139        "]
["2970 - Nepal","2141 - Programme Section, Nuwakot, Nepal","2970S00000","297","2979","297900002141        "]
["2970 - Nepal","2561 - Jumla, Nepal","2970O00000","297","2979","297900002561        "]
["2970 - Nepal","324 - Kathmandu, Nepal","2970B00000","297","2970","297000000324        "]
["2970 - Nepal","3705 - Mangalsen, Accham District, Nepal","2970I00000","297","297J","297J00003705        "]
["2970 - Nepal","3714 - Taulihawa, Kapilvastu District, Nepal","2970N00000","297","297N","297N00003714        "]
["2970 - Nepal","3717 - Rajbiraj, Saptari District, Nepal","2970L00000","297","297L","297L00003717        "]
["2970 - Nepal","3728 - Birgang, Parsa District, Nepal","2970E00000","297","297D","297D00003728        "]
["2970 - Nepal","4651 - Dhadheldura, Nepal","2970F00000","297","297B","297B00004651        "]
["2970 - Nepal","4751 - Bharatpur, Nepal","2970C00000","297","297G","297G00004751        "]
["297R - ROSA, Nepal","3062 - Reg Serv Division, Kathmandu","297RB00000","297","2970","297000003062        "]
["297R - ROSA, Nepal","64 - Kathmandu(ROSA)","297RA00000","297","2970","297000000064        "]
["3120 - Nicaragua","2116 - Nicaragua","3120A00000","312","3120","312000002116        "]
["3120 - Nicaragua","353 - Managua, Nicaragua","3120B00000","312","3120","312000000353        "]
["3120 - Nicaragua","4278 - Bilwi, Nicaragua","3120C00000","312","3129","312900004278        "]
["3180 - Niger","1674 - Maradi, Niger","3180D00000","318","3185","318500001674        "]
["3180 - Niger","1749 - Agadez, Niger","3180C00000","318","3186","318600001749        "]
["3180 - Niger","2019 - Niger","3180A00000","318","3180","318000002019        "]
["3180 - Niger","2950 - Diffa, Niger","3180E00000","318","3183","318300002950        "]
["3180 - Niger","363 - Niamey, Niger","3180B00000","318","3180","318000000363        "]
["3210 - Nigeria","1591 - Kaduna, Nigeria","3210E00000","321","3211","321100001591        "]
["3210 - Nigeria","1657 - Bauchi, Nigeria","3210C00000","321","3216","321600001657        "]
["3210 - Nigeria","1672 - Enugu, Nigeria","3210D00000","321","321B","321B00001672        "]
["3210 - Nigeria","1673 - Lagos, Nigeria","3210F00000","321","3210","321000001673        "]
["3210 - Nigeria","2005 - Nigeria","3210A00000","321","3213","321300002005        "]
["3210 - Nigeria","2403 - Port Harcourt Zone Officer, Nigeria","3210J00000","321","321M","321M00002403        "]
["3210 - Nigeria","2406 - Akure Zone Office, Nigeria","3210K00000","321","321N","321N00002406        "]
["3210 - Nigeria","2506 - Maiduguri (Borno), Nigeria","3210G00000","321","321I","321I00002506        "]
["3210 - Nigeria","2509 - Sokoto, Nigeria","3210H00000","321","321K","321K00002509        "]
["3210 - Nigeria","2531 - Katsina, Nigeria","3210I00000","321","321J","321J00002531        "]
["3210 - Nigeria","336 - Abuja, Nigeria","3210B00000","321","3213","321300000336        "]
["3300 - Pakistan","1507 - Peshawar, Pakistan","3300E00000","330","3306","330600001507        "]
["3300 - Pakistan","1522 - Quetta, Pakistan","3300F00000","330","3307","330700001522        "]
["3300 - Pakistan","1534 - Karachi, Pakistan","3300C00000","330","3301","330100001534        "]
["3300 - Pakistan","1539 - Lahore, Pakistan","3300D00000","330","3302","330200001539        "]
["3300 - Pakistan","2061 - Pakistan","3300A00000","330","3300","330000002061        "]
["3300 - Pakistan","342 - Islamabad, Pakistan","3300B00000","330","3300","330000000342        "]
["3300 - Pakistan","4880 - Dubai, UAE (Pakistan Programme)","3300G00000","449","4493","449300004880        "]
["3330 - Panama","1661 - Panama City, Panama","3330B00000","333","3330","333000001661        "]
["3330 - Panama","2102 - Panama","3330A00000","333","3330","333000002102        "]
["333R - LACRO, Panama","2126 - Regional Services Division, LACRO","333RB00000","333","3330","333000002126        "]
["333R - LACRO, Panama","2225 - Panama Hub","333RC00000","333","3330","333000002225        "]
["333R - LACRO, Panama","67 - Latin America and Caribbean Regional Off","333RA00000","333","3330","333000000067        "]
["3360 - Paraguay","1595 - Asuncion, Paraguay","3360B00000","336","3360","336000001595        "]
["3360 - Paraguay","2103 - Paraguay","3360A00000","366","3660","366000002103        "]
["3380 - Congo","2011 - Congo","3380A00000","338","3380","338000002011        "]
["3380 - Congo","301 - Brazzaville, Congo","3380B00000","338","3380","338000000301        "]
["3380 - Congo","8772 - Pointe Noire, Congo","3380C00000","338","3381","338100008772        "]
["3390 - Peru","2115 - Peru","3390A00000","339","3390","339000002115        "]
["3390 - Peru","312 - Lima, Peru","3390B00000","339","3390","339000000312        "]
["3420 - Philippines","2050 - Philippines","3420A00000","342","3420","342000002050        "]
["3420 - Philippines","2253 - Tacloban, Philippines","3420F00000","342","342L","342L00002253        "]
["3420 - Philippines","2527 - Davao, Philippines","3420D00000","342","3427","342700002527        "]
["3420 - Philippines","2753 - Zamboanga, Philippines","3420H00000","342","3429","342900002753        "]
["3420 - Philippines","318 - Manila, Philippines","3420B00000","342","3420","342000000318        "]
["3420 - Philippines","4827 - Cotabato, Philippines","3420C00000","342","3425","342500004827        "]
["3660 - Romania","2088 - Romania","3660A00000","366","3660","366000002088        "]
["3660 - Romania","383 - Bucharest, Romania","3660B00000","366","3660","366000000383        "]
["3750 - Rwanda","2033 - Rwanda","3750A00000","375","3750","375000002033        "]
["3750 - Rwanda","366 - Kigali, Rwanda","3750B00000","375","3750","375000000366        "]
["3780 - Saudi Arabia","2067 - Saudi Arabia","3780A00000","378","3780","378000002067        "]
["3780 - Saudi Arabia","358 - Riyadh, Gulf Area Office","3780B00000","378","3780","378000000358        "]
["3780 - Saudi Arabia","7015 - Abu Dhabi, Gulf Area","3780C00000","449","4490","449000007015        "]
["3780 - Saudi Arabia","7016 - Kuwait, Gulf Area","3780F00000","243","2430","243000007016        "]
["3780 - Saudi Arabia","7017 - Bahrain, Gulf Area","3780D00000","604","6041","604100007017        "]
["3780 - Saudi Arabia","7018 - Qatar, Gulf Area","3780G00000","624","6240","624000007018        "]
["3780 - Saudi Arabia","9044 - Dubai, Gulf Area","3780E00000","449","4493","449300009044        "]
["3810 - Senegal","2000 - Senegal","3810A00000","381","3810","381000002000        "]
["3810 - Senegal","302 - Dakar, Senegal","3810B00000","381","3810","381000000302        "]
["3810 - Senegal","8866 - Ziguinchor, Senegal","3810C00000","381","3814","381400008866        "]
["381R - WCARO, Senegal","61 - Dakar (WCAR), Senegal","381RA00000","381","3810","381000000061        "]
["381R - WCARO, Senegal","8455 - Reg Services Div (WCARO), Dakar","381RB00000","381","3810","381000008455        "]
["3900 - Sierra Leone","2014 - Sierra Leone","3900A00000","390","3900","390000002014        "]
["3900 - Sierra Leone","372 - Freetown, Sierra Leone","3900B00000","390","3900","390000000372        "]
["3900 - Sierra Leone","8387 - Kenema, Sierra Leone","3900C00000","390","3901","390100008387        "]
["3900 - Sierra Leone","8777 - Makeni, Sierra Leone","3900D00000","390","3904","390400008777        "]
["3920 - Somalia","1501 - Hargeisa, Somalia","3920F00000","392","3923","392300001501        "]
["3920 - Somalia","1538 - Nairobi Somalia Desk, Kenya","3920J00000","240","2400","240000001538        "]
["3920 - Somalia","1555 - Baidoa, Somalia","3920C00000","392","392B","392B00001555        "]
["3920 - Somalia","1621 - Bosaso, Somalia","3920D00000","392","392C","392C00001621        "]
["3920 - Somalia","1665 - Jowhar, Somalia","3920G00000","392","392F","392F00001665        "]
["3920 - Somalia","2040 - Somalia","3920A00000","392","3920","392000002040        "]
["3920 - Somalia","2233 - Dollow, Somalia","3920K00000","392","3929","392900002233        "]
["3920 - Somalia","3282 - Gaalkacyo, Somalia","3920H00000","392","392S","392S00003282        "]
["3920 - Somalia","3285 - Wajid, Somalia","3920I00000","392","392T","392T00003285        "]
["3920 - Somalia","335 - Mogadiscio, Somalia","3920B00000","392","3920","392000000335        "]
["3920 - Somalia","3605 - Garoowe, Somalia","3920E00000","392","392K","392K00003605        "]
["3930 - South Africa","2042 - South Africa","3930A00000","393","3930","393000002042        "]
["3930 - South Africa","386 - Pretoria, South Africa","3930B00000","393","3930","393000000386        "]
["4020 - Sudan","1518 - Kadugli, Sudan","4020H00000","402","402C","402C00001518        "]
["4020 - Sudan","1552 - El Obeid, Sudan","4020G00000","402","402B","402B00001552        "]
["4020 - Sudan","1641 - El Fasher, Sudan","4020E00000","402","402A","402A00001641        "]
["4020 - Sudan","2081 - Sudan","4020A00000","402","4020","402000002081        "]
["4020 - Sudan","345 - Khartoum, Sudan","4020B00000","402","4020","402000000345        "]
["4020 - Sudan","3926 - Kassala, Sudan","4020I00000","402","402S","402S00003926        "]
["4020 - Sudan","3929 - Ad Damazine, Sudan","4020D00000","402","Z002","Z00200003929        "]
["4020 - Sudan","3932 - Abyei, Sudan","4020C00000","402","E402","E40200003932        "]
["4020 - Sudan","4230 - Zalinguei, Sudan","4020K00000","402","S402","S40200004230        "]
["4020 - Sudan","8691 - Nyala, Sudan","4020J00000","402","402Q","402Q00008691        "]
["4020 - Sudan","8973 - El Geneina, Sudan","4020F00000","402","4020","402000008973        "]
["4030 - Swaziland","1517 - Mbabane, Swaziland","4030B00000","403","4030","403000001517        "]
["4030 - Swaziland","2039 - Swaziland","4030A00000","403","4030","403000002039        "]
["4040 - South Sudan","1687 - Juba, South Sudan","4040B00000","404","4040","404000001687        "]
["4040 - South Sudan","1695 - Yambio, South Sudan","4040K00000","404","4042","404200001695        "]
["4040 - South Sudan","2130 - South Sudan","4040A00000","404","4040","404000002130        "]
["4040 - South Sudan","2361 - Juba Zone Office, South Sudan","4040B10000","404","4040","404000002361        "]
["4040 - South Sudan","3454 - Bor, South Sudan","4040F00000","404","4044","404400003454        "]
["4040 - South Sudan","3456 - Torit, South Sudan","4040G00000","404","4041","404100003456        "]
["4040 - South Sudan","3458 - Kwajok, South Sudan","4040H00000","404","4048","404800003458        "]
["4040 - South Sudan","3752 - Wau, South Sudan","4040E00000","404","4046","404600003752        "]
["4040 - South Sudan","3776 - Malakal, South Sudan","4040C00000","404","4043","404300003776        "]
["4040 - South Sudan","3826 - Bentiu, South Sudan","4040I00000","404","4045","404500003826        "]
["4040 - South Sudan","3908 - Aweil, South Sudan","4040J00000","404","F402","F40200003908        "]
["4040 - South Sudan","8687 - Rumbek, South Sudan","4040D00000","404","4049","404900008687        "]
["4140 - Syria","1614 - Damascus, Syria","4140B00000","414","4140","414000001614        "]
["4140 - Syria","2072 - Syria","4140A00000","414","4140","414000002072        "]
["4140 - Syria","2650 - Homs, Syria","4140C00000","414","414C","414C00002650        "]
["4140 - Syria","2652 - Tartous, Syria","4140D00000","414","414B","414B00002652        "]
["4140 - Syria","2654 - Qamishli, Syria","4140E00000","414","414G","414G00002654        "]
["4140 - Syria","2656 - Dara'a, Syria","4140F00000","414","414F","414F00002656        "]
["4140 - Syria","2658 - Damascus Hub, Syria","4140G00000","414","4140","414000002658        "]
["4140 - Syria","2662 - Aleppo, Syria","4140H00000","414","4142","414200002662        "]
["4150 - Tajikistan","1746 - Dushanbe, Tajikistan","4150B00000","415","4150","415000001746        "]
["4150 - Tajikistan","2090 - Tajikistan","4150A00000","415","4150","415000002090        "]
["4200 - Thailand","2044 - Thailand","4200A00000","420","4200","420000002044        "]
["4200 - Thailand","316 - Bangkok, Thailand","4200B00000","420","4200","420000000316        "]
["420R - EAPRO, Thailand","3021 - Regional Services Division, Bangkok","420RB00000","420","4200","420000003021        "]
["420R - EAPRO, Thailand","60 - Bangkok (EAPRO), Thailand","420RA00000","420","4200","420000000060        "]
["4230 - Togo","2016 - Togo","4230A00000","423","4230","423000002016        "]
["4230 - Togo","375 - Lome, Togo","4230B00000","423","4230","423000000375        "]
["4320 - Tunisia","2080 - Tunisia","4320A00000","432","4320","432000002080        "]
["4320 - Tunisia","377 - Tunis, Tunisia","4320B00000","432","4320","432000000377        "]
["4350 - Turkey","2083 - Turkey","4350A00000","435","4350","435000002083        "]
["4350 - Turkey","2686 - Gaziantep, Turkey","4350C00000","435","4351","435100002686        "]
["4350 - Turkey","373 - Ankara, Turkey","4350B00000","435","4350","435000000373        "]
["4360 - Rep. of Turkmenistan","1744 - Ashkhabad, Rep. of Turkmenistan","4360B00000","436","4360","436000001744        "]
["4360 - Rep. of Turkmenistan","2084 - Republic of Turkmenistan","4360A00000","436","4360","436000002084        "]
["4380 - Uganda","2032 - Uganda","4380A00000","438","4380","438000002032        "]
["4380 - Uganda","2230 - Mbarara, Uganda","4380F00000","438","4386","438600002230        "]
["4380 - Uganda","364 - Kampala, Uganda","4380B00000","438","4380","438000000364        "]
["4380 - Uganda","4227 - Moroto, Uganda","4380E00000","438","4385","438500004227        "]
["4380 - Uganda","4643 - Fort Portal, Uganda","4380C00000","438","438K","438K00004643        "]
["4380 - Uganda","8960 - Gulu, Uganda","4380D00000","438","4388","438800008960        "]
["4410 - Ukraine","1768 - Kiev, Ukraine","4410B00000","441","4410","441000001768        "]
["4410 - Ukraine","2091 - Ukraine","4410A00000","441","4410","441000002091        "]
["4410 - Ukraine","2160 - Luhansk, Ukraine","4410H00000","441","441D","441D00002160        "]
["4410 - Ukraine","2750 - Kharkiv, Ukraine","4410C00000","441","4414","441400002750        "]
["4410 - Ukraine","2801 - Dnepropetrovsk, Ukraine","4410G00000","441","4416","441600002801        "]
["4410 - Ukraine","2875 - Donetsk, Ukraine","4410D00000","441","4412","441200002875        "]
["4410 - Ukraine","2900 - Mariupol, Ukraine","4410E00000","441","4418","441800002900        "]
["4410 - Ukraine","2903 - Kramatorsk, Ukraine","4410F00000","441","441E","441E00002903        "]
["4500 - Egypt","2071 - Egypt","4500A00000","450","4500","450000002071        "]
["4500 - Egypt","2726 - Alexandria, Egypt","4500D00000","450","4501","450100002726        "]
["4500 - Egypt","329 - Cairo, Egypt","4500B00000","450","4500","450000000329        "]
["4500 - Egypt","3479 - Asyut, Egypt","4500C00000","450","4503","450300003479        "]
["4550 - United Rep. of Tanzania","1589 - Zanzibar, United Rep. of Tanzania","4550D00000","455","4554","455400001589        "]
["4550 - United Rep. of Tanzania","2029 - United Repubic of Tanzania","4550A00000","455","4550","455000002029        "]
["4550 - United Rep. of Tanzania","2518 - Iringa, United Rep. of Tanzania","4550E00000","455","4557","455700002518        "]
["4550 - United Rep. of Tanzania","2713 - Mbeya, United Rep. of Tanzania","4550F00000","455","4559","455900002713        "]
["4550 - United Rep. of Tanzania","305 - Dar Es Salaam, United Rep. of Tanzania","4550B00000","455","4550","455000000305        "]
["4550 - United Rep. of Tanzania","8676 - Kibondo, Tanzania","4550G00000","455","455C","455C00008676        "]
["456B - Executive Director's Office","3001 - Executive Director's Office, UNICEF NYHQ","456BB00000","456","4560","456000003001        "]
["456B - Executive Director's Office","3411 - Office of Ombudsperson, OED, UNICEF NYHQ","456BB00200","456","4560","456000003411        "]
["456B - Executive Director's Office","5001 - Off of Executive Director, UNICEF NYHQ","456BB00100","456","4560","456000005001        "]
["456C - Data, Research and Policy","2459 - Our UNICEF","456CC01000","456","4560","456000002459        "]
["456C - Data, Research and Policy","3030 - Data, Research and Policy","456CC00000","456","4560","456000003030        "]
["456C - Data, Research and Policy","3307 - Data and Analytics","456CC00200","456","4560","456000003307        "]
["456C - Data, Research and Policy","3768 - Country Programming, Accountability & KM","456CC00300","456","4560","456000003768        "]
["456C - Data, Research and Policy","5123 - Policy, Strategy and Network","456CC00500","456","4560","456000005123        "]
["456C - Data, Research and Policy","6256 - Director's Office, DRP","456CC00100","456","4560","456000006256        "]
["456D - Programme Division","2311 - Gender and Rights","456DD00900","456","4560","456000002311        "]
["456D - Programme Division","2312 - Communication for Development","456DD01000","456","4560","456000002312        "]
["456D - Programme Division","2313 - Adolescent Development and Participation","456DD01100","456","4560","456000002313        "]
["456D - Programme Division","2314 - Children with Disability","456DD01200","456","4560","456000002314        "]
["456D - Programme Division","2325 - Early Childhood Development","456DD01400","456","4560","456000002325        "]
["456D - Programme Division","2534 - Glob Part to End Violence Against Childr","456DD01600","456","4560","456000002534        "]
["456D - Programme Division","2757 - Education Secretariat","456DD01700","456","4560","456000002757        "]
["456D - Programme Division","2758 - Humanitarian Action & Transition","456DD01800","456","4560","456000002758        "]
["456D - Programme Division","2759 - Human Rights","456DD01900","456","4560","456000002759        "]
["456D - Programme Division","2760 - WASH Secretariat","456DD02000","456","4560","456000002760        "]
["456D - Programme Division","2768 - Program Support Unit","456DD02100","456","4560","456000002768        "]
["456D - Programme Division","2988 - Secretariats, Programme Division","456DD01300","456","4560","456000002988        "]
["456D - Programme Division","3003 - Programme Division, UNICEF NYHQ","456DD00000","456","4560","456000003003        "]
["456D - Programme Division","3308 - Social Inclusion and Policy","456CC00600","456","4560","456000003308        "]
["456D - Programme Division","5004 - Nutrition Section, UNICEF NYHQ","456DD00700","456","4560","456000005004        "]
["456D - Programme Division","5067 - Water and Sanitation Sec, UNICEF NYHQ","456DD00800","456","4560","456000005067        "]
["456D - Programme Division","5125 - Off of Director-Prog Div, UNICEF NYHQ","456DD00100","456","4560","456000005125        "]
["456D - Programme Division","5376 - Health Section, UNICEF NYHQ","456DD00500","456","4560","456000005376        "]
["456D - Programme Division","5417 - Education Section, UNICEF NYHQ","456DD00600","456","4560","456000005417        "]
["456D - Programme Division","6320 - Child Protection Section, UNICEF NYHQ","456DD00200","456","4560","456000006320        "]
["456D - Programme Division","8451 - Civil Society Partnerhips, New York","456DD00300","456","4560","456000008451        "]
["456D - Programme Division","8760 - HIV/AIDS Sec, Programme Division, NY","456DD00400","456","4560","456000008760        "]
["456F - Office of Emergency Prog.","3084 - Office of Emer Operations, UNICEF NYHQ","456FF00000","456","4560","456000003084        "]
["456F - Office of Emergency Prog.","5421 - Off of Emergency Prog, Geneva","456FF00200","575","5750","575000005421        "]
["456F - Office of Emergency Prog.","6113 - Off of Emergency Prog, UNICEF NYHQ","456FF00100","456","4560","456000006113        "]
["456G - Division of Communication","3029 - Division of Communication, UNICEF NYHQ","456GG00000","456","4560","456000003029        "]
["456G - Division of Communication","3756 - Public Advocacy","456GG00900","456","4560","456000003756        "]
["456G - Division of Communication","3757 - Publications","456GG01000","456","4560","456000003757        "]
["456G - Division of Communication","3759 - Social and Civic Media","456GG01200","456","4560","456000003759        "]
["456G - Division of Communication","3761 - Brand Building","456GG01400","456","4560","456000003761        "]
["456G - Division of Communication","3766 - Media Relations","456GG01500","456","4560","456000003766        "]
["456G - Division of Communication","4052 - Goodwill Ambassador Relations, New York","456GG00500","456","4560","456000004052        "]
["456G - Division of Communication","5102 - Off of the Dir - Div of Com, UNICEF NYHQ","456GG00100","456","4560","456000005102        "]
["456G - Division of Communication","5113 - Media Section, UNICEF NYHQ","456GG00600","456","4560","456000005113        "]
["456G - Division of Communication","5116 - Digital Strategy","456GG00700","456","4560","456000005116        "]
["456H - Gov. & Multilateral  Affairs","3002 - Off of Governance, UN & Multilateral Aff","456HH00000","456","4560","456000003002        "]
["456H - Gov. & Multilateral  Affairs","3002 - Office of UN Affairs, UNICEF NYHQ","456HH00000","456","4560","456000003002        "]
["456H - Gov. & Multilateral  Affairs","3334 - Gov, UN & Multilateral  Aff -  Dir Off","456HH00100","456","4560","456000003334        "]
["456H - Gov. & Multilateral  Affairs","3335 - Multilateral Sys Analysis incl IFIs","456HH00200","456","4560","456000003335        "]
["456H - Gov. & Multilateral  Affairs","3336 - UN Coherence","456HH00300","456","4560","456000003336        "]
["456H - Gov. & Multilateral  Affairs","5002 - Off of UN and Intergovernmental Affairs","456HH00500","456","4560","456000005002        "]
["456I - Public Partnerships Division","2675 - Government Partnerships","456II00400","456","4560","456000002675        "]
["456I - Public Partnerships Division","2676 - Multilateral & Intergovernmental Partner","456II00500","456","4560","456000002676        "]
["456I - Public Partnerships Division","2677 - Post 2015","456II00600","456","4560","456000002677        "]
["456I - Public Partnerships Division","2976 - Unicef Geneva Liaison Office, PPD","456II00700","575","5750","575000002976        "]
["456I - Public Partnerships Division","3007 - Public Partnerships Division","456II00000","456","4560","456000003007        "]
["456I - Public Partnerships Division","3858 - PPD, South Korea","456II00800","567","5670","567000003858        "]
["456I - Public Partnerships Division","5011 - Director's Office, PPD NY","456II00100","456","4560","456000005011        "]
["456I - Public Partnerships Division","5320 - PPD, Tokyo","456II00300","231","2310","231000005320        "]
["456I - Public Partnerships Division","6700 - PPD, Brussels","456II00200","048","0480","048000006700        "]
["456J - Div. of Finance & Admin Mgmt","3008 - Div of Fin and Adm Mgmt, UNICEF NYHQ","456JJ00000","456","4560","456000003008        "]
["456J - Div. of Finance & Admin Mgmt","3953 - IPSAS, IT Investments Division","456JJ00600","456","4560","456000003953        "]
["456J - Div. of Finance & Admin Mgmt","5012 - Financial Reporting and Grant Management","456JJ00300","456","4560","456000005012        "]
["456J - Div. of Finance & Admin Mgmt","5015 - Treasury and Structured Finance Services","456JJ00200","456","4560","456000005015        "]
["456J - Div. of Finance & Admin Mgmt","5094 - Off of Comptroller, DFAM, UNICEF NYHQ","456JJ00100","456","4560","456000005094        "]
["456J - Div. of Finance & Admin Mgmt","5143 - Strategic Resource Management Section","456JJ00400","456","4560","456000005143        "]
["456J - Div. of Finance & Admin Mgmt","5149 - Administrative Management Section","456JJ00500","456","4560","456000005149        "]
["456K - Division of Human Resources","2143 - Strategic Planning and Operations","456KK01700","456","4560","456000002143        "]
["456K - Division of Human Resources","2145 - HQ Liaison, Insurance and Compensation","456KK01800","456","4560","456000002145        "]
["456K - Division of Human Resources","2939 - Emergencies & Surge Recruitment Section","456KK01500","456","4560","456000002939        "]
["456K - Division of Human Resources","2940 - Regular Recruitment Section","456KK01600","456","4560","456000002940        "]
["456K - Division of Human Resources","3009 - Division of Human Resources, UNICEF NYHQ","456KK00000","456","4560","456000003009        "]
["456K - Division of Human Resources","3333 - New Emerging Talent Sec, DHR","456KK00600","456","4560","456000003333        "]
["456K - Division of Human Resources","3408 - Mobility and Staffing Section","456KK00300","456","4560","456000003408        "]
["456K - Division of Human Resources","3409 - Staff Well Being Section","456KK00200","456","4560","456000003409        "]
["456K - Division of Human Resources","3982 - HR Business Partner, Programme & Policy","456KK00900","456","4560","456000003982        "]
["456K - Division of Human Resources","3983 - HR Business Partner, Operations","456KK01000","456","4560","456000003983        "]
["456K - Division of Human Resources","3984 - HR Business Partner, External Rel & COD","456KK01100","456","4560","456000003984        "]
["456K - Division of Human Resources","3985 - HR Business Partner, Emergencies","456KK01200","456","4560","456000003985        "]
["456K - Division of Human Resources","3986 - NY Staff Association","456KK01300","456","4560","456000003986        "]
["456K - Division of Human Resources","5013 - Office of the Director-DHR, UNICEF NYHQ","456KK00100","456","4560","456000005013        "]
["456K - Division of Human Resources","5162 - Performance Management and Career Dev","456KK00400","456","4560","456000005162        "]
["456K - Division of Human Resources","5163 - Human Resources Services and Systems","456KK00500","456","4560","456000005163        "]
["456K - Division of Human Resources","5171 - Global Staff Association, UNICEF NYHQ","456KK00700","456","4560","456000005171        "]
["456K - Division of Human Resources","8423 - UNICEF Staff News M&A","456KK01400","456","4560","456000008423        "]
["456K - Division of Human Resources","8447 - Policy & Admin Law Sec, DHR, UNICEF NYHQ","456KK00800","456","4560","456000008447        "]
["456L - InfoTech Solutions & Services","2857 - Strategy Risk Management & Govenance","456LL01000","456","4560","456000002857        "]
["456L - InfoTech Solutions & Services","2858 - Solutions Center and Support","456LL01100","456","4560","456000002858        "]
["456L - InfoTech Solutions & Services","2859 - Platfrom and Srvice Delivery","456LL01200","456","4560","456000002859        "]
["456L - InfoTech Solutions & Services","2860 - ICT Business Relationship Management-FRG","456LL01300","456","4560","456000002860        "]
["456L - InfoTech Solutions & Services","2867 - ICT Business Relationship Management-Par","456LL01400","456","4560","456000002867        "]
["456L - InfoTech Solutions & Services","2868 - ICT Business Relationship Management-Prg","456LL01500","456","4560","456000002868        "]
["456L - InfoTech Solutions & Services","2869 - ICT Business Relationship Management-Man","456LL01600","456","4560","456000002869        "]
["456L - InfoTech Solutions & Services","3005 - Information and Communication Technology","456LL00000","456","4560","456000003005        "]
["456L - InfoTech Solutions & Services","3329 - Plans, Polices and Prod Assurance, ITD","456LL00200","456","4560","456000003329        "]
["456L - InfoTech Solutions & Services","4631 - Administrative Services, ITSSD NY","456LL00300","456","4560","456000004631        "]
["456L - InfoTech Solutions & Services","5008 - ICTD Director's Office","456LL00100","456","4560","456000005008        "]
["456L - InfoTech Solutions & Services","5097 - IT Applications Cross Functional Service","456LL00500","456","4560","456000005097        "]
["456L - InfoTech Solutions & Services","5156 - IT Operations and Services","456LL00700","456","4560","456000005156        "]
["456L - InfoTech Solutions & Services","5159 - IT KMS (Internet Services)","456LL00400","456","4560","456000005159        "]
["456L - InfoTech Solutions & Services","6102 - Technical Architecture Sec, UNICEF NYHQ","456LL00600","456","4560","456000006102        "]
["456L - InfoTech Solutions & Services","8441 - ITSS Applications Functional Services","456LL00900","456","4560","456000008441        "]
["456L - InfoTech Solutions & Services","8801 - IT Security, ITSS, NY","456LL00800","456","4560","456000008801        "]
["456N - Int. Audit & Invest (OIAI)","3023 - Office of Internal Audit & Investigation","456NN00000","456","4560","456000003023        "]
["456N - Int. Audit & Invest (OIAI)","5085 - Internal Audit & Investigation","456NN00100","456","4560","456000005085        "]
["456O - Evaluation Office","8805 - Evaluation Office, New York","456OO00000","456","4560","456000008805        "]
["456O - Evaluation Office","8806 - Evaluation Office, New York","456OO00100","456","4560","456000008806        "]
["456Q - GSSC Project","4378 - GSSC Project Section","456QQ00100","456","4560","456000004378        "]
["456R - Field Results Group Office","2680 - Field Results Group Office","456RR00000","456","4560","456000002680        "]
["456R - Field Results Group Office","2681 - Field Results Group Section","456RR00100","456","4560","456000002681        "]
["456S - OSEB","2678 - Office of the Secretary of the Ex Board","456SS00000","456","4560","456000002678        "]
["456S - OSEB","5089 - Office of the Sec of the ExBoard Section","456SS00100","456","4560","456000005089        "]
["456T - UNICEF Hosted Funds","2157 - UNITED HOSTED FUNDS","456TT00000","   ","    ","    00002157        "]
["456T - UNICEF Hosted Funds","2158 - END VIOLENCE AGAINST CHILDREN","456TT00100","456","4560","456000002158        "]
["456T - UNICEF Hosted Funds","2159 - EDUCATION CANT WAIT","456TT00200","456","4560","456000002159        "]
["4590 - Burkina Faso","2021 - Burkina Faso","4590A00000","459","4590","459000002021        "]
["4590 - Burkina Faso","2553 - Dori, Burkina Faso","4590C00000","459","4591","459100002553        "]
["4590 - Burkina Faso","332 - Ouagadougou, Burkina-Faso","4590B00000","459","4590","459000000332        "]
["4620 - Uruguay","1615 - Montevideo, Uruguay","4620B00000","462","4620","462000001615        "]
["4620 - Uruguay","2118 - Uruguay","4620A00000","462","4620","462000002118        "]
["4630 - Rep of Uzbekistan","1745 - Tashkent, Rep. of Uzbekistan","4630B00000","463","4630","463000001745        "]
["4630 - Rep of Uzbekistan","2098 - Republic of Uzbekistan","4630A00000","463","4630","463000002098        "]
["4710 - Venezuela","1696 - Caracas, Venezuela","4710B00000","471","4710","471000001696        "]
["4710 - Venezuela","2109 - Venezuela","4710A00000","471","4710","471000002109        "]
["4920 - Yemen","2077 - Yemen","4920A00000","492","4920","492000002077        "]
["4920 - Yemen","2450 - Mukalah, YEMEN","4920K00000","492","4929","492900002450        "]
["4920 - Yemen","346 - Sana'a, Yemen","4920B00000","492","4920","492000000346        "]
["4920 - Yemen","3820 - Sa'ada, Yemen","4920F00000","492","492D","492D00003820        "]
["4920 - Yemen","3831 - Seyoun, Yemen","4920G00000","492","3959","395900003831        "]
["4920 - Yemen","3993 - Harad, Yemen","4920H00000","492","4927","492700003993        "]
["4920 - Yemen","4876 - Ta'izz,  Republic of Yemen","4920E00000","492","4921","492100004876        "]
["4920 - Yemen","7026 - Aden, Yemen","4920C00000","492","3950","395000007026        "]
["4920 - Yemen","7029 - Dhale, Yemen","4920I00000","492","4926","492600007029        "]
["4920 - Yemen","7031 - Hodaidah, Yemen","4920D00000","492","4928","492800007031        "]
["4920 - Yemen","7032 - Ibb, Yemen","4920J00000","492","492A","492A00007032        "]
["4980 - Zambia","2036 - Zambia","4980A00000","498","4980","498000002036        "]
["4980 - Zambia","357 - Lusaka, Zambia","4980B00000","498","4980","498000000357        "]
["5070 - Bangladesh","1562 - Barisal, Bangladesh","5070C00000","507","5073","507300001562        "]
["5070 - Bangladesh","1564 - Mymensingh, Bangladesh","5070G00000","507","5075","507500001564        "]
["5070 - Bangladesh","2060 - Bangladesh","5070A00000","507","5070","507000002060        "]
["5070 - Bangladesh","2427 - Cox Bazaar, Bangladesh","5070E00000","507","5078","507800002427        "]
["5070 - Bangladesh","340 - Dhaka, Bangladesh","5070B00000","507","5070","507000000340        "]
["5070 - Bangladesh","3773 - Bogra, Bangladesh","5070L00000","507","5072","507200003773        "]
["5070 - Bangladesh","3782 - Khulna, Bangladesh","5070N00000","507","5077","507700003782        "]
["5070 - Bangladesh","3785 - Chittagong, Bangladesh","5070M00000","507","5071","507100003785        "]
["5070 - Bangladesh","8839 - Rangamati, Bangladesh","5070H00000","507","507B","507B00008839        "]
["5070 - Bangladesh","8850 - Rangpur, Bangladesh","5070I00000","507","507F","507F00008850        "]
["5070 - Bangladesh","8856 - Sylhet, Bangladesh","5070J00000","507","507I","507I00008856        "]
["5150 - DP Republic of Korea","1738 - Pyongyang, DPRK","5150B00000","515","5150","515000001738        "]
["5150 - DP Republic of Korea","2054 - Democratic People's Republic of Korea","5150A00000","515","5150","515000002054        "]
["5200 - Vietnam","1575 - Ho Chi Minh Cty, Vietnam","5200C00000","520","5200","520000001575        "]
["5200 - Vietnam","2047 - Vietnam","5200A00000","520","5200","520000002047        "]
["5200 - Vietnam","341 - Hanoi, Vietnam","5200B00000","520","5205","520500000341        "]
["5640 - Moldova","1611 - Chisinau, Moldova","5640B00000","564","5640","564000001611        "]
["5640 - Moldova","2089 - Moldova","5640A00000","564","5640","564000002089        "]
["5750 - Switzerland","2177 - Deputy Director - PSE and MSP & Pl","5750A00501","575","5750","575000002177        "]
["5750 - Switzerland","2178 - Strategic Planning, Info & Inv Funds","5750A00102","575","5750","575000002178        "]
["5750 - Switzerland","2179 - Global Philanthropy","5750A00604","575","5750","575000002179        "]
["5750 - Switzerland","2180 - Market Development","5750A00607","575","5750","575000002180        "]
["5750 - Switzerland","2200 - Strategic Planning","5750P00102","575","5750","575000002200        "]
["5750 - Switzerland","2201 - Strategic Info & Inv Funds","5750A00608","575","5750","575000002201        "]
["5750 - Switzerland","2303 - Advocacy and Innovative Partnerships","5750A00503","575","5750","575000002303        "]
["5750 - Switzerland","2511 - Country Office Development and Support","5750A00101","575","5750","575000002511        "]
["5750 - Switzerland","3043 - Private Fund Raising and Partnerships","5750A00000","575","5750","575000003043        "]
["5750 - Switzerland","3352 - Children's Rights and Business","5750A00700","575","5750","575000003352        "]
["5750 - Switzerland","3353 - Child Rights Advocacy & Educ for Develop","5750A00600","575","5750","575000003353        "]
["5750 - Switzerland","3519 - Market Knowledge","5750A00602","575","5750","575000003519        "]
["5750 - Switzerland","3541 - Fundraising Services","5750A00603","575","5750","575000003541        "]
["5750 - Switzerland","3542 - Programme Services","5750A00605","575","5750","575000003542        "]
["5750 - Switzerland","3543 - Deputy Director NatCom Relations","5750A00901","575","5750","575000003543        "]
["5750 - Switzerland","3544 - Communication","5750A00800","575","5750","575000003544        "]
["5750 - Switzerland","3545 - Relationship Team III","5750P00904","575","5750","575000003545        "]
["5750 - Switzerland","3546 - Governance","5750A00906","575","5750","575000003546        "]
["5750 - Switzerland","3979 - Corporate Social Responsibility,New York","5750A00500","456","4560","456000003979        "]
["5750 - Switzerland","3987 - Common Services Geneva, Finance","5750A00300","575","5750","575000003987        "]
["5750 - Switzerland","3988 - Common Services Geneva, Info Comm Tech","5750A00100","575","5750","575000003988        "]
["5750 - Switzerland","3989 - Common Services Geneva, Human Resources","5750A00301","575","5750","575000003989        "]
["5750 - Switzerland","8119 - Marketing and Business Development","5750P00704","575","5750","575000008119        "]
["5750 - Switzerland","8147 - Procurement","5750A00203","575","5750","575000008147        "]
["5750 - Switzerland","8149 - Quality Management Standards & Systems","5750P00703","575","5750","575000008149        "]
["5750 - Switzerland","8151 - Finance","5750A00202","575","5750","575000008151        "]
["5750 - Switzerland","8398 - Relationship Team I","5750A00902","575","5750","575000008398        "]
["5750 - Switzerland","8723 - Supply Chain","5750P00702","575","5750","575000008723        "]
["5750 - Switzerland","8724 - Relationship Team II","5750A00903","575","5750","575000008724        "]
["5750 - Switzerland","8796 - Common Services Geneva, Operations","575CA00200","575","5750","575000008796        "]
["5750 - Switzerland","8880 - Director's Office","5750A00103","575","5750","575000008880        "]
["5750 - Switzerland","8881 - Deputy Director Operations & Finance","5750A00201","575","5750","575000008881        "]
["5750 - Switzerland","8939 - Deputy Director Central Fundraising","5750A00601","575","5750","575000008939        "]
["5750 - Switzerland","8947 - Corporate Fundraising","5750A00606","575","5750","575000008947        "]
["575R - CEE/CIS","3094 - Europe and Central Asia Regional Office","575RB00000","575","5750","575000003094        "]
["575R - CEE/CIS","3990 - Moscow, Russia Project Office","575RC00000","370","4470","447000003990        "]
["575R - CEE/CIS","66 - Europe and Central Asia Region","575RA00000","575","5750","575000000066        "]
["6110 - Belize","2104 - Belize","6110A00000","333","3330","333000002104        "]
["6110 - Belize","8401 - Belize City, Belize","6110B00000","611","6110","611000008401        "]
["6260 - Zimbabwe","2031 - Zimbabwe","6260A00000","626","6260","626000002031        "]
["6260 - Zimbabwe","2564 - Bulawayo, Zimbabwe","6260C00000","626","6261","626100002564        "]
["6260 - Zimbabwe","362 - Harare, Zimbabwe","6260B00000","626","6260","626000000362        "]
["6350 - Oman","2075 - Oman","6350A00000","635","6350","635000002075        "]
["6350 - Oman","369 - Muscat, Oman","6350B00000","635","6350","635000000369        "]
["6490 - Papua New Guinea","1613 - Port Moresby, Papua N. Guinea","6490B00000","649","6490","649000001613        "]
["6490 - Papua New Guinea","2053 - Papua New Guinea","6490A00000","649","6490","649000002053        "]
["6620 - Comoros","1516 - Moroni, Comoros","6620B00000","662","6620","662000001516        "]
["6620 - Comoros","2041 - Comoros","6620A00000","662","6620","662000002041        "]
["6690 - Djibouti","1537 - Djibouti, Djibouti","6690B00000","669","6690","669000001537        "]
["6690 - Djibouti","2073 - Djibouti","6690A00000","669","6690","669000002073        "]
["6810 - Angola","1704 - Lubango, Angola","6810D00000","681","6811","681100001704        "]
["6810 - Angola","2035 - Angola","6810A00000","681","6810","681000002035        "]
["6810 - Angola","306 - Luanda, Angola","6810B00000","681","6810","681000000306        "]
["6810 - Angola","3340 - Kuito Bie, Angola","6810F00000","681","681E","681E00003340        "]
["6810 - Angola","4209 - Kunene, Angola","6810C00000","681","681T","681T00004209        "]
["6810 - Angola","9031 - Luena, Angola","6810E00000","681","6813","681300009031        "]
["6820 - Cabo Verde","1609 - Praia, Republic of Cabo Verde","6820B00000","682","6820","682000001609        "]
["6820 - Cabo Verde","2022 - Republic of Cabo Verde","6820A00000","682","6820","682000002022        "]
["6830 - Sao Tome & Principe","1584 - Sao Tome, Sao Tome Principe","6830B00000","683","6830","683000001584        "]
["6830 - Sao Tome & Principe","2003 - Sao Tome Principe","6830A00000","683","6830","683000002003        "]
["6850 - Guinea Bissau","2010 - Guinea Bissau","6850A00000","685","6850","685000002010        "]
["6850 - Guinea Bissau","388 - Bissau, Guinea Bissau","6850B00000","685","6850","685000000388        "]
["6890 - Republic of Mozambique","2037 - Republic of Mozambique","6890A00000","689","6890","689000002037        "]
["6890 - Republic of Mozambique","307 - Maputo, Republic of Mozambique","6890B00000","689","6890","689000000307        "]
["6980 - Namibia","2043 - Namibia","6980A00000","698","6980","698000002043        "]
["6980 - Namibia","379 - Windhoek, Namibia","6980B00000","698","6980","698000000379        "]
["7050 - Palestine, State of","2074 - State of Palestine","7050A00000","705","7050","705000002074        "]
["7050 - Palestine, State of","8808 - East Jerusalem, State of Palestine","7050B00000","705","7055","705500008808        "]
["7050 - Palestine, State of","8928 - Hebron, State of Palestine","7050D00000","705","7056","705600008928        "]
["7050 - Palestine, State of","8933 - Nablus, State of Palestine","7050F00000","705","7058","705800008933        "]
["7050 - Palestine, State of","8937 - Rafah, State of Palestine","7050G00000","705","705B","705B00008937        "]
["7050 - Palestine, State of","9000 - Gaza,  State of Palestine","7050C00000","705","7050","705000009000        "]
["7050 - Palestine, State of","9001 - Ramallah, State of Palestine","7050H00000","705","7054","705400009001        "]
["7050 - Palestine, State of","9063 - Khan Yunis, State of Palestine","7050E00000","705","705C","705C00009063        "]
["7060 - Timor-Leste","2046 - Timor-Leste","7060A00000","706","7060","706000002046        "]
["7060 - Timor-Leste","8555 - Dili, Timor-Leste","7060B00000","706","7060","706000008555        "]
["8950 - Republic of Montenegro","2094 - Republic of Montenegro","8950A00000","895","4951","495100002094        "]
["8950 - Republic of Montenegro","4726 - Podgorica, Republic of Montenegro","8950B00000","895","4951","495100004726        "]
["8970 - Serbia","1617 - Belgrade,  Serbia","8970B00000","897","4950","495000001617        "]
["8970 - Serbia","2082 - Republic of Serbia","8970A00000","897","4950","495000002082        "]
["8971 - Kosovo","1732 - Kosovo UNSCR 1244","8971B00000","897","4957","495700001732        "]
["8971 - Kosovo","4203 - Zvecan, Kosovo UNSCR 1244","8971C00000","897","4959","495900004203        "]

{"sheet":"DD_SD","index":11,"n_rows":805,"n_cols":21,"rows_kept":805,"cut":false,"hidden":true,"merged":[]}
["block",null,"Contry codes",null,"Vendor account group","Business Area",null,"Payment Method",null,null,"Account Type",null,"Partner Type","CSO Type","Type of Assessment done","Risk Rating",null,"Parent Organization exists","Cost Ctr"]
["… Select",null,"… Select","Currency","… Select","… Select",null,"… Select",null,null,"01 - Current/Checking account",null,"Civil Society Organisations","Intenational NGO","Micro Assessment","Not Required",null,"Y","0060A00000 - AFGHANISTAN",null,"0001 Payable immediately Due net"]
["1 POs/LTAs not permitted (refer to SEU/DB)",null,"000 Unknown","… Select","ZFWD Forwarders","0060 Afghanistan",null,"0 TR - Outbound Payment No Output",null,null,"02 - Saving account",null,"Bilateral/Multilateral","National NGO","High Risk Assumed","Low",null,"N","0060B00000 - KABUL AFGHANISTAN",null,"0002 within 14 days 3 % cash discount"]
["2 Block request and purchase order",null,"001 Greenland","ADP Peseta-DO NOT USE","ZVEN Vendors -SD","0090 Albania",null,"1 TR - Urgent Payment (URGP)",{"$nulls":4},"Government","Community Based Organisation","Negative Audit Results","Medium",null,null,"0060C00000 - KABUL ZO CENTRAL",null," within 30 days 2 % cash discount"]
["3 Block quot.req., order and goods receipt",null,"004 Guam","AED United Arab Emirates Dirham",null,"0120 Algeria",null,"2 TR - EUR ACH (SEPA)",{"$nulls":4},"UN Agency","Academic Institution","Simplified checklist","Significant",null,null,"0060D00000 - BAMYAN CENTRAL",null," within 45 days Due net"]
["4 Block source determination",null,"006 Afghanistan","AFA Afghani-DO NOT USE",null,"0240 Argentina",null,"3 TR - Non Urgent Payment (NURG)",{"$nulls":6},"Others","High",null,null,"0060E00000 - DAIKUNDI CENTRAL",null,"0003 For Invoicing up to 15 of Month"]
["11 PQ manuf. Site. PO with main supplier",null,"009 Albania","AFA01 Afghani-DO NOT USE",null,"0260 Armenia",null,"4 TR - Book Transfer (BKTR)",{"$nulls":10},"0060F00000 - GARDEZCENTRAL",null," within 14 days 2 % cash discount"]
["21 Potential supplier, Not GMP evaluated",null,"012 Algeria","AFN Afghani",null,"0310 Azerbaijan",null,"5 Domestic Bank Transfer Letter",{"$nulls":10},"0060G00000 - PARWAN CENTRAL",null," within 30 days 1.5 % cash discount"]
["74 Block on vendor's product for quality",null,"024 Argentina","ALL Albanian Lek(e)","Vendor account group","0420 Barbados",null,"7 Check",{"$nulls":10},"0060H00000 - JALALABAD EASTERN",null," within 45 days Due net"]
["97 Blocked for ethical reasons(total block)",null,"025 Aruba","AMD Armenian Dram","… Select","0490 Bhutan",null,"A Incountry Domestic Payment",{"$nulls":10},"0060I00000 - MEZAR-I-SHARIF NORTH",null," Baseline date on 30 of the month"]
["98 Failed GMP inspection / total block",null,"026 Armenia","ANG Netherlands Antillean Gulder","Local Destinations (ZLC  - ‘L’),","0510 Bolivia",null,"B AP - Book Transfer (BKTR)",{"$nulls":10},"0060J00000 - FAIZABAD NORTHERN",null," For Invoicing up to End  of Month"]
["99 Not Recommended by SEU/Total block",null,"027 Australia","AOA Angolan Kwanza","Governments (ZGV – ‘G’),","0520 Botswana",null,"C Payment By Check",{"$nulls":10},"0060K00000 - FARYABNORTHERN",null," within 14 days 2.125 % cash discount"]
[null,null,"030 Austria","AOR Kwanza Reajustado-DO NOT USE","Inter-governmental Agencies (ZOI – ‘I’),","0530 Bosnia and Herzegovina",null,"D Elec. Banking DMT/GMT - NY",{"$nulls":10},"0060L00000 - KUNDUZ NORTHERN",null," within 30 days 1.5 % cash discount"]
[null,null,"031 Azerbaijan","AOR01 Angolan Kwanza-DO NOT USE","National Committees (ZNC) – ‘C’),","0540 Brazil",null,"F AP - DFT Tax Payment",{"$nulls":10},"0060M00000 - KANDAHARSOUTHERN",null," within 45 days Due net"]
[null,null,"042 Barbados","ARS Argentine Peso","Non-governmental Organizations (ZNG – ‘N’)","0570 Bulgaria",null,"G HR - Non Urgent Payment (NURG)",{"$nulls":10},"0060N00000 - NIMROZ SOUTHERN",null," Baseline date on 15 of next month"]
[null,null,"048 Belgium","ATS Austrian Schilling-DO NOT USE","United Nations System (ZUN – ‘U’),","0600 Myanmar",null,"K AP - Managers Check",{"$nulls":10},"0060O00000 - HERATWESTERN",null,"0004 within 14 days 3 % cash discount"]
[null,null,"049 Bhutan","AUD Australian Dollar","Field Offices -non SLU/SLN  (ZFO – ‘F’),","0610 Burundi",null,"L Cash Payment Letter",{"$nulls":10},"0060P00000 - BADGHIS WESTERN",null," within 30 days 1 % cash discount"]
["… Select",null,"051 Bolivia","AWG Aruban Guilder","Field Offices -SLU/SLN only (ZFU – ‘Z’),","0630 Belarus",null,"N AP - Non Urgent Payment (NURG)",{"$nulls":10},"0060Q00000 - FARAHWESTERN",null," within 60 days Due net"]
[1000,null,"052 Botswana","AZM Azerbaijan Manat-DO NOT USE","Individuals –Others  (ZIN – ‘O’),","0660 Cambodia",null,"S AP - EUR ACH (SEPA)",{"$nulls":10},"0060R00000 - GHOR WESTERN",null,"0005 within 10 days 2 % cash discount"]
[null,null,"053 Bosnia-Herz.","AZN New Azerbaijan Manat","Joint Ventures – Worldwide (ZJT – ‘J’),","0690 Republic of Cameroon",null,"T Bank Trasfer",{"$nulls":10},"0090A00000 - ALBANIA",null," within 30 days 1 % cash discount"]
[null,null,"054 Brazil","BAD Bosnia-Herzogovinian Dinar-DO NOT USE","Country Office - Guest Houses (ZNH – ‘GH’),","0750 Central African Republic",null,"U AP - Urgent Payment (URGP)",{"$nulls":10},"0090B00000 - TIRANA ALBANIA",null," within 50 days Due net"]
[null,null,"057 Bulgaria","BAM Bosnia-Herzegovina Mark","Staff members (ZSM – ‘S’) (non-payroll bank information, block/unblock)","0780 Sri Lanka",null,"X PMW XML Outbound Bank Transfer",{"$nulls":10},"0120A00000 - ALGERIA",null,"0006 Before End of the month 4 % cash discount"]
[null,null,"060 Myanmar","BBD Barbados Dollar","One time customers (ZOT – ‘PO’),","0810 Chad",null,"BCLNTU",{"$nulls":10},"0120B00000 - ALGIERS ALGERIA",null," Before 15 of the next month ;; 2 % cash discount"]
["… Select",null,"061 Burundi","BDT Bangladesh Taka",null,"0840 Chile",null,"ACDT",{"$nulls":10},"0240A00000 - ARGENTINA",null," Before 15 in 2 months Due net"]
["Create ",null,"063 Belarus","BEF Belgian Franc-DO NOT USE",null,"0860 China",{"$nulls":12},"0240B00000 - BUENOS AIRES AR",null,"0007 within 14 days 4 % cash discount"]
["Update",null,"066 Cambodia","BGL Bulgarian Lev(a)-DO NOT USE",null,"0930 Colombia",{"$nulls":12},"0240C00000 - SOUTHERN CONE HUB AR",null," within 30 days 2 % cash discount"]
["Block",null,"069 Cameroon","BGN Bulgarian Lev(a)",null,"0990 Democratic Republic of Congo","0001 Sales Org. 001",null,"0001 Government",null,null,"000 Allocation number",null,null,"1400110 Contribution receivable - Government",null,null,null,"0260A00000 - ARMENIA",null," within 60 days Due net"]
["Unblock",null,"071 Canary Islands","BHD Bahrain Dinar",null,"1020 Costa Rica","1000 UNICEF",null,"0002 Non-Governmental Org",null,null,"001 Posting date",null,null,"1400120 Contribution Receivable (Int-gov Org.)",null,null,null,"0260B00000 - YEREVAN ARMENIA",null,"0008 Payable immediately Due net"]
["Mark for deletion",null,"072 Canada","BIF Burundi Franc",null,"1030 Croatia","2000 PFP-GR, Geneva",null,"0003 Permanent Mission",null,null,"002 Doc.no., fiscal year",null,null,"1400130 Contribution Receivable (NGO)",null,null,null,"0310A00000 - AZERBAIJAN",null," Baseline date on End of the month"]
["Unmark for deletion",null,"075 Central Afr.Rep","BMD Bermudan Dollar",null,"1050 Cuba","2100 PFP-GR, New York",null,"0004 Private Organization",null,null,"003 Document date",null,null,"1400140 Contribution Receivable (Nat. Comms.)",null,null,null,"0310B00000 - BAKU AZERBAIJAN",null,"0009 For Invoicing up to 15 of Month"]
["… Select",null,"078 Sri Lanka","BND Brunei Dollar",null,"1170 Benin","2200 PFP, SF & ERR",null,"0005 UN Secretariat",null,null,"004 Branch account",null,null,"1400150 Contribution Receivable (UN Agencies)",null,null,null,"0420A00000 - BARBADOS - MCP",null," Before 15 of the next month ;; 2.125 % cash disc"]
["Yes",null,"081 Chad","BOB Boliviano",null,"1200 Denmark",null,null,"0006 Other UN Organizatio",null,null,"005 Loc.currency amount",null,null,"1400160 Contribution Receivable (FO-PSFR)",null,null,null,"0420B00000 - BRIDGETOWN BARBADOS",null," Before End of the next month ;; Due net"]
["No",null,"084 Chile","BRL Brazilian Real",null,"120X Procurement Services","01 Distribtn Channel 01",null,"0007 Self Employed",null,null,"006 Doc.currency amount",null,null,"1400161 Adjustment to Contribution Receivable (FO-PSFR)",null,null,null,"0420C00000 - PORT OF SPAIN TT",null," For Invoicing up to End  of Month"]
[null,null,"086 China","BSD Bahamian Dollar",null,"1260 Dominican Republic","10 UNICEF Programmes",null,"0008 Global Corp. Donors",null,null,"007 Bill/exch.due date",null,null,"1420110 Contributions In-Kind Receivable (Government)",null,null,null,"0490A00000 - BHUTAN",null," Before End of the next month ;; 2.125 % cash dis"]
[null,null,"093 Colombia","BTN Bhutanese Ngultrum",null,"1350 Ecuador","11 UNICEF Proc. Service",null,"0009 Exec. Board Member",null,null,"008 Cost center",null,null,"1420120 Contributions In-Kind Receivable (Int-gov Org)",null,null,null,"0490B00000 - THIMPHU BHUTAN",null," Before 15 in 2 months Due net"]
[null,null,"099 Congo, Dem. Rep","BWP Botswana Pula",null,"1380 El Salvador","20 PFP",null,"Z100 WCARO",null,null,"009 External doc.number",null,null,"1420130 Contributions In-Kind Receivable (NGO)",null,null,null,"0510A00000 - BOLIVIA",null,"0010 Payable immediately Due net"]
[null,null,"102 Costa Rica","BYB Belarus Ruble-DO NOT USE",null,"1390 Equatorial Guinea",null,null,"Z150 ESARO",null,null,"010 Purchase order no.",null,null,"1420140 Contributions In-Kind Receivable (Nat Comms)",null,null,null,"0510B00000 - LA PAZ BOLIVIA",null," Baseline date on 10 of next month"]
[null,null,"103 Croatia","BYR Belarusian Ruble-USE BYR01",null,"1410 Ethiopia","01 Product Division 01",null,"Z200 EAPRO",null,null,"011 Plant number",null,null,"1420150 Contributions In-Kind Receivable (UN Agencies)",null,null,null,"0510C00000 - COCHABAMBA",null,"0011 within 10 days 3 % cash discount"]
[null,null,"105 Cuba","BYR01 Belarusian Ruble",null,"1420 Eritrea","10 UNICEF stock items",null,"Z250 ROSA",null,null,"012 Vendor number",null,null,"1420160 Contributions In-Kind Receivable (PSFR)",null,null,null,"0510D00000 - SUCRE BOLIVIA",null,"0012 Payable immediately Due net"]
[null,null,"111 Cyprus","BZD Belize Dollar",null,"1430 Fiji (Pacific Islands)","11 UNICEF non-stk items",null,"Z300 MENA",null,null,"014 Purchase order",null,null,"1420260 Contributions In-Kind Receivable (PSFR)",null,null,null,"0520A00000 - BOTSWANA",null," Baseline date on 11 of next month"]
[null,null,"113 Czech Republic","CAD Canadian Dollar",null,"1530 Gabon","12 Unicef PS ResRelBill",null,"Z350 TACRO",null,null,"015 Personnel number",null,null,"1500110 Advances (Salary)",null,null,null,"0520B00000 - GABORONE BOTSWANA",null,"0014 within 10 days 5 % cash discount"]
[null,null,"117 Benin","CDF Franc Congolais",null,"1560 Gambia","21 Cards & Products",null,"Z400 CEE/NIS",null,null,"016 Settlement period",null,null,"1500120 Special Authorized Staff Advances",null,null,null,"0530A00000 - BOSNIA HERZEGOVINA",null,"0015 within 10 days 3 % cash discount"]
[null,null,"120 Denmark","CHF Swiss Franc",null,"1600 Georgia","22 Promotion",null,"Z500 North America  (ODA)",null,null,"017 Settl.per., pers.no.",null,null,"1500130 Staff Rental Advance",null,null,null,"0530B00000 - SARAJEVO BA",null," within 15 days 2 % cash discount"]
[null,null,"126 Dominican Rep.","CLP Chilean Peso",null,"1620 Ghana","23 Fund Raising",null,"Z550 Pacific        (ODA)",null,null,"018 Asset number",null,null,"1500190 Other staff receivables",null,null,null,"0530C00000 - BANJA LUKA",null," within 20 days Due net"]
[null,null,"135 Ecuador","CNY Chinese Yuan Renminbi",null,"1680 Guatemala","24 Fund Raising ERR",null,"Z600 Western Europe (ODA)",null,null,"021 Segment text",null,null,"1510110 Receivables (Product Sales)",null,null,null,"0540A00000 - BRAZIL",null,"0016 within 14 days 3 % cash discount"]
[null,null,"138 El Salvador","COP Colombian Peso",null,"1770 Guinea","90 UNICEF Products",null,"Z650 Nordic Region  (ODA)",null,null,"022 One-time name / city",null,null,"1510130 Prod.sales - Natcom & FO's",null,null,null,"0540B00000 - BRASILIA BRAZIL",null," within 20 days 2 % cash discount"]
[null,null,"139 Equatorial Guin","CRC Costa Rica Colon",null,"1800 Guyana",null,null,"Z998 Multinational",null,null,"023 One-time city / name",null,null,"1510140 Licensing Receivables - Natcoms & Others",null,null,null,"0540C00000 - BELEM",null," within 30 days Due net"]
[null,null,"140 Estonia","CSD Serbia Dinar-DO NOT USE",null,"1830 Haiti","Payment terms",null,"Z999 UN System",null,null,"024 Document header text",null,null,"1510160 Licensing Receivables - FO PSFR",null,null,null,"0540D00000 - FORTALEZA",null,"0017 Payable in 3 partial amounts"]
[null,null,"141 Ethiopia","CUC Cuban Peso",null,"1860 Honduras","… Select",null,"ZHQ Staff - Headquarters",null,null,"025 CPU date",null,null,"1520610 Receivables (Procurement Services)",null,null,null,"0540E00000 - MANAUS",null," 1 installment: 30.000 % with payment term 0001"]
[null,null,"142 Eritrea","CUP Cuban Peso",null,"1950 Global Shared Service Center","Z000 Up-front payment",null,"ZLC  Staff - Local",null,null,"026 Pmnt per.bslne date",null,null,"1520810 Receivables (UN Agencies)",null,null,null,"0540F00000 - RECIFE",null," 2 installment: 40.000 % with payment term 0001"]
[null,null,"143 Fiji","CUP1 Cuban Peso (non convertible)",null,"2040 India","Z002 (4) equal quarterly payments",{"$nulls":4},"027 Value date",null,null,"1520910 Receivables (Miscellaneous)",null,null,null,"0540G00000 - SALVADOR",null," 3 installment: 30.000 % with payment term 0001"]
[null,null,"144 Finland","CVE Cape Verde Escudo",null,"2070 Indonesia","Z003 Reimbursement of expenses",{"$nulls":4},"028 Asset number",null,null,"1550110 Prepaid Travel",null,null,null,"0540H00000 - SAO LUIS",null,"Y000 Payment due in 30 days"]
[null,null,"147 France","CYP Cyprus Pound-DO NOT USE",null,"2100 Iran","Z004 (2) six-months payment",null,"PRIV",null,null,"029 Pstng month, vendor",null,null,"1550120 Prepaid Education grant",null,null,null,"0540I00000 - SAO PAULO",null,"Y001 within 29 days 2 % cash discount"]
[null,null,"153 Gabon","CZK Czech Koruna",null,"2130 Iraq","Z005 ECHO: (2) instalments",null,"PUBL",null,null,"031 Customer number",null,null,"2200110 Reconciliation (Procurement Services)",null,null,null,"0540J00000 - RIO DE JANEIRO BR",null," within 30 days Due net"]
[null,null,"156 Gambia","DEM Deutsche Mark-DO NOT USE",null,"2220 Office of Research, Italy","Z006 ECHO (80% advance)",{"$nulls":4},"032 Pstng yr,month,curr.",null,null,"2200120 Reconciliation (Japanese Special Account)",null,null,null,"0570A00000 - BULGARIA",null,"Y002 within 30 days Due net"]
[null,null,"160 Georgia","DJF Djibouti Franc",null,"2250 Cote D'Ivoire","Z010 Automatic payment block;pay immediately - NY",{"$nulls":4},"033 Cost center",null,null,"2200190 Reconciliation (Other Trust Accounts)",null,null,null,"0570B00000 - SOFIA BULGARIA",null,"Y005 within 12 days 2 % cash discount"]
[null,null,"162 Ghana","DKK Danish Krone",null,"2280 Jamaica","Z020 Within 30 days Due net - NY",{"$nulls":4},"034 Month, cost center",null,null,"2310110 SAP HR Iwop pension/insurance pre-payments",null,null,null,"0600A00000 - MYANMAR",null," within 30 days Due net"]
[null,null,"163 Gibraltar","DOP Dominican Peso",null,"2340 Jordan","Z110 Automatic payment block;pay immediately - CPH",{"$nulls":4},"036 Order",null,null,"2520110 Unapplied Contributions Receipts",null,null,null,"0600B00000 - YANGON MYANMAR",null,"Y010 Payment due in 10 days(Without discount)"]
[null,null,"165 Greece","DZD Algerian Dinar",null,"234R MENA, Jordan","Z120 Within 30 days Due net",{"$nulls":4},"037 Currency key",null,null,"2520112 PSFR Unapp ORR Cont Receipts",null,null,null,"0600C00000 - KALAY",null,"Y020 Payment due in 20 days(Without discount)"]
[null,null,"168 Guatemala","ECS Ecuador Sucre-DO NOT USE",null,"2390 Kazakhstan","Z121 3% 15 days, Within 30 days Due net",{"$nulls":4},"039 Project number",null,null,"2520120 Unapplied Contributions-in-Kind",null,null,null,"0600D00000 - KENGTUNG",null,"Y100 Payment due in 30 days"]
[null,null,"177 Guinea","EEK Estonian Kroon(i)-DO NOT USE",null,"2400 Kenya","Z122 Within 10 days 3 % cash discount",{"$nulls":4},"055 Fiscal year, month",null,null,"2520130 Cash Advances from Donors",null,null,null,"0600E00000 - MANDALAY",null,"Y101 within 29 days 2 % cash discount"]
[null,null,"180 Guyana","EGP Egyptian Pound",null,"240B Innovation Center","Z123 Within 15 days 2.5% cash discount",{"$nulls":4},"060 Test0",null,null,"2530110 Funds to be Returned",null,null,null,"0600F00000 - MAWLAMYINE",null," within 30 days Due net"]
[null,null,"183 Haiti","ERN Eritrean Nakfa",null,"240R ESARO, Kenya","Z124 Within 20 days 2% cash discount",{"$nulls":4},"061 Test1",{"$nulls":6},"0600G00000 - MYEIK",null,"Y104 within 7 days 0.5 % cash discount"]
[null,null,"186 Honduras","ESP Spanish Peseta-DO NOT USE",null,"2450 Republic of Kyrgyzstan","Z125 10 days 3%, 15 days 2.5%, 30 days net",{"$nulls":4},"065 Test5",{"$nulls":6},"0600H00000 - MYITKYINA",null," within 30 days Due net"]
[null,null,"195 Hungary","ETB Ethiopian Birr",null,"2460 Lao People's Dem Rep.","Z126 15 days 2.5%, 20 days 2%, 30 days net",{"$nulls":4},"101 Cash discnt clearing",null,null,"0001 Four-level dunning notice, every two weeks",null,null,null,"0600I00000 - TAUNGGYI",null,"Y105 within 7 days 0.7 % cash discount"]
[null,null,"198 Iceland","EUR Euro",null,"2490 Lebanon","Z127 10 days 3%, 20 days 2%, 30 days net",{"$nulls":4},"Z01 WBS Element",null,null,"0003 Payment reminder, every two weeks",null,null,null,"0600J00000 - MAUNGDAW",null," within 30 days Due net"]
[null,null,"204 India","FIM Finnish Markka-DO NOT USE",null,"2520 Lesotho","Z910 30 days net (direct disbursement by partner)",{"$nulls":4},"Z02 Reference Number",null,null,"Z001 Contrib/Sp. Accts. (BAs: GR/SF/ERR/SA), Cust Grp G/I/N/O/U",null,null,null,"0600K00000 - LASHIO",null,"Y106 within 10 days 1 % cash discount"]
[null,null,"207 Indonesia","FJD Fiji Dollar",null,"2550 Liberia","Z911 Donations - Not for disbursement",{"$nulls":4},"Z03 Material Number",null,null,"Z002 Private sector (BAs GR/SF/ER) Cust. groups C/F",null,null,null,"0600L00000 - HAKHA MYANMAR",null," within 30 days Due net"]
[null,null,"210 Iran","FRF French Franc-DO NOT USE",null,"2580 Libya","Z913 Prepaid",{"$nulls":4},"Z05 Fund",{"$nulls":6},"0600M00000 - DAWEI MYANMAR",null,"Y107 within 10 days 1.5 % cash discount"]
[null,null,"213 Iraq","GBP Pound Sterling",null,"2660 Macedonia","Z914 For Pre-payments",{"$nulls":4},"Z06 Doc.no. L/Item,F/yr",null,null,"A1 Chief Field Accounts",null,null,null,"0610A00000 - BURUNDI",null," within 30 days Due net"]
[null,null,"216 Ireland","GEK Georgian Kupon-DO NOT USE",null,"2670 Madagascar","Z915 30 days net (direct disbursement by KfW)",{"$nulls":4},"Z31 Funds recd/Customer",null,null,"A2 Accounts Officer",null,null,null,"0610B00000 - BUJUMBURA BURUNDI",null,"Y108 within 10 days 2 % cash discount"]
[null,null,"219 Israel","GEL Georgian Lari",null,"2690 Malawi","0001 Payable immediately Due net",{"$nulls":7},"A3 Accounts Officer",null,null,null,"0610C00000 - GITEGA",null," within 30 days Due net"]
[null,null,"222 Italy","GHC Ghanian Cedi-DO NOT USE",null,"2700 Malaysia","0002 within 14 days 3 % cash discount",{"$nulls":7},"C0 Chief Contributions Unit",null,null,null,"0630A00000 - BELARUS",null,"Y109 within 10 days 3 % cash discount"]
[null,null,"225 Cote d'Ivoire","GHS Ghana Cedi (new)",null,"2740 Maldives"," within 30 days 2 % cash discount",{"$nulls":7},"C1 Contributions Team 1",null,null,null,"0630B00000 - MINSK BELARUS",null," within 30 days Due net"]
[null,null,"228 Jamaica","GIP Gibraltar Pound",null,"2760 Mali"," within 45 days Due net",{"$nulls":7},"C2 Contributions Team 2",null,null,null,"0660A00000 - CAMBODIA",null,"Y110 within 15 days 0.5 % cash discount"]
[null,null,"231 Japan","GMD Gambian Dalasi",null,"2820 Mauritania","0003 For incoming invoices until 15 of the month",{"$nulls":7},"C3 Contributions Team 3",null,null,null,"0660B00000 - PHNOM PENH CAMBODIA",null," within 30 days Due net"]
[null,null,"234 Jordan","GNF Guinean Franc",null,"2850 Mexico"," within 14 days 2 % cash discount",{"$nulls":7},"D1 Comptroller",null,null,null,"0660C00000 - BATTAMBANG",null,"Y111 within 15 days 0.55 % cash discount"]
[null,null,"239 Kazakhstan","GRD Greek Drachma-DO NOT USE",null,"2880 Mongolia"," within 30 days 1.5 % cash discount",{"$nulls":7},"D2 DFAM/Deputy Director, Accts",null,null,null,"0660D00000 - PREAH SIHANOUK",null," within 30 days Due net"]
[null,null,"240 Kenya","GTQ Guatemalan Quetzal",null,"2910 Morocco"," within 45 days Due net",{"$nulls":7},"D3 DFAM/Deputy Director,Budget",null,null,null,"0660E00000 - SIEM REAP",null,"Y112 within 15 days 0.6 % cash discount"]
[null,null,"243 Kuwait","GWP Guinea Peso-DO NOT USE",null,"2970 Nepal"," Baseline date on 30 of the month",{"$nulls":7},"D4 DFAM/Deputy Director,Finance",null,null,null,"0660F00000 - KAMPONG CHAM",null," within 30 days Due net"]
[null,null,"245 Kyrgyzstan","GYD Guyanese Dollar",null,"297R ROSA, Nepal"," For incoming invoices until End  of the month",{"$nulls":7},"E1 Vacant",null,null,null,"0660G00000 - PHNOM PENH ZONE",null,"Y113 within 15 days 1 % cash discount"]
[null,null,"246 Lao,Peo.Dem.Rep","HKD Hong Kong Dollar",null,"3120 Nicaragua"," within 14 days 2.125 % cash discount",{"$nulls":7},"E2 K. Hulshof",null,null,null,"0690A00000 - REPUBLIC OF CAMEROON",null," within 30 days Due net"]
[null,null,"247 Latvia","HNL Honduran Lempira",null,"3180 Niger"," within 30 days 1.5 % cash discount",{"$nulls":7},"F0 Funding Monitoring Officer",null,null,null,"0690B00000 - YAOUNDE CAMEROON",null,"Y114 within 15 days 2 % cash discount"]
[null,null,"249 Lebanon","HRK Croatian Kuna",null,"3210 Nigeria"," within 45 days Due net",{"$nulls":7},"F1 Funding Cluster No. 1",null,null,null,"0690C00000 - DOUALA",null," within 30 days Due net"]
[null,null,"252 Lesotho","HTG Haitian Gourde",null,"3300 Pakistan"," Baseline date on 15 of next month",{"$nulls":7},"F2 Funding Cluster No. 2",null,null,null,"0690D00000 - NGAOUNDERE",null,"Z000 Up-front payment"]
[null,null,"255 Liberia","HUF Hungarian Forint",null,"3330 Panama","0004 within 14 days 3 % cash discount",{"$nulls":7},"F3 Funding Cluster No. 3",null,null,null,"0690E00000 - BERTOUA",null,"Z001 PFP: Baseline equal to NC's fiscal year-end"]
[null,null,"258 Libya","IDR Indonesian Rupiah",null,"333R LACRO, Panama"," within 30 days 1 % cash discount",{"$nulls":7},"F4 Funding Cluster No. 4",null,null,null,"0690F00000 - GAROUA CAMEROON",null,"Z002 (4) equal quarterly payments"]
[null,null,"260 Lithuania","IEP Irish Pound-DO NOT USE",null,"3360 Paraguay"," within 60 days Due net",{"$nulls":7},"F5 Funding Cluster No. 5",null,null,null,"0690G00000 - MAROUA CAMEROON",null,"Z003 Reimbursement of expenses"]
[null,null,"264 Luxembourg","ILS Israeli Shekel",null,"3380 Congo","0005 within 10 days 2 % cash discount",{"$nulls":7},"F6 Funding Cluster No. 6",null,null,null,"0750A00000 - CENTRAL AFRICAN REP.",null,"Z004 (2) six-months payment"]
[null,null,"266 Macedonia, TFYR","INR Indian Rupee",null,"3390 Peru"," within 30 days 1 % cash discount",{"$nulls":7},"F7 Deputy Director, PFO",null,null,null,"0750B00000 - BANGUI CAR",null,"Z005 ECHO: (2) instalments"]
[null,null,"267 Madagascar","IQD Iraqui Dinar",null,"3420 Philippines"," within 50 days Due net",{"$nulls":7},"F8 Director, PFO",null,null,null,"0750C00000 - BOSSANGOA CAR",null,"Z006 ECHO (80% advance)"]
[null,null,"269 Malawi","IRR Iranian Rial",null,"3660 Romania","0006 Before End of the month 4 % cash discount",{"$nulls":7},"S1 Chief Operations, SD",null,null,null,"0750D00000 - KANGA BANDORO CAR",null,"Z007 Payment due in (3) months"]
[null,null,"270 Malaysia","ISK Iceland Krona",null,"3700 Russia"," Before 15 of the next month ;; 2 % cash discount",{"$nulls":7},"S2 Finance Officer, SD",null,null,null,"0750E00000 - BAMBARI CAR",null,"Z008 Payment due in (9) months"]
[null,null,"274 Maldives,Rep of","ITL Italian Lira-DO NOT USE",null,"3750 Rwanda"," Before 15 in 2 months Due net",{"$nulls":7},"S3 Finance Officer, SD",null,null,null,"0750F00000 - BOUAR CAR",null,"Z009 Payment due in (12) months"]
[null,null,"276 Mali","JMD Jamaican Dollar",null,"3780 Saudi Arabia","0007 within 14 days 4 % cash discount",{"$nulls":7},"S4 Finance Officer, SD",null,null,null,"0750G00000 - NDELE CAR",null,"Z010 Automatic payment block;pay immediately - NY"]
[null,null,"279 Malta","JOD Jordanian Dinar",null,"3810 Senegal"," within 30 days 2 % cash discount",{"$nulls":11},"0750H00000 - ZEMIO CAR",null,"Z020 Within 30 days Due net - NY"]
[null,null,"282 Mauritania","JPY Japanese Yen",null,"381R WCARO, Senegal"," within 60 days Due net",{"$nulls":11},"0780A00000 - SRI LANKA",null,"Z110 Automatic payment block;pay immediately - CPH"]
[null,null,"283 Mauritius","KES Kenyan Shilling",null,"3900 Sierra Leone","0008 Payable immediately Due net",{"$nulls":11},"0780B00000 - COLOMBO SRI LANKA",null,"Z120 Within 30 days Due net"]
[null,null,"285 Mexico","KGS Kyrgyzstan Som",null,"3920 Somalia"," Baseline date on End of the month",{"$nulls":11},"0780C00000 - BATTILCALOA",null,"Z121 3% 15 days, Within 30 days Due net"]
[null,null,"288 Mongolia","KHR Cambodian Riel",null,"3930 South Africa","0009 For incoming invoices until 15 of the month",{"$nulls":11},"0780D00000 - JAFFNA",null,"Z122 Within 10 days 3 % cash discount"]
[null,null,"291 Morocco","KMF Comoros Franc",null,"4020 Sudan"," Before 15 of the next month ;; 2.125 % cash disc",{"$nulls":11},"0780E00000 - VAVUNIYA",null,"Z123 Within 15 days 2.5% cash discount"]
[null,null,"297 Nepal","KPW North Korean Won-USE KPW01",null,"4030 Swaziland"," Before End of the next month ;; Due net",{"$nulls":11},"0780F00000 - KILINOCHCHI",null,"Z124 Within 20 days 2% cash discount"]
[null,null,"300 Netherlands","KPW01 KPW",null,"4040 South Sudan"," For incoming invoices until End  of the month",{"$nulls":11},"0810A00000 - CHAD",null,"Z125 10 days 3%, 15 days 2.5%, 30 days net"]
[null,null,"309 New Zealand","KRW South Korean Won",null,"4140 Syria"," Before End of the next month ;; 2.125 % cash dis",{"$nulls":11},"0810B00000 - N'DJAMENA CHAD",null,"Z126 15 days 2.5%, 20 days 2%, 30 days net"]
[null,null,"312 Nicaragua","KWD Kuwaiti Dinar",null,"4150 Tajikistan"," Before 15 in 2 months Due net",{"$nulls":11},"0810C00000 - ABECHE",null,"Z127 10 days 3%, 20 days 2%, 30 days net"]
[null,null,"318 Niger","KYD Cayman Dollar",null,"4200 Thailand","0010 Payable immediately Due net",{"$nulls":11},"0810D00000 - MOUNDOU",null,"Z901 Payable immediately Due net"]
[null,null,"321 Nigeria","KZT Kazakhstani Tenge",null,"420R EAPRO, Thailand"," Baseline date on 10 of next month",{"$nulls":11},"0810E00000 - MONGO",null,"Z902 Upon receipt of invoice"]
[null,null,"324 Norway","LAK Laotian Kip",null,"4230 Togo","0011 within 10 days 3 % cash discount",{"$nulls":11},"0810F00000 - MAO",null,"Z903 Due 10 days after receipt of invoice"]
[null,null,"330 Pakistan","LBP Lebanese Pound",null,"4320 Tunisia","0012 Payable immediately Due net",{"$nulls":11},"0810G00000 - SAHR CHAD",null,"Z904 Due 30 days after receipt of invoice"]
[null,null,"333 Panama","LKR Sri Lankan Rupee",null,"4350 Turkey"," Baseline date on 11 of next month",{"$nulls":11},"0840A00000 - CHILE",null,"Z909 Reduce FO budget on billing"]
[null,null,"336 Paraguay","LRD Liberian Dollar",null,"4360 Rep. of Turkmenistan","0014 within 10 days 5 % cash discount",{"$nulls":11},"0840B00000 - SANTIAGO CHILE"]
[null,null,"338 Congo","LSL Lesotho Loti",null,"4380 Uganda","0015 within 10 days 3 % cash discount",{"$nulls":11},"0860A00000 - CHINA"]
[null,null,"339 Peru","LTL Lithuanian Lita",null,"4410 Ukraine"," within 15 days 2 % cash discount",{"$nulls":11},"0860B00000 - BEIJING CHINA"]
[null,null,"342 Philippines","LUF Luxembourgian Franc-DO NOT USE",null,"4500 Egypt"," within 20 days Due net",{"$nulls":11},"0860C00000 - SHANGHAI"]
[null,null,"345 Poland","LVL Lativian Lat",null,"4550 United Rep. of Tanzania","0016 within 14 days 3 % cash discount",{"$nulls":11},"0930A00000 - COLOMBIA"]
[null,null,"348 Portugal","LYD Libyan Dinar",null,"456B Executive Director's Office"," within 20 days 2 % cash discount",{"$nulls":11},"0930B00000 - BOGOTA COLOMBIA"]
[null,null,"366 Romania","MAD Moroccan Dirham",null,"456C Data, Research and Policy"," within 30 days Due net",{"$nulls":11},"0930C00000 - PASTO"]
[null,null,"370 Russian Fed.","MDL Moldavan Leu",null,"456D Programme Division","0017 Payable in 3 partial amounts",{"$nulls":11},"0930D00000 - QUIBDO"]
[null,null,"375 Rwanda","MGA Malagasy Ariary",null,"456E Research Division"," 1 installment: 30.000 % with payment term 0001",{"$nulls":11},"0930E00000 - SINSELEJO"]
[null,null,"378 Saudi Arabia","MGF Malagasy Franc-DO NOT USE",null,"456F Office of Emergency Prog."," 2 installment: 40.000 % with payment term 0001",{"$nulls":11},"0930F00000 - CALI"]
[null,null,"381 Senegal","MKD Macedonian Denar",null,"456G Division of Communication"," 3 installment: 30.000 % with payment term 0001",{"$nulls":11},"0990A00000 - DR CONGO"]
[null,null,"390 Sierra Leone","MMK Myanmar Kyat",null,"456H Gov. & Multilateral  Affairs","Y000 Payment due in 30 days",{"$nulls":11},"0990B00000 - KINSHASA DRC"]
[null,null,"391 Singapore","MMK1 Myanmar Kyat - Special Rate-DO NOT USE",null,"456I Public Partnerships Division","Y001 within 29 days 2 % cash discount",{"$nulls":11},"0990B10000 - PROVINCE KINSHASA"]
[null,null,"392 Somalia","MNT Mongolian Tugrik",null,"456J Div. of Finance & Admin Mgmt"," within 30 days Due net",{"$nulls":11},"0990B20000 - OUEST KINSHASA"]
[null,null,"393 South Africa","MOP Macao Pataca",null,"456K Division of Human Resources","Y002 within 30 days Due net",{"$nulls":11},"0990C00000 - BANDUNDU"]
[null,null,"394 Slovenia","MRO Mauritanian Ouguiya",null,"456L InfoTech Solutions & Services","Y003 For incoming invoices until 15 of the month",{"$nulls":11},"0990D00000 - SUD KIVU BUKAVU"]
[null,null,"395 Slovak Republic","MTL Maltese Lira-DO NOT USE",null,"456N Int. Audit & Invest (OIAI)"," within 10 days 3 % cash discount",{"$nulls":11},"0990E00000 - ITURI BUNIA"]
[null,null,"399 Spain","MUR Mauritius Rupee",null,"456O Evaluation Office"," within 29 days 1.5 % cash discount",{"$nulls":11},"0990F00000 - DUNGU"]
[null,null,"402 Sudan","MVR Maldive Rufiyaa",null,"456P Field Sup & Coordination Off"," within 30 days Due net",{"$nulls":11},"0990G00000 - NORD KIVU GOMA"]
[null,null,"403 Swaziland","MWK Malawi Kwacha",null,"456Q GSSC Project","Y004 within 10 days 1 % cash discount",{"$nulls":11},"0990G10000 - EAST GOMA"]
[null,null,"404 South Sudan","MXN Mexican Peso",null,"456R Field Results Group Office"," within 30 days Due net",{"$nulls":11},"0990H00000 - TANGANYIKA KALEMIE"]
[null,null,"411 Sweden","MYR Malaysian Ringgit",null,"456S OSEB","Y005 within 12 days 2 % cash discount",{"$nulls":11},"0990I00000 - KASAI OCCIDENTAL KA"]
[null,null,"414 Syria, Arab Rep","MZM Mozambique Metical-DO NOT USE",null,"4590 Burkina Faso"," within 30 days Due net",{"$nulls":11},"0990J00000 - PROVINCE ORIENTALE"]
[null,null,"415 Tajikistan","MZM01 Mozambique Metical-DO NOT USE",null,"4620 Uruguay","Y010 Payment due in 10 days(Without discount)",{"$nulls":11},"0990K00000 - KATANGA LUBUMBASHI"]
[null,null,"420 Thailand","MZN Mozambique Metical (new)",null,"4630 Rep of Uzbekistan","Y020 Payment due in 20 days(Without discount)",{"$nulls":11},"0990K10000 - SUD LUBUMBASHI"]
[null,null,"423 Togo","NAD Namibian dollar",null,"4710 Venezuela","Y100 Payment due in 30 days",{"$nulls":11},"0990L00000 - BAS CONGO MATADI"]
[null,null,"429 Trinidad,Tobago","NGN Nigerian Naira",null,"4920 Yemen","Y101 within 29 days 2 % cash discount",{"$nulls":11},"0990M00000 - EQUATEUR MBANDAKA"]
[null,null,"432 Tunisia","NIO Nicaraguan Cordoba Oro",null,"4980 Zambia"," within 30 days Due net",{"$nulls":11},"0990N00000 - KASAI ORIENTAL MBUJ"]
[null,null,"435 Turkey","NLG Dutch Guilder-DO NOT USE",null,"5070 Bangladesh","Y103 For incoming invoices until 15 of the month",{"$nulls":11},"0990O00000 - MANIEMA"]
[null,null,"436 Turkmenistan","NOK Norwegian Krone",null,"5150 DP Republic of Korea"," within 10 days 3 % cash discount",{"$nulls":11},"0990P00000 - LIBENGE DRC"]
[null,null,"438 Uganda","NPR Nepalese Rupee",null,"5200 Vietnam"," within 29 days 1.5 % cash discount",{"$nulls":11},"0990Q00000 - BENI DRC"]
[null,null,"441 Ukraine","NZD New Zealand Dollar",null,"5640 Moldova"," within 30 days Due net",{"$nulls":11},"1020A00000 - COSTA RICA"]
[null,null,"449 Utd.Arab.Emir.","OMR Omani Rial",null,"5750 Switzerland","Y104 within 7 days 0.5 % cash discount",{"$nulls":11},"1020B00000 - SAN JOSE COSTA RICA"]
[null,null,"450 Egypt","PAB Panamanian Balboa",null,"575R CEE/CIS"," within 30 days Due net",{"$nulls":11},"1030A00000 - CROATIA"]
[null,null,"453 United Kingdom","PEN Peruvian Nuevo Sol",null,"6110 Belize","Y105 within 7 days 0.7 % cash discount",{"$nulls":11},"1030B00000 - ZAGREB CROATIA"]
[null,null,"455 Tanzania,Uni.Re","PGK Papua New Guinea Kina",null,"6260 Zimbabwe"," within 30 days Due net",{"$nulls":11},"1050A00000 - CUBA"]
[null,null,"456 USA","PHP Philippine Peso",null,"6350 Oman","Y106 within 10 days 1 % cash discount",{"$nulls":11},"1050B00000 - HAVANA CUBA"]
[null,null,"459 Burkina-Faso","PKR Pakistani Rupee",null,"6490 Papua New Guinea"," within 30 days Due net",{"$nulls":11},"1170A00000 - BENIN"]
[null,null,"462 Uruguay","PLN Poland Zloty",null,"6620 Comoros","Y107 within 10 days 1.5 % cash discount",{"$nulls":11},"1170B00000 - COTONOU BENIN"]
[null,null,"463 Uzbekistan","PLZ Polish Zloty-DO NOT USE",null,"6690 Djibouti"," within 30 days Due net",{"$nulls":11},"1170C00000 - PARAKOU"]
[null,null,"471 Venezuela","PTE Portuguese Escudo-DO NOT USE",null,"6810 Angola","Y108 within 10 days 2 % cash discount",{"$nulls":11},"1200A00000 - SUPPLY DIVISION"]
[null,null,"492 Yemen, Rep of","PYG Paraguayan Guarani",null,"6820 Cabo Verde"," within 30 days Due net",{"$nulls":11},"1200A00100 - DIRECTOR'S OFFICE"]
[null,null,"495 Yugoslavia","QAR Qatari Rial",null,"6830 Sao Tome & Principe","Y109 within 10 days 3 % cash discount",{"$nulls":11},"1200A00300 - CPH LOGISTICS"]
[null,null,"498 Zambia","ROL Roumanian Leu-DO NOT USE",null,"6850 Guinea Bissau"," within 30 days Due net",{"$nulls":11},"1200A00400 - CONTRACTING CENTRE"]
[null,null,"499 Stateless","RON New Romanian Leu",null,"6890 Republic of Mozambique","Y110 within 15 days 0.5 % cash discount",{"$nulls":11},"1200A00600 - QUALITY ASSURANCE"]
[null,null,"505 Andorra","RSD Serbia Dinar",null,"6980 Namibia"," within 30 days Due net",{"$nulls":11},"1200A00700 - HUMAN RESOURCES"]
[null,null,"507 Bangladesh","RUB Russian Rouble",null,"7050 Palestine, State of","Y111 within 15 days 0.55 % cash discount",{"$nulls":11},"1200A00800 - FIN MGMT AND ADMIN"]
[null,null,"515 D.P.R. of Korea","RUR Russian Ruble-DO NOT USE",null,"7060 Timor-Leste"," within 30 days Due net",{"$nulls":11},"1200A00900 - OATC"]
[null,null,"520 Vietnam","RWF Rwanda Franc",null,"8950 Republic of Montenegro","Y112 within 15 days 0.6 % cash discount",{"$nulls":11},"1200A01100 - THE LOGISTICS CENTRE"]
[null,null,"525 Germany","SAR Saudi Riyal",null,"8970 Serbia"," within 30 days Due net",{"$nulls":11},"1200A01300 - PS SUPPORT TO FO"]
[null,null,"535 Vatican City","SBD Solomon Islands Dollar",null,"8971 Kosovo","Y113 within 15 days 1 % cash discount",{"$nulls":11},"1200A01800 - PROCUREMENT SERVICES"]
[null,null,"555 Liechtenstein","SCR Seychelles Rupee",null,null," within 30 days Due net",{"$nulls":11},"1200A02000 - SUPPLY CENTER NY"]
[null,null,"564 Moldova, Rep of","SDD Sudanese Dinar-DO NOT USE",null,null,"Y114 within 15 days 2 % cash discount",{"$nulls":11},"1200A02300 - VACCINE CENTRE"]
[null,null,"565 Monaco","SDG Sudanese Pound (new)",null,null," within 30 days Due net",{"$nulls":11},"1200A02400 - MEDICINES/NUTRITION"]
[null,null,"567 South Korea,Rep","SDP Sudanese Pound-DO NOT USE",{"$nulls":14},"1200A02500 - WATER SANIT & EDUC"]
[null,null,"570 San Marino","SEK Swedish Krona",{"$nulls":14},"1200A02600 - HTC"]
[null,null,"575 Switzerland","SGD Singapore Dollar",{"$nulls":14},"1200A02700 - KMC"]
[null,null,"590 Samoa","SHP St.Helena Pound",{"$nulls":14},"1200A02800 - INNOVATION UNIT"]
[null,null,"601 Antigua/Barbuda","SIT Slovenian Tolar-DO NOT USE",{"$nulls":14},"1200A02900 - EMERGENCY UNIT"]
[null,null,"602 Brunei Darussal","SKK Slovakian Koruna-DO NOT USE",{"$nulls":14},"1200A03000 - SUPPLY CHAIN"]
[null,null,"603 Bahamas","SLL Sierra Leone",{"$nulls":14},"1200A03100 - MARKETSFIN & STR."]
[null,null,"604 Bahrain","SOS Somalian Shilling",{"$nulls":14},"1200A03200 - INTL. TRANSPORT UNIT"]
[null,null,"605 Bermuda","SRD Surinamese Dollar",{"$nulls":14},"120XA00000 - SD PROCUREMENT"]
[null,null,"610 Dominica","SRG Surinam Guilder-DO NOT USE",{"$nulls":14},"1260A00000 - DOMINICAN REPUBLIC"]
[null,null,"611 Belize","SSP South Sudanese Pound",{"$nulls":14},"1260B00000 - SANTO DOMINGO DO"]
[null,null,"612 Hong Kong","STD Sao Tome / Principe Dobra",{"$nulls":14},"1350A00000 - ECUADOR"]
[null,null,"615 Cayman Islands","SVC El Salvador Colon",{"$nulls":14},"1350B00000 - QUITO ECUADOR"]
[null,null,"616 Grenada","SYP Syrian Pound",{"$nulls":14},"1350C00000 - GUAYAQUIL EQUADOR"]
[null,null,"617 Kiribati","SZL Swaziland Lilangeni",{"$nulls":14},"1380A00000 - EL SAVADOR"]
[null,null,"618 Tuvalu","THB Thailand Baht",{"$nulls":14},"1380B00000 - SAN SALVADOR SV"]
[null,null,"620 Montserrat","TJR Tajik Ruble-DO NOT USE",{"$nulls":14},"1390A00000 - EQUATORIAL GUINEA"]
[null,null,"623 Anguilla","TJS Tajik Somoni",{"$nulls":14},"1390B00000 - MALABO EQUI GUINEA"]
[null,null,"624 Qatar","TMM Turkmenistani Manat-DO NOT USE",{"$nulls":14},"1410A00000 - ETHIOPIA"]
[null,null,"625 St. Helena","TMT Turkmenistan Manat",{"$nulls":14},"1410B00000 - ADDIS ABABAETHIOPIA"]
[null,null,"626 Zimbabwe","TND Tunisian Dinar",{"$nulls":14},"1410B10000 - OROMIYA"]
[null,null,"627 St Kitts&Nevis","TOP Tongan Pa'anga",{"$nulls":14},"1410C00000 - ASOSA"]
[null,null,"628 Seychelles","TRL Turkish Lira-DO NOT USE",{"$nulls":14},"1410D00000 - AWASA"]
[null,null,"629 St. Lucia","TRY New Turkish Lira",{"$nulls":14},"1410E00000 - BAHIR DAR"]
[null,null,"630 St. Vincent","TTD Trinidad and Tobago Dollar",{"$nulls":14},"1410F00000 - GAMBELA"]
[null,null,"631 Solomon Islands","TZS Tanzanian Shilling",{"$nulls":14},"1410G00000 - JIJIGA"]
[null,null,"634 Tonga","UAH Ukrainian Hryvnia",{"$nulls":14},"1410H00000 - MEKELLE"]
[null,null,"635 Oman","UAK Ukrainian Karbovanet-DO NOT USE",{"$nulls":14},"1410I00000 - SEMERA"]
[null,null,"636 Turks& Caicosin","UGX Ugandan Shilling",{"$nulls":14},"1410J00000 - GODE"]
[null,null,"640 Brit.Virgin Is.","USD US Dollar",{"$nulls":14},"1410K00000 - KEBRIDEHAR"]
[null,null,"645 Sikkim","UYU Uruguayan Peso",{"$nulls":14},"1410L00000 - DOLLO ADO"]
[null,null,"648 Nauru","UZS Uzbekistan Som",{"$nulls":14},"1420A00000 - ERITREA"]
[null,null,"649 Pap. New Guinea","VEB Venezuelan Bolivar-DO NOT USE",{"$nulls":14},"1420B00000 - ASMARA ERITREA"]
[null,null,"655 Vanuatu","VEF Venezuelan Bolivar",{"$nulls":14},"1430A00000 - FIJI-PACIFIC ISLANDS"]
[null,null,"656 Tokelau Islands","VEF01 Bolivar Fuerte (pref. rate)",{"$nulls":14},"1430B00000 - SUVA FIJI"]
[null,null,"660 French Antilles","VEF02 Venezuela Bolivar Fuerte – SIMADI",{"$nulls":14},"1430C00000 - APIA SAMOA"]
[null,null,"661 Wallis,Futuna","VND Vietnamese Dong",{"$nulls":14},"1430D00000 - HONIARA SB"]
[null,null,"662 Comoros","VUV Vanuatu Vatu",{"$nulls":14},"1430E00000 - PORT VILA VANUATU"]
[null,null,"663 Reunion","WST Samoan Tala",{"$nulls":14},"1430F00000 - TARAWA KIRIBATI"]
[null,null,"664 Martinique","XAF C.F.A. Franc (BEAC)",{"$nulls":14},"1430G00000 - MAJURO RMI"]
[null,null,"665 French Guiana","XCD East Carribean Dollar",{"$nulls":14},"1430H00000 - POHNPEI FSM"]
[null,null,"666 Guadeloupe","XEU European Currency Unit",{"$nulls":14},"1430I00000 - NAURA"]
[null,null,"667 New Caledonia","XOF C.F.A. Franc (BCEAO)",{"$nulls":14},"1430J00000 - NGERULMUD PALAU"]
[null,null,"668 Frenc.Polynesia","XPF CFP Franc",{"$nulls":14},"1430K00000 - NUKI'ALOFA TONGA"]
[null,null,"669 Djibouti","XXX Unknown currency",{"$nulls":14},"1430L00000 - FUNAFUTI TUVALU"]
[null,null,"672 Netherlands Ant","YER Yemeni Rial",{"$nulls":14},"1430M00000 - ALOFI NUIE"]
[null,null,"678 Suriname","YER1 Yemeni Rial",{"$nulls":14},"1430N00000 - AVARUA COOK ISLANDS"]
[null,null,"679 Cook Islands","YUM Yugoslavian Dinar-DO NOT USE",{"$nulls":14},"1430O00000 - TOKELAU"]
[null,null,"680 Niue","ZAR South African Rand",{"$nulls":14},"1530A00000 - GABON"]
[null,null,"681 Angola","ZMK Zambian Kwacha-DO NOT USE",{"$nulls":14},"1530B00000 - LIBREVILLE GABON"]
[null,null,"682 Cabo Verde","ZMW Zambian Kwacha",{"$nulls":14},"1560A00000 - GAMBIA"]
[null,null,"683 S.Tome&Principe","ZRN New Zaire-DO NOT USE",{"$nulls":14},"1560B00000 - BANJUL GAMBIA"]
[null,null,"685 Guinea-Bissau","ZWD Zimbabwean Dollar-DO NOT USE",{"$nulls":14},"1600A00000 - GEORGIA"]
[null,null,"688 Macau","ZWD01 Zimbabwe Dollar-DO NOT USE",{"$nulls":14},"1600B00000 - TBLISI GEORGIA"]
[null,null,"689 Mozambique","ZWD1 Zimbabwean Dollar-DO NOT USE",{"$nulls":14},"1600C00000 - SUKHUMI"]
[null,null,"690 Palau, Rep of","ZWD55 Zimbabwe Dollar-DO NOT USE",{"$nulls":14},"1620A00000 - GHANA"]
[null,null,"691 Western Sahara","ZWD56 ZimbabweDollar(redenominated)-DO NOT USE",{"$nulls":14},"1620B00000 - ACCRA GHANA"]
[null,null,"692 Marshall Islnds","ZWL Zimbabwe Dollar",{"$nulls":14},"1620C00000 - TAMALE"]
[null,null,"693 Micronesia","ZWR Zimbabwe Dollar-DO NOT USE",{"$nulls":14},"1680A00000 - GUATEMALA"]
[null,null,"695 Puerto Rico","ZWR55 Zimbabwe Dollar (new)-DO NOT USE",{"$nulls":14},"1680B00000 - GUATEMALA CITY GT"]
[null,null,"696 Samoa,American","ZWR56 ZimbabweDollar(redenominated)-DO NOT USE",{"$nulls":14},"1770A00000 - GUINEA"]
[null,null,"697 Amer.Virgin Is.",{"$nulls":15},"1770B00000 - CONAKRY GUINEA"]
[null,null,"698 Namibia",{"$nulls":15},"1770B10000 - WESTERN CONAKRY"]
[null,null,"700 N.Mariana Is.",{"$nulls":15},"1770C00000 - NZEREKORE"]
[null,null,"701 Not Applicable",{"$nulls":15},"1770D00000 - KANKAN"]
[null,null,"705 Palestine",{"$nulls":15},"1800A00000 - GUYANA"]
[null,null,"706 Timor-Leste",{"$nulls":15},"1800B00000 - GEORGETOWN GUYANA"]
[null,null,"891 Serbia & Monten",{"$nulls":15},"1800C00000 - PARAMARIBO SURINAME"]
[null,null,"895 Montenegro",{"$nulls":15},"1830A00000 - HAITI"]
[null,null,"897 Serbia",{"$nulls":15},"1830B00000 - PORT AU PRINCEHAITI"]
[null,null,"999 United Nations",{"$nulls":15},"1830C00000 - GONAIVES HAITI"]
[{"$nulls":18},"1860A00000 - HONDURAS"]
[null,null,{"$f":"CONCATENATE(D237,\" \",E237)","v":"Afghanistan 006"},"Afghanistan","006",{"$nulls":13},"1860B00000 - TEGUCIGALPAHONDURAS"]
[null,null,{"$f":"CONCATENATE(D238,\" \",E238)","v":"Albania 009"},"Albania","009",{"$nulls":13},"1950A00000 - GSSC BUDAPEST"]
[null,null,"Algeria 012","Algeria","012",{"$nulls":13},"1950A00100 - DO GSSC"]
[null,null,"Amer.Virgin Is. 697","Amer.Virgin Is.",697,{"$nulls":13},"1950A00200 - HR ADMIN SECTION"]
[null,null,"Andorra 505","Andorra",505,{"$nulls":13},"1950A00300 - HR PAYROLL SECTION"]
[null,null,"Angola 681","Angola",681,{"$nulls":13},"1950A00400 - GLOBAL HELP DESK SEC"]
[null,null,"Anguilla 623","Anguilla",623,{"$nulls":13},"1950A00500 - FINANCE SECTION"]
[null,null,"Antigua/Barbuda 601","Antigua/Barbuda",601,{"$nulls":13},"1950A00600 - SERVICE MANAGEMENT"]
[null,null,"Argentina 024","Argentina","024",{"$nulls":13},"2040A00000 - INDIA"]
[null,null,"Armenia 026","Armenia","026",{"$nulls":13},"2040B00000 - NEW DELHI INDIA"]
[null,null,"Aruba 025","Aruba","025",{"$nulls":13},"2040C00000 - BHOPAL"]
[null,null,"Australia 027","Australia","027",{"$nulls":13},"2040D00000 - BHUBANESHWAR"]
[null,null,"Austria 030","Austria","030",{"$nulls":13},"2040E00000 - CALCUTTA"]
[null,null,"Azerbaijan 031","Azerbaijan","031",{"$nulls":13},"2040F00000 - CHENNAI"]
[null,null,"Bahamas 603","Bahamas",603,{"$nulls":13},"2040G00000 - GANDHINAGAR"]
[null,null,"Bahrain 604","Bahrain",604,{"$nulls":13},"2040H00000 - HYDERABAD"]
[null,null,"Bangladesh 507","Bangladesh",507,{"$nulls":13},"2040I00000 - JAIPUR"]
[null,null,"Barbados 042","Barbados","042",{"$nulls":13},"2040J00000 - LUCKNOW"]
[null,null,"Belarus 063","Belarus","063",{"$nulls":13},"2040K00000 - MUMBAI"]
[null,null,"Belgium 048","Belgium","048",{"$nulls":13},"2040L00000 - PATNA"]
[null,null,"Belize 611","Belize",611,{"$nulls":13},"2040M00000 - GUWAHATI"]
[null,null,"Benin 117","Benin",117,{"$nulls":13},"2040N00000 - RAIPUR"]
[null,null,"Bermuda 605","Bermuda",605,{"$nulls":13},"2040O00000 - RANCHI"]
[null,null,"Bhutan 049","Bhutan","049",{"$nulls":13},"2070A00000 - INDONESIA"]
[null,null,"Bolivia 051","Bolivia","051",{"$nulls":13},"2070B00000 - JAKARTA INDONESIA"]
[null,null,"Bosnia-Herz. 053","Bosnia-Herz.","053",{"$nulls":13},"2070C00000 - MAKASSAR"]
[null,null,"Botswana 052","Botswana","052",{"$nulls":13},"2070D00000 - AMBON"]
[null,null,"Brazil 054","Brazil","054",{"$nulls":13},"2070E00000 - BANDA ACEH"]
[null,null,"Brit.Virgin Is. 640","Brit.Virgin Is.",640,{"$nulls":13},"2070F00000 - JAYAPURA"]
[null,null,"Brunei Darussal 602","Brunei Darussal",602,{"$nulls":13},"2070G00000 - KUPANG"]
[null,null,"Bulgaria 057","Bulgaria","057",{"$nulls":13},"2070H00000 - MANOKWARI"]
[null,null,"Burkina-Faso 459","Burkina-Faso",459,{"$nulls":13},"2070I00000 - SEMARANG"]
[null,null,"Burundi 061","Burundi","061",{"$nulls":13},"2070J00000 - SURABAYA"]
[null,null,"Cabo Verde 682","Cabo Verde",682,{"$nulls":13},"2100A00000 - IRAN"]
[null,null,"Cambodia 066","Cambodia","066",{"$nulls":13},"2100B00000 - TEHERAN IRAN"]
[null,null,"Cameroon 069","Cameroon","069",{"$nulls":13},"2130A00000 - IRAQ"]
[null,null,"Canada 072","Canada","072",{"$nulls":13},"2130B00000 - IRAQ COUNTRY OFFICE"]
[null,null,"Canary Islands 071","Canary Islands","071",{"$nulls":13},"2130C00000 - AL NAJAF"]
[null,null,"Cayman Islands 615","Cayman Islands",615,{"$nulls":13},"2130D00000 - BAGHDAD CENTRAL ZONE"]
[null,null,"Central Afr.Rep 075","Central Afr.Rep","075",{"$nulls":13},"2130E00000 - KIRKUK"]
[null,null,"Chad 081","Chad","081",{"$nulls":13},"2130F00000 - ZO SOUTH BASRAH"]
[null,null,"Chile 084","Chile","084",{"$nulls":13},"2130G00000 - ZONE OFFICE NORTH"]
[null,null,"China 086","China","086",{"$nulls":13},"2130H00000 - DOHUK"]
[null,null,"Colombia 093","Colombia","093",{"$nulls":13},"2130I00000 - KUT"]
[null,null,"Comoros 662","Comoros",662,{"$nulls":13},"2130J00000 - AMARAH"]
[null,null,"Congo 338","Congo",338,{"$nulls":13},"2130K00000 - IRAQ CENTER AMMAN"]
[null,null,"Congo, Dem. Rep 099","Congo, Dem. Rep","099",{"$nulls":13},"2220A00000 - OFFICE OF RESEARCH"]
[null,null,"Cook Islands 679","Cook Islands",679,{"$nulls":13},"2220A00100 - RESEARCH SECTION"]
[null,null,"Costa Rica 102","Costa Rica",102,{"$nulls":13},"2250A00000 - COTE D'IVOIRE"]
[null,null,"Cote d'Ivoire 225","Cote d'Ivoire",225,{"$nulls":13},"2250B00000 - ABIDJANCOTED'IVOIRE"]
[null,null,"Croatia 103","Croatia",103,{"$nulls":13},"2250C00000 - BOUAKE"]
[null,null,"Cuba 105","Cuba",105,{"$nulls":13},"2250D00000 - MAN"]
[null,null,"Cyprus 111","Cyprus",111,{"$nulls":13},"2280A00000 - JAMAICA"]
[null,null,"Czech Republic 113","Czech Republic",113,{"$nulls":13},"2280B00000 - KINGSTON JAMAICA"]
[null,null,"D.P.R. of Korea 515","D.P.R. of Korea",515,{"$nulls":13},"2340A00000 - JORDAN"]
[null,null,"Denmark 120","Denmark",120,{"$nulls":13},"2340B00000 - AMMAN JORDAN"]
[null,null,"Djibouti 669","Djibouti",669,{"$nulls":13},"234RA00000 - MENA"]
[null,null,"Dominica 610","Dominica",610,{"$nulls":13},"234RB00000 - REG SERV DIV MENA"]
[null,null,"Dominican Rep. 126","Dominican Rep.",126,{"$nulls":13},"2390A00000 - KAZAKSTAN"]
[null,null,"Ecuador 135","Ecuador",135,{"$nulls":13},"2390B00000 - ASTANA KAZAKHSTAN"]
[null,null,"Egypt 450","Egypt",450,{"$nulls":13},"2390C00000 - ALMA ATA"]
[null,null,"El Salvador 138","El Salvador",138,{"$nulls":13},"2400A00000 - KENYA"]
[null,null,"Equatorial Guin 139","Equatorial Guin",139,{"$nulls":13},"2400B00000 - NAIROBI KENYA"]
[null,null,"Eritrea 142","Eritrea",142,{"$nulls":13},"2400C00000 - GARISSA"]
[null,null,"Estonia 140","Estonia",140,{"$nulls":13},"2400D00000 - KISUMU"]
[null,null,{"$f":"CONCATENATE(D302,\" \",E302)","v":"Ethiopia 141"},"Ethiopia",141,{"$nulls":13},"2400E00000 - DADAAD"]
[null,null,"Fiji 143","Fiji",143,{"$nulls":13},"2400F00000 - LODWAR"]
[null,null,"Finland 144","Finland",144,{"$nulls":13},"240BB00000 - INNOVATION CENTER"]
[null,null,"France 147","France",147,{"$nulls":13},"240BB00100 - DIRECTOR'S OFFICE"]
[null,null,"Frenc.Polynesia 668","Frenc.Polynesia",668,{"$nulls":13},"240RA00000 - ESARO"]
[null,null,"French Antilles 660","French Antilles",660,{"$nulls":13},"240RB00000 - REG SERV DIV ESAR"]
[null,null,"French Guiana 665","French Guiana",665,{"$nulls":13},"2450A00000 - REP. OF KYRGYZSTAN"]
[null,null,"Gabon 153","Gabon",153,{"$nulls":13},"2450B00000 - BISHKEK KYRGYZSTAN"]
[null,null,"Gambia 156","Gambia",156,{"$nulls":13},"2450C00000 - OSH"]
[null,null,"Georgia 160","Georgia",160,{"$nulls":13},"2460A00000 - LAO PEOPLE'S DEM REP"]
[null,null,"Germany 525","Germany",525,{"$nulls":13},"2460B00000 - VIENTIANE LAO PDR"]
[null,null,"Ghana 162","Ghana",162,{"$nulls":13},"2460C00000 - LUANG NAMTHA"]
[null,null,"Gibraltar 163","Gibraltar",163,{"$nulls":13},"2490A00000 - LEBANON"]
[null,null,"Greece 165","Greece",165,{"$nulls":13},"2490B00000 - BEIRUT LEBANON"]
[null,null,"Greenland 001","Greenland","001",{"$nulls":13},"2490C00000 - TYRE"]
[null,null,"Grenada 616","Grenada",616,{"$nulls":13},"2520A00000 - LESOTHO"]
[null,null,"Guadeloupe 666","Guadeloupe",666,{"$nulls":13},"2520B00000 - MASERU LESOTHO"]
[null,null,"Guam 004","Guam","004",{"$nulls":13},"2550A00000 - LIBERIA"]
[null,null,"Guatemala 168","Guatemala",168,{"$nulls":13},"2550B00000 - MONROVIA LIBERIA"]
[null,null,"Guinea 177","Guinea",177,{"$nulls":13},"2550C00000 - ZO: ZWEDRU"]
[null,null,"Guinea-Bissau 685","Guinea-Bissau",685,{"$nulls":13},"2550D00000 - ZO: HARPER"]
[null,null,"Guyana 180","Guyana",180,{"$nulls":13},"2550E00000 - ZO: GBARNGA"]
[null,null,"Haiti 183","Haiti",183,{"$nulls":13},"2580A00000 - LIBYA"]
[null,null,"Honduras 186","Honduras",186,{"$nulls":13},"2580B00000 - TRIPOLI LIBYAN ARAB"]
[null,null,"Hong Kong 612","Hong Kong",612,{"$nulls":13},"2580C00000 - BENGHAZI"]
[null,null,"Hungary 195","Hungary",195,{"$nulls":13},"2660A00000 - MACEDONIA"]
[null,null,"Iceland 198","Iceland",198,{"$nulls":13},"2660B00000 - SKOPJE MACEDONIA"]
[null,null,"India 204","India",204,{"$nulls":13},"2670A00000 - MADAGASCAR"]
[null,null,"Indonesia 207","Indonesia",207,{"$nulls":13},"2670B00000 - ANTANANARIVO MG"]
[null,null,"Iran 210","Iran",210,{"$nulls":13},"2670C00000 - AMBOVOMBE"]
[null,null,"Iraq 213","Iraq",213,{"$nulls":13},"2670D00000 - FORT DAUPHIN MDG"]
[null,null,"Ireland 216","Ireland",216,{"$nulls":13},"2690A00000 - MALAWI"]
[null,null,"Israel 219","Israel",219,{"$nulls":13},"2690B00000 - LILONGWE MALAWI"]
[null,null,"Italy 222","Italy",222,{"$nulls":13},"2700A00000 - MALAYSIA"]
[null,null,"Jamaica 228","Jamaica",228,{"$nulls":13},"2700B00000 - KUALA LUMPUR MY"]
[null,null,"Japan 231","Japan",231,{"$nulls":13},"2740A00000 - MALDIVES"]
[null,null,"Jordan 234","Jordan",234,{"$nulls":13},"2740B00000 - MALE MALDIVES"]
[null,null,"Kazakhstan 239","Kazakhstan",239,{"$nulls":13},"2760A00000 - MALI"]
[null,null,"Kenya 240","Kenya",240,{"$nulls":13},"2760B00000 - BAMAKO MALI"]
[null,null,"Kiribati 617","Kiribati",617,{"$nulls":13},"2760C00000 - KAYES"]
[null,null,"Kuwait 243","Kuwait",243,{"$nulls":13},"2760D00000 - KOULIKORO"]
[null,null,"Kyrgyzstan 245","Kyrgyzstan",245,{"$nulls":13},"2760E00000 - MOPTI"]
[null,null,"Lao,Peo.Dem.Rep 246","Lao,Peo.Dem.Rep",246,{"$nulls":13},"2760F00000 - SEGOU"]
[null,null,"Latvia 247","Latvia",247,{"$nulls":13},"2760G00000 - GAO MALI"]
[null,null,"Lebanon 249","Lebanon",249,{"$nulls":13},"2760H00000 - SIKASSO MALI"]
[null,null,"Lesotho 252","Lesotho",252,{"$nulls":13},"2760I00000 - TOMBOUCTOU MALI"]
[null,null,"Liberia 255","Liberia",255,{"$nulls":13},"2820A00000 - MAURITANIA"]
[null,null,"Libya 258","Libya",258,{"$nulls":13},"2820B00000 - NOUAKCHOTT MR"]
[null,null,"Liechtenstein 555","Liechtenstein",555,{"$nulls":13},"2820C00000 - AIOUN"]
[null,null,"Lithuania 260","Lithuania",260,{"$nulls":13},"2820D00000 - BASSIKOUNOU"]
[null,null,"Luxembourg 264","Luxembourg",264,{"$nulls":13},"2820E00000 - KIFFA"]
[null,null,"Macau 688","Macau",688,{"$nulls":13},"2850A00000 - MEXICO"]
[null,null,"Macedonia, TFYR 266","Macedonia, TFYR",266,{"$nulls":13},"2850B00000 - MEXICO CITY MEXICO"]
[null,null,"Madagascar 267","Madagascar",267,{"$nulls":13},"2880A00000 - MONGOLIA"]
[null,null,"Malawi 269","Malawi",269,{"$nulls":13},"2880B00000 - ULAANBAATARMONGOLIA"]
[null,null,"Malaysia 270","Malaysia",270,{"$nulls":13},"2880C00000 - KHOVD CITY"]
[null,null,"Maldives,Rep of 274","Maldives,Rep of",274,{"$nulls":13},"2880D00000 - KHUVSGUL MONGOLIA"]
[null,null,"Mali 276","Mali",276,{"$nulls":13},"2910A00000 - MOROCCO"]
[null,null,"Malta 279","Malta",279,{"$nulls":13},"2910B00000 - RABAT MOROCCO"]
[null,null,"Marshall Islnds 692","Marshall Islnds",692,{"$nulls":13},"2970A00000 - NEPAL"]
[null,null,"Martinique 664","Martinique",664,{"$nulls":13},"2970B00000 - KATHMANDU NEPAL"]
[null,null,"Mauritania 282","Mauritania",282,{"$nulls":13},"2970C00000 - BHARATPUR"]
[null,null,"Mauritius 283","Mauritius",283,{"$nulls":13},"2970D00000 - BIRATNAGER"]
[null,null,"Mexico 285","Mexico",285,{"$nulls":13},"2970E00000 - BIRGANG"]
[null,null,{"$f":"CONCATENATE(D366,\" \",E366)","v":"Micronesia 693"},"Micronesia",693,{"$nulls":13},"2970F00000 - DHADHELDURA"]
[null,null,"Moldova, Rep of 564","Moldova, Rep of",564,{"$nulls":13},"2970G00000 - GAIGHAT"]
[null,null,"Monaco 565","Monaco",565,{"$nulls":13},"2970H00000 - GHORAHI"]
[null,null,"Mongolia 288","Mongolia",288,{"$nulls":13},"2970I00000 - MANGALSEN"]
[null,null,"Montenegro 895","Montenegro",895,{"$nulls":13},"2970J00000 - NEPALGUNJ"]
[null,null,"Montserrat 620","Montserrat",620,{"$nulls":13},"2970K00000 - PANCHTHAR"]
[null,null,"Morocco 291","Morocco",291,{"$nulls":13},"2970L00000 - RAJBIRAJ"]
[null,null,"Mozambique 689","Mozambique",689,{"$nulls":13},"2970M00000 - SIMIKOT"]
[null,null,"Myanmar 060","Myanmar","060",{"$nulls":13},"2970N00000 - TAULIHAWA"]
[null,null,"N.Mariana Is. 700","N.Mariana Is.",700,{"$nulls":13},"2970O00000 - JUMLA NEPAL"]
[null,null,"Namibia 698","Namibia",698,{"$nulls":13},"2970P00000 - SINDHUPALCHOWK"]
[null,null,"Nauru 648","Nauru",648,{"$nulls":13},"2970Q00000 - DOLAKHA"]
[null,null,"Nepal 297","Nepal",297,{"$nulls":13},"2970R00000 - GORKHA"]
[null,null,"Netherlands 300","Netherlands",300,{"$nulls":13},"2970S00000 - NUWAKOT"]
[null,null,"Netherlands Ant 672","Netherlands Ant",672,{"$nulls":13},"297RA00000 - ROSA"]
[null,null,"New Caledonia 667","New Caledonia",667,{"$nulls":13},"297RB00000 - REG SERV DIV ROSA"]
[null,null,"New Zealand 309","New Zealand",309,{"$nulls":13},"3120A00000 - NICARAGUA"]
[null,null,"Nicaragua 312","Nicaragua",312,{"$nulls":13},"3120B00000 - MANAGUA NICARAGUA"]
[null,null,"Niger 318","Niger",318,{"$nulls":13},"3120C00000 - BILWI"]
[null,null,"Nigeria 321","Nigeria",321,{"$nulls":13},"3120D00000 - BLUEFIELDS NICARAGU"]
[null,null,"Niue 680","Niue",680,{"$nulls":13},"3180A00000 - NIGER"]
[null,null,"Norway 324","Norway",324,{"$nulls":13},"3180B00000 - NIAMEY NIGER"]
[null,null,"Not Applicable 701","Not Applicable",701,{"$nulls":13},"3180C00000 - AGADEZ"]
[null,null,"Oman 635","Oman",635,{"$nulls":13},"3180D00000 - MARADI"]
[null,null,"Pakistan 330","Pakistan",330,{"$nulls":13},"3180E00000 - DIFFA"]
[null,null,"Palau, Rep of 690","Palau, Rep of",690,{"$nulls":13},"3210A00000 - NIGERIA"]
[null,null,"Palestine 705","Palestine",705,{"$nulls":13},"3210B00000 - ABUJA NIGERIA"]
[null,null,"Panama 333","Panama",333,{"$nulls":13},"3210C00000 - BAUCHI"]
[null,null,"Pap. New Guinea 649","Pap. New Guinea",649,{"$nulls":13},"3210D00000 - ENUGU"]
[null,null,"Paraguay 336","Paraguay",336,{"$nulls":13},"3210E00000 - KADUNA"]
[null,null,"Peru 339","Peru",339,{"$nulls":13},"3210F00000 - LAGOS"]
[null,null,"Philippines 342","Philippines",342,{"$nulls":13},"3210G00000 - MAIDUGURI"]
[null,null,"Poland 345","Poland",345,{"$nulls":13},"3210H00000 - SOKOTO"]
[null,null,"Portugal 348","Portugal",348,{"$nulls":13},"3210I00000 - KATSINA"]
[null,null,"Puerto Rico 695","Puerto Rico",695,{"$nulls":13},"3210J00000 - RIVERS ZONE OFFICE"]
[null,null,"Qatar 624","Qatar",624,{"$nulls":13},"3210K00000 - ONDO"]
[null,null,"Reunion 663","Reunion",663,{"$nulls":13},"3300A00000 - PAKISTAN"]
[null,null,"Romania 366","Romania",366,{"$nulls":13},"3300B00000 - ISLAMABAD PAKISTAN"]
[null,null,"Russian Fed. 370","Russian Fed.",370,{"$nulls":13},"3300C00000 - KARACHI"]
[null,null,"Rwanda 375","Rwanda",375,{"$nulls":13},"3300D00000 - LAHORE"]
[null,null,"S.Tome&Principe 683","S.Tome&Principe",683,{"$nulls":13},"3300E00000 - PESHAWAR"]
[null,null,"Samoa 590","Samoa",590,{"$nulls":13},"3300F00000 - QUETTA"]
[null,null,"Samoa,American 696","Samoa,American",696,{"$nulls":13},"3300G00000 - DUBAI UAE"]
[null,null,"San Marino 570","San Marino",570,{"$nulls":13},"3330A00000 - PANAMA"]
[null,null,"Saudi Arabia 378","Saudi Arabia",378,{"$nulls":13},"3330B00000 - PANAMA CITY"]
[null,null,"Senegal 381","Senegal",381,{"$nulls":13},"333RA00000 - LACRO"]
[null,null,"Serbia 897","Serbia",897,{"$nulls":13},"333RB00000 - REG SERV DIV LACR"]
[null,null,"Serbia & Monten 891","Serbia & Monten",891,{"$nulls":13},"333RC00000 - PANAMA HUB LACR"]
[null,null,"Seychelles 628","Seychelles",628,{"$nulls":13},"3360A00000 - PARAGUAY"]
[null,null,"Sierra Leone 390","Sierra Leone",390,{"$nulls":13},"3360B00000 - ASUNCION PARAGUAY"]
[null,null,"Sikkim 645","Sikkim",645,{"$nulls":13},"3380A00000 - CONGO"]
[null,null,"Singapore 391","Singapore",391,{"$nulls":13},"3380B00000 - BRAZZAVILLE CONGO"]
[null,null,"Slovak Republic 395","Slovak Republic",395,{"$nulls":13},"3380C00000 - POINTE NOIRE"]
[null,null,"Slovenia 394","Slovenia",394,{"$nulls":13},"3390A00000 - PERU"]
[null,null,"Solomon Islands 631","Solomon Islands",631,{"$nulls":13},"3390B00000 - LIMA PERU"]
[null,null,"Somalia 392","Somalia",392,{"$nulls":13},"3390C00000 - ABANCAY"]
[null,null,"South Africa 393","South Africa",393,{"$nulls":13},"3390D00000 - AYACUCHO"]
[null,null,"South Korea,Rep 567","South Korea,Rep",567,{"$nulls":13},"3390E00000 - CUZCO"]
[null,null,"South Sudan 404","South Sudan",404,{"$nulls":13},"3390F00000 - UCAYALI"]
[null,null,"Spain 399","Spain",399,{"$nulls":13},"3420A00000 - PHILIPPINES"]
[null,null,"Sri Lanka 078","Sri Lanka","078",{"$nulls":13},"3420B00000 - MANILA"]
[null,null,"St Kitts&Nevis 627","St Kitts&Nevis",627,{"$nulls":13},"3420C00000 - COTABATO"]
[null,null,"St. Helena 625","St. Helena",625,{"$nulls":13},"3420D00000 - DAVAO"]
[null,null,"St. Lucia 629","St. Lucia",629,{"$nulls":13},"3420E00000 - CEBU"]
[null,null,{"$f":"CONCATENATE(D430,\" \",E430)","v":"St. Vincent 630"},"St. Vincent",630,{"$nulls":13},"3420F00000 - TACLOBAN"]
[null,null,"Stateless 499","Stateless",499,{"$nulls":13},"3420G00000 - ROXAS"]
[null,null,"Sudan 402","Sudan",402,{"$nulls":13},"3420H00000 - ZAMBOANGA"]
[null,null,"Suriname 678","Suriname",678,{"$nulls":13},"3660A00000 - ROMANIA"]
[null,null,"Swaziland 403","Swaziland",403,{"$nulls":13},"3660B00000 - BUCHAREST ROMANIA"]
[null,null,"Sweden 411","Sweden",411,{"$nulls":13},"3750A00000 - RWANDA"]
[null,null,"Switzerland 575","Switzerland",575,{"$nulls":13},"3750B00000 - KIGALI RWANDA"]
[null,null,"Syria, Arab Rep 414","Syria, Arab Rep",414,{"$nulls":13},"3780A00000 - SAUDI ARABIA"]
[null,null,"Tajikistan 415","Tajikistan",415,{"$nulls":13},"3780B00000 - RIYADH GULF AREA"]
[null,null,"Tanzania,Uni.Re 455","Tanzania,Uni.Re",455,{"$nulls":13},"3780C00000 - ABU DHABI GULF AREA"]
[null,null,"Thailand 420","Thailand",420,{"$nulls":13},"3780D00000 - BAHRAIN GULF AREA"]
[null,null,"Timor-Leste 706","Timor-Leste",706,{"$nulls":13},"3780E00000 - DUBAI GULF AREA"]
[null,null,"Togo 423","Togo",423,{"$nulls":13},"3780F00000 - KUWAIT GULF AREA"]
[null,null,"Tokelau Islands 656","Tokelau Islands",656,{"$nulls":13},"3780G00000 - QATAR GULF AREA"]
[null,null,"Tonga 634","Tonga",634,{"$nulls":13},"3810A00000 - SENEGAL"]
[null,null,"Trinidad,Tobago 429","Trinidad,Tobago",429,{"$nulls":13},"3810B00000 - DAKAR SENEGAL"]
[null,null,"Tunisia 432","Tunisia",432,{"$nulls":13},"3810C00000 - ZIGUINCHOR"]
[null,null,"Turkey 435","Turkey",435,{"$nulls":13},"381RA00000 - WCARO"]
[null,null,"Turkmenistan 436","Turkmenistan",436,{"$nulls":13},"381RB00000 - REG SERV DIV WCAR"]
[null,null,"Turks& Caicosin 636","Turks& Caicosin",636,{"$nulls":13},"3900A00000 - SIERRA LEONE"]
[null,null,"Tuvalu 618","Tuvalu",618,{"$nulls":13},"3900B00000 - FREETOWN SL"]
[null,null,"Uganda 438","Uganda",438,{"$nulls":13},"3900C00000 - KENEMA"]
[null,null,"Ukraine 441","Ukraine",441,{"$nulls":13},"3900D00000 - MAKENI"]
[null,null,"United Kingdom 453","United Kingdom",453,{"$nulls":13},"3920A00000 - SOMALIA"]
[null,null,"United Nations 999","United Nations",999,{"$nulls":13},"3920B00000 - MOGADISCIO SOMALIA"]
[null,null,"Unknown 000","Unknown","000",{"$nulls":13},"3920C00000 - BAIDOA"]
[null,null,"Uruguay 462","Uruguay",462,{"$nulls":13},"3920D00000 - BOSASO"]
[null,null,"USA 456","USA",456,{"$nulls":13},"3920E00000 - GAROOWE"]
[null,null,"Utd.Arab.Emir. 449","Utd.Arab.Emir.",449,{"$nulls":13},"3920F00000 - HARGEISA"]
[null,null,"Uzbekistan 463","Uzbekistan",463,{"$nulls":13},"3920G00000 - JOWHAR"]
[null,null,"Vanuatu 655","Vanuatu",655,{"$nulls":13},"3920H00000 - GAALKACYO"]
[null,null,"Vatican City 535","Vatican City",535,{"$nulls":13},"3920I00000 - WAJID"]
[null,null,"Venezuela 471","Venezuela",471,{"$nulls":13},"3920J00000 - SOMALIA DESK KENYA"]
[null,null,"Vietnam 520","Vietnam",520,{"$nulls":13},"3920K00000 - DOLLOW"]
[null,null,"Wallis,Futuna 661","Wallis,Futuna",661,{"$nulls":13},"3930A00000 - SOUTH AFRICA"]
[null,null,"Western Sahara 691","Western Sahara",691,{"$nulls":13},"3930B00000 - PRETORIA ZA"]
[null,null,"Yemen, Rep of 492","Yemen, Rep of",492,{"$nulls":13},"4020A00000 - SUDAN"]
[null,null,"Yugoslavia 495","Yugoslavia",495,{"$nulls":13},"4020B00000 - KHARTOUM SUDAN"]
[null,null,"Zambia 498","Zambia",498,{"$nulls":13},"4020C00000 - ABYEI"]
[null,null,"Zimbabwe 626","Zimbabwe",626,{"$nulls":13},"4020D00000 - AD DAMAZINE"]
[{"$nulls":18},"4020E00000 - EL FASHER"]
[{"$nulls":18},"4020F00000 - EL GENEINA"]
[null,null,"01 POs/LTAs not permitted (refer to SEU/DB)",{"$nulls":15},"4020G00000 - EL OBEID"]
[null,null,"11 PQ manuf. site. PO with main supplier",{"$nulls":15},"4020H00000 - KADUGLI"]
[null,null,"21 Potential supplier, Not GMP evaluated",{"$nulls":15},"4020I00000 - KASSALA"]
[null,null,"74 Block on vendor`s product for quality",{"$nulls":15},"4020J00000 - NYALA"]
[null,null,"88 Total block on inactive/duplicate vendor",{"$nulls":15},"4020K00000 - ZALINGUEI"]
[null,null,"97 Blocked for ethical reasons (total block)",{"$nulls":15},"4030A00000 - SWAZILAND"]
[null,null,"98 Failed GMP inspection (total block)",{"$nulls":15},"4030B00000 - MBABANE SWAZILAND"]
[null,null,"99 Not recommended by SEU (total block)",{"$nulls":15},"4040A00000 - SOUTH SUDAN"]
[{"$nulls":18},"4040B00000 - JUBA SOUTH SUDAN"]
[null,null,"MF manufacturer",{"$nulls":15},"4040B10000 - JUBA ZONE OFFICE"]
[null,null,"TR trader",{"$nulls":15},"4040C00000 - MALAKAL SOUTH SUDAN"]
[null,null,"HQ headquarter",{"$nulls":15},"4040D00000 - RUMBEK SOUTH SUDAN"]
[null,null,"LO local (sales) office",{"$nulls":15},"4040E00000 - WAU SOUTH SUDAN"]
[null,null,"AP alternative payee",{"$nulls":15},"4040F00000 - BOR SOUTH SUDAN"]
[null,null,"GL global contact point for UNICEF",{"$nulls":15},"4040G00000 - TORIT SOUTH SUDAN"]
[{"$nulls":18},"4040H00000 - KWAJOK SOUTH SUDAN"]
[{"$nulls":18},"4040I00000 - BENTIU SOUTH SUDAN"]
[{"$nulls":18},"4040J00000 - AWEIL SOUTH SUDAN"]
[{"$nulls":18},"4040K00000 - YAMBIO SOUTH SUDAN"]
[{"$nulls":18},"4140A00000 - SYRIA"]
[{"$nulls":18},"4140B00000 - DAMASCUS SYRIA"]
[{"$nulls":18},"4140C00000 - ZO: HOMS"]
[{"$nulls":18},"4140D00000 - ZO: TARTOUS"]
[{"$nulls":18},"4140E00000 - ZO: QAMISHLI"]
[{"$nulls":18},"4140F00000 - ZO: DARA'A"]
[{"$nulls":18},"4140G00000 - ZO: DAMASCUS"]
[{"$nulls":18},"4140H00000 - ZO: ALEPPO"]
[{"$nulls":18},"4150A00000 - TAJIKISTAN"]
[{"$nulls":18},"4150B00000 - DUSHANBE TAJIKISTAN"]
[{"$nulls":18},"4200A00000 - THAILAND"]
[{"$nulls":18},"4200B00000 - BANGKOK THAILAND"]
[{"$nulls":18},"420RA00000 - EAPRO"]
[{"$nulls":18},"420RB00000 - REG SERV DIV EAPR"]
[{"$nulls":18},"4230A00000 - TOGO"]
[{"$nulls":18},"4230B00000 - LOME TOGO"]
[{"$nulls":18},"4320A00000 - TUNISIA"]
[{"$nulls":18},"4320B00000 - TUNIS TUNISIA"]
[{"$nulls":18},"4350A00000 - TURKEY"]
[{"$nulls":18},"4350B00000 - ANKARA TURKEY"]
[{"$nulls":18},"4350C00000 - GAZIANTEP TURKEY"]
[{"$nulls":18},"4360A00000 - REP. OF TURKMENISTAN"]
[{"$nulls":18},"4360B00000 - ASHKHABAD TM"]
[{"$nulls":18},"4380A00000 - UGANDA"]
[{"$nulls":18},"4380B00000 - KAMPALA UGANDA"]
[{"$nulls":18},"4380C00000 - FORT PORTAL"]
[{"$nulls":18},"4380D00000 - GULU"]
[{"$nulls":18},"4380E00000 - MOROTO"]
[{"$nulls":18},"4380F00000 - MBARARA"]
[{"$nulls":18},"4410A00000 - UKRAINE"]
[{"$nulls":18},"4410B00000 - KIEV UKRAINE"]
[{"$nulls":18},"4410C00000 - KHARKIV UKRAINE"]
[{"$nulls":18},"4410D00000 - DONETSK UKRAINE"]
[{"$nulls":18},"4410E00000 - MARIUPOL UKRAINE"]
[{"$nulls":18},"4410F00000 - KRAMATORSK UKRAINE"]
[{"$nulls":18},"4500A00000 - EGYPT"]
[{"$nulls":18},"4500B00000 - CAIRO EGYPT"]
[{"$nulls":18},"4500C00000 - ASYUT"]
[{"$nulls":18},"4550A00000 - TANZANIA UNITED REP"]
[{"$nulls":18},"4550B00000 - DAR ES SALAAM TZ"]
[{"$nulls":18},"4550C00000 - KIGOMA"]
[{"$nulls":18},"4550D00000 - ZANZIBAR"]
[{"$nulls":18},"4550E00000 - IRINGA TANZANIA"]
[{"$nulls":18},"456BB00000 - OED"]
[{"$nulls":18},"456BB00100 - OFFICE OF EXEC DIR"]
[{"$nulls":18},"456BB00200 - OFFICE OF THE OMBUDS"]
[{"$nulls":18},"456CC00000 - DPR"]
[{"$nulls":18},"456CC00100 - DIRECTOR'S OFFICE"]
[{"$nulls":18},"456CC00200 - DATA AND ANALYTICS"]
[{"$nulls":18},"456CC00300 - CPAKM DPS"]
[{"$nulls":18},"456CC00400 - GRCE"]
[{"$nulls":18},"456CC00500 - PSN DRP"]
[{"$nulls":18},"456CC00600 - SIBP DPS"]
[{"$nulls":18},"456CC00700 - STRATEGIC INFO"]
[{"$nulls":18},"456CC00800 - SPPG"]
[{"$nulls":18},"456CC00900 - RESEARCH"]
[{"$nulls":18},"456DD00000 - PROGRAMME DIVISION"]
[{"$nulls":18},"456DD00100 - DIRECTOR'S OFFICE"]
[{"$nulls":18},"456DD00200 - CHILD PROTECTION"]
[{"$nulls":18},"456DD00300 - CSP"]
[{"$nulls":18},"456DD00400 - HIV/AIDS SECTION"]
[{"$nulls":18},"456DD00500 - HEALTH SECTION"]
[{"$nulls":18},"456DD00600 - EDUCATION"]
[{"$nulls":18},"456DD00700 - NUTRITION"]
[{"$nulls":18},"456DD00800 - WATER AND SANITATION"]
[{"$nulls":18},"456DD00900 - GENDER AND RIGHTSPD"]
[{"$nulls":18},"456DD01000 - C4D"]
[{"$nulls":18},"456DD01100 - ADAP"]
[{"$nulls":18},"456DD01200 - DISABILITIES"]
[{"$nulls":18},"456DD01300 - SECRETARIATS PD"]
[{"$nulls":18},"456DD01400 - ECD PD"]
[{"$nulls":18},"456DD01500 - SIP PD"]
[{"$nulls":18},"456DD01600 - ENDVIOLCHILD"]
[{"$nulls":18},"456FF00000 - EMOPS"]
[{"$nulls":18},"456FF00100 - EMOPS NYHQ"]
[{"$nulls":18},"456FF00200 - EMOPS GENEVA"]
[{"$nulls":18},"456GG00000 - DOC"]
[{"$nulls":18},"456GG00100 - DIRECTOR'S OFFICE"]
[{"$nulls":18},"456GG00200 - BRAND SECTION"]
[{"$nulls":18},"456GG00300 - YOUNG PEOPLE"]
[{"$nulls":18},"456GG00400 - PRINT AND LANGUAGE"]
[{"$nulls":18},"456GG00500 - GAR DOC"]
[{"$nulls":18},"456GG00600 - MEDIA SECTION"]
[{"$nulls":18},"456GG00700 - DIGITAL STRATEGY"]
[{"$nulls":18},"456GG00800 - DEVELOP. PROF"]
[{"$nulls":18},"456GG00900 - PUBLIC AFFAIRS"]
[{"$nulls":18},"456GG01000 - PUBLICATIONS"]
[{"$nulls":18},"456GG01100 - INTERNAL COMM"]
[{"$nulls":18},"456GG01200 - SOCIAL & CIVIC MEDIA"]
[{"$nulls":18},"456GG01300 - PLANNING M&E OPS"]
[{"$nulls":18},"456GG01400 - BRAND BUILDING"]
[{"$nulls":18},"456GG01500 - MEDIA RELATIONS"]
[{"$nulls":18},"456HH00000 - GMA"]
[{"$nulls":18},"456HH00100 - DIRECTOR'S OFFICE"]
[{"$nulls":18},"456HH00200 - MSA"]
[{"$nulls":18},"456HH00300 - UN COHERENCE"]
[{"$nulls":18},"456HH00400 - OSEB"]
[{"$nulls":18},"456HH00500 - UNIA"]
[{"$nulls":18},"456II00000 - PPD"]
[{"$nulls":18},"456II00100 - PPD NEW YORK"]
[{"$nulls":18},"456II00200 - PPD BRUSSELS"]
[{"$nulls":18},"456II00300 - PPD TOKYO"]
[{"$nulls":18},"456II00400 - GOVT. PARTNERSHIPS"]
[{"$nulls":18},"456II00500 - M & I PARTNERSHIPS"]
[{"$nulls":18},"456II00600 - POST 2015"]
[{"$nulls":18},"456II00700 - PPD GENEVA"]
[{"$nulls":18},"456JJ00000 - DFAM"]
[{"$nulls":18},"456JJ00100 - COMPTROLLER'S OFFICE"]
[{"$nulls":18},"456JJ00200 - FINANCE SECTION"]
[{"$nulls":18},"456JJ00300 - ACCOUNTS SECTION"]
[{"$nulls":18},"456JJ00400 - BUDGET SECTION"]
[{"$nulls":18},"456JJ00500 - ADMIN SERVICES"]
[{"$nulls":18},"456JJ00600 - IPSAS"]
[{"$nulls":18},"456KK00000 - DHR"]
[{"$nulls":18},"456KK00100 - DIRECTOR'S OFFICE"]
[{"$nulls":18},"456KK00200 - STAFF WELL BEING SEC"]
[{"$nulls":18},"456KK00300 - MOBILITY & STAFFING"]
[{"$nulls":18},"456KK00400 - ORG LEARNING & DEV"]
[{"$nulls":18},"456KK00500 - HRSS"]
[{"$nulls":18},"456KK00600 - NETI"]
[{"$nulls":18},"456KK00700 - GLOBAL STAFF ASSOC"]
[{"$nulls":18},"456KK00800 - POLICY & ADMIN LAW"]
[{"$nulls":18},"456KK00900 - HRBP PP"]
[{"$nulls":18},"456KK01000 - HRPP OPERATIONS"]
[{"$nulls":18},"456KK01100 - HRBP ERCOD"]
[{"$nulls":18},"456KK01200 - HRBP EMERGENCIES"]
[{"$nulls":18},"456KK01300 - NY STAFF ASSOCIATION"]
[{"$nulls":18},"456KK01400 - UNICEF STAFF NEWS"]
[{"$nulls":18},"456KK01500 - ESRS DHR"]
[{"$nulls":18},"456KK01600 - RRS DHR"]
[{"$nulls":18},"456LL00000 - ITSSD"]
[{"$nulls":18},"456LL00100 - DIRECTOR'S OFFICE"]
[{"$nulls":18},"456LL00200 - PPPA"]
[{"$nulls":18},"456LL00300 - ADMINISTRATIVE SERV"]
[{"$nulls":18},"456LL00400 - IT KMS (INTERNET)"]
[{"$nulls":18},"456LL00500 - ITACFS"]
[{"$nulls":18},"456LL00600 - TECHNICAL ARCHI"]
[{"$nulls":18},"456LL00700 - IT OPERATIONS"]
[{"$nulls":18},"456LL00800 - IT SECURITY"]
[{"$nulls":18},"456LL00900 - ITAFS"]
[{"$nulls":18},"456NN00000 - OIAI"]
[{"$nulls":18},"456NN00100 - OIAI SECTION"]
[{"$nulls":18},"456OO00000 - EVALUATION OFFICE"]
[{"$nulls":18},"456OO00100 - EVALUATION OFFICE"]
[{"$nulls":18},"456QQ00000 - GSCC PROJECT"]
[{"$nulls":18},"456QQ00100 - GSCC PROJECT SECTION"]
[{"$nulls":18},"456RR00000 - FRG OFFICE"]
[{"$nulls":18},"456RR00100 - FRG SECTION"]
[{"$nulls":18},"456SS00000 - EB SECRETARY OFFICE"]
[{"$nulls":18},"456SS00100 - EB SECR OFF SECTION"]
[{"$nulls":18},"4590A00000 - BURKINA FASO"]
[{"$nulls":18},"4590B00000 - OUAGADOUGOU BF"]
[{"$nulls":18},"4590C00000 - DORI BURKINA FASO"]
[{"$nulls":18},"4620A00000 - URUGUAY"]
[{"$nulls":18},"4620B00000 - MONTEVIDEO URUGUAY"]
[{"$nulls":18},"4630A00000 - REP OF UZBEKISTAN"]
[{"$nulls":18},"4630B00000 - TASHKENT UZBEKISTAN"]
[{"$nulls":18},"4710A00000 - VENEZUELA"]
[{"$nulls":18},"4710B00000 - CARACAS VENEZUELA"]
[{"$nulls":18},"4920A00000 - YEMEN"]
[{"$nulls":18},"4920B00000 - SANA'A YEMEN"]
[{"$nulls":18},"4920C00000 - ADEN"]
[{"$nulls":18},"4920D00000 - HODAIDAH"]
[{"$nulls":18},"4920E00000 - TA'IZZ"]
[{"$nulls":18},"4920F00000 - SA'ADA"]
[{"$nulls":18},"4920G00000 - SEYOUN"]
[{"$nulls":18},"4920H00000 - HARAD"]
[{"$nulls":18},"4920I00000 - DHALE"]
[{"$nulls":18},"4920J00000 - IBB"]
[{"$nulls":18},"4920K00000 - MUKALAH YEMEN"]
[{"$nulls":18},"4980A00000 - ZAMBIA"]
[{"$nulls":18},"4980B00000 - LUSAKA ZAMBIA"]
[{"$nulls":18},"5070A00000 - BANGLADESH"]
[{"$nulls":18},"5070B00000 - DHAKA BANGLADESH"]
[{"$nulls":18},"5070C00000 - BARISAL"]
[{"$nulls":18},"5070D00000 - COMILLA"]
[{"$nulls":18},"5070E00000 - COX BAZAAR"]
[{"$nulls":18},"5070F00000 - JESSORE"]
[{"$nulls":18},"5070G00000 - MYMENSINGH"]
[{"$nulls":18},"5070H00000 - RANGAMATI"]
[{"$nulls":18},"5070I00000 - RANGPUR"]
[{"$nulls":18},"5070J00000 - SYLHET"]
[{"$nulls":18},"5070K00000 - THAKURGAON"]
[{"$nulls":18},"5070L00000 - BOGRA"]
[{"$nulls":18},"5070M00000 - CHITTAGONG"]
[{"$nulls":18},"5070N00000 - KHULNA"]
[{"$nulls":18},"5070P00000 - DHAKA CITY"]
[{"$nulls":18},"5150A00000 - DPR OF KOREA"]
[{"$nulls":18},"5150B00000 - PYONGYANG DPRK"]
[{"$nulls":18},"5200A00000 - VIETNAM"]
[{"$nulls":18},"5200B00000 - HANOI VIETNAM"]
[{"$nulls":18},"5200C00000 - HO CHI MINH CTY"]
[{"$nulls":18},"5640A00000 - MOLDOVA"]
[{"$nulls":18},"5640B00000 - CHISINAU MOLDOVA"]
[{"$nulls":18},"5750A00000 - PFP"]
[{"$nulls":18},"5750A00100 - COS IT"]
[{"$nulls":18},"5750A00101 - CODAS"]
[{"$nulls":18},"5750A00102 - SPICE"]
[{"$nulls":18},"5750A00103 - DIRECTOR'S OFFICE"]
[{"$nulls":18},"5750A00200 - COS OPERATIONS"]
[{"$nulls":18},"5750A00201 - DD O&F"]
[{"$nulls":18},"5750A00202 - FINANCE SECTION"]
[{"$nulls":18},"5750A00203 - PROCUREMENT"]
[{"$nulls":18},"5750A00300 - COS FINANCE"]
[{"$nulls":18},"5750A00301 - PFP HR"]
[{"$nulls":18},"5750A00400 - COS HUMAN RESOURCES"]
[{"$nulls":18},"5750A00500 - STRATEGIC PARTNRSHPS"]
[{"$nulls":18},"5750A00501 - DD PSE"]
[{"$nulls":18},"5750A00502 - CHILD RIGHTS & BUS."]
[{"$nulls":18},"5750A00503 - ADV & INNOV PSHIPS"]
[{"$nulls":18},"5750A00600 - CHILD RIGHT ADVOCACY"]
[{"$nulls":18},"5750A00601 - DD PSFR"]
[{"$nulls":18},"5750A00602 - MARKET KNOWLEDGE"]
[{"$nulls":18},"5750A00603 - FUNDRAISING SERVICES"]
[{"$nulls":18},"5750A00604 - GLOBAL PHILANTHROPY"]
[{"$nulls":18},"5750A00605 - PROGRAMME SERVICES"]
[{"$nulls":18},"5750A00606 - CORPORATE FUNDRSNG"]
[{"$nulls":18},"5750A00607 - MARKET DEVELOPMENT"]
[{"$nulls":18},"5750A00608 - INVESTMENT FUNDS"]
[{"$nulls":18},"5750A00700 - CORP SOCIAL RESP"]
[{"$nulls":18},"5750A00800 - COMM & BRAND POS"]
[{"$nulls":18},"5750A00901 - DD NAT COM RELATION"]
[{"$nulls":18},"5750A00902 - RELATIONSHIPS TEAM 1"]
[{"$nulls":18},"5750A00903 - RELATIONSHIPS TEAM 2"]
[{"$nulls":18},"5750A00906 - GOVERNANCE"]
[{"$nulls":18},"5750P00000 - PFP"]
[{"$nulls":18},"5750P00100 - GOV & SYS DIR'S OFF"]
[{"$nulls":18},"5750P00101 - COUNTRY OFFICE D&S"]
[{"$nulls":18},"5750P00102 - STRATEGIC PLANNING"]
[{"$nulls":18},"5750P00200 - MGT OF FIN.RESOURCES"]
[{"$nulls":18},"5750P00201 - DY. DIR FIN & OPS"]
[{"$nulls":18},"5750P00202 - FINANCE SECTION"]
[{"$nulls":18},"5750P00203 - PROCUREMENT"]
[{"$nulls":18},"5750P00204 - ALLOC COMMON SERV"]
[{"$nulls":18},"5750P00300 - MGT OF HUM CAP: HR"]
[{"$nulls":18},"5750P00400 - ADVOCACY"]
[{"$nulls":18},"5750P00500 - CORP SOCIAL RESP"]
[{"$nulls":18},"5750P00501 - MARKET DEVELOPMENT"]
[{"$nulls":18},"5750P00600 - STRATEGIC INFO & INV"]
[{"$nulls":18},"5750P00601 - DY.DIRCENTRLFUNDRSNG"]
[{"$nulls":18},"5750P00602 - MARKET KNOWLEDGE"]
[{"$nulls":18},"5750P00603 - CENTRL FUNDRSNG SERV"]
[{"$nulls":18},"5750P00604 - GLOBAL PHILANTHROPY"]
[{"$nulls":18},"5750P00605 - PROG-DONOR MATCHING"]
[{"$nulls":18},"5750P00606 - CORPORATE FUNDRSNG"]
[{"$nulls":18},"5750P00607 - MARKET DEVELOPMENT"]
[{"$nulls":18},"5750P00700 - SALES OF CARDS&PRODS"]
[{"$nulls":18},"5750P00701 - DY.DIR CARDS & PRODS"]
[{"$nulls":18},"5750P00702 - GLOBAL SUPPLY CHAIN"]
[{"$nulls":18},"5750P00703 - QUALITY MANAGEMENT"]
[{"$nulls":18},"5750P00704 - GLOBL MKTG & BUS DEV"]
[{"$nulls":18},"5750P00800 - COMM & BRAND POS"]
[{"$nulls":18},"5750P00900 - STRATEGIC DIRECTION"]
[{"$nulls":18},"5750P00901 - DY.DIR NATL COM REL"]
[{"$nulls":18},"5750P00902 - RELATIONSHIPS TEAM 1"]
[{"$nulls":18},"5750P00903 - RELATIONSHIPS TEAM 2"]
[{"$nulls":18},"5750P00904 - RELATIONSHIPS TEAM 3"]
[{"$nulls":18},"5750P00905 - RELATIONSHIPS TEAM 4"]
[{"$nulls":18},"5750P00906 - GOVERNANCE"]
[{"$nulls":18},"575CA00000 - GENEVA COS"]
[{"$nulls":18},"575CA00100 - COS IT"]
[{"$nulls":18},"575CA00200 - COS OPERATIONS"]
[{"$nulls":18},"575CA00300 - COS FINANCE"]
[{"$nulls":18},"575CA00400 - COS HUMAN RESOURCES"]
[{"$nulls":18},"575RA00000 - CEE/CIS"]
[{"$nulls":18},"575RB00000 - REG SERV DIVCEE/CIS"]
[{"$nulls":18},"575RC00000 - MOSCOW RUSSIA PO"]
[{"$nulls":18},"6110A00000 - BELIZE"]
[{"$nulls":18},"6110B00000 - BELIZE CITY BELIZE"]
[{"$nulls":18},"6260A00000 - ZIMBABWE"]
[{"$nulls":18},"6260B00000 - HARARE ZIMBABWE"]
[{"$nulls":18},"6260C00000 - BULAWAYO ZIMBABWE"]
[{"$nulls":18},"6350A00000 - OMAN"]
[{"$nulls":18},"6350B00000 - MUSCAT OMAN"]
[{"$nulls":18},"6490A00000 - PAPUA NEW GUINEA"]
[{"$nulls":18},"6490B00000 - PORT MORESBY PNG"]
[{"$nulls":18},"6490C00000 - BUKA"]
[{"$nulls":18},"6490D00000 - GOROKA"]
[{"$nulls":18},"6620A00000 - COMOROS"]
[{"$nulls":18},"6620B00000 - MORONI COMOROS"]
[{"$nulls":18},"6690A00000 - DJIBOUTI"]
[{"$nulls":18},"6690B00000 - DJIBOUTI DJIBOUTI"]
[{"$nulls":18},"6810A00000 - ANGOLA"]
[{"$nulls":18},"6810B00000 - LUANDA ANGOLA"]
[{"$nulls":18},"6810C00000 - KUNENE"]
[{"$nulls":18},"6810D00000 - LUBANGO"]
[{"$nulls":18},"6810E00000 - LUENA"]
[{"$nulls":18},"6810F00000 - KUITO BIE"]
[{"$nulls":18},"6820A00000 - CABO VERDE"]
[{"$nulls":18},"6820B00000 - PRAIA CABO VERDE"]
[{"$nulls":18},"6830A00000 - SAO TOME PRINCIPE"]
[{"$nulls":18},"6830B00000 - SAO TOME STP"]
[{"$nulls":18},"6850A00000 - GUINEA BISSAU"]
[{"$nulls":18},"6850B00000 - BISSAUGUINEA BISSAU"]
[{"$nulls":18},"6890A00000 - REP. OF MOZAMBIQUE"]
[{"$nulls":18},"6890B00000 - MAPUTO MOZAMBIQUE"]
[{"$nulls":18},"6980A00000 - NAMIBIA"]
[{"$nulls":18},"6980B00000 - WINDHOEK NAMIBIA"]
[{"$nulls":18},"7050A00000 - STATE OF PALESTINE"]
[{"$nulls":18},"7050B00000 - EAST JERUSALEM"]
[{"$nulls":18},"7050C00000 - GAZA"]
[{"$nulls":18},"7050D00000 - HEBRON"]
[{"$nulls":18},"7050E00000 - KHAN YUNIS"]
[{"$nulls":18},"7050F00000 - NABLUS"]
[{"$nulls":18},"7050G00000 - RAFAH"]
[{"$nulls":18},"7050H00000 - RAMALLAH"]
[{"$nulls":18},"7060A00000 - TIMOR-LESTE"]
[{"$nulls":18},"7060B00000 - DILI TIMOR-LESTE"]
[{"$nulls":18},"8950A00000 - REP. OF MONTENEGRO"]
[{"$nulls":18},"8950B00000 - PODGORICAMONTENEGRO"]
[{"$nulls":18},"8970A00000 - REPUBLIC OF SERBIA"]
[{"$nulls":18},"8970B00000 - BELGRADE  SERBIA"]
[{"$nulls":18},"8971A00000 - KOSOVO"]
[{"$nulls":18},"8971B00000 - PRISTINA KOSOVO"]
[{"$nulls":18},"8971C00000 - ZVECAN KOSOVO"]

{"sheet":"PAyment terms","index":12,"n_rows":117,"n_cols":10,"rows_kept":117,"cut":false,"hidden":true,"merged":[]}
["PayT","Own explanation"]
[]
[null,1,"Payable immediately Due net"]
[null,2,"within 14 days 3 % cash discount"]
[null,null,"within 30 days 2 % cash discount"]
[null,null,"within 45 days Due net"]
[null,3,"For incoming invoices until 15 of the month"]
[null,null,"  within 14 days 2 % cash discount"]
[null,null,"  within 30 days 1.5 % cash discount"]
[null,null,"  within 45 days Due net"]
[null,null,"  Baseline date on 30 of the month"]
[null,null,"For incoming invoices until End  of the month"]
[null,null,"  within 14 days 2.125 % cash discount"]
[null,null,"  within 30 days 1.5 % cash discount"]
[null,null,"  within 45 days Due net"]
[null,null,"  Baseline date on 15 of next month"]
[null,4,"within 14 days 3 % cash discount"]
[null,null,"within 30 days 1 % cash discount"]
[null,null,"within 60 days Due net"]
[null,5,"within 10 days 2 % cash discount"]
[null,null,"within 30 days 1 % cash discount"]
[null,null,"within 50 days Due net"]
[null,6,"Before End of the month 4 % cash discount"]
[null,null,"Before 15 of the next month ;; 2 % cash discount"]
[null,null,"Before 15 in 2 months Due net"]
[null,7,"within 14 days 4 % cash discount"]
[null,null,"within 30 days 2 % cash discount"]
[null,null,"within 60 days Due net"]
[null,8,"Payable immediately Due net"]
[null,null,"Baseline date on End of the month"]
[null,9,"For incoming invoices until 15 of the month"]
[null,null,"  Before 15 of the next month ;; 2.125 % cash disc"]
[null,null,"  Before End of the next month ;; Due net"]
[null,null,"For incoming invoices until End  of the month"]
[null,null,"  Before End of the next month ;; 2.125 % cash dis"]
[null,null,"  Before 15 in 2 months Due net"]
[null,10,"Payable immediately Due net"]
[null,null,"Baseline date on 10 of next month"]
[null,11,"within 10 days 3 % cash discount"]
[null,12,"Payable immediately Due net"]
[null,null,"Baseline date on 11 of next month"]
[null,14,"within 10 days 5 % cash discount"]
[null,15,"within 10 days 3 % cash discount"]
[null,null,"within 15 days 2 % cash discount"]
[null,null,"within 20 days Due net"]
[null,16,"within 14 days 3 % cash discount"]
[null,null,"within 20 days 2 % cash discount"]
[null,null,"within 30 days Due net"]
[null,17,"Payable in 3 partial amounts"]
[null,null,"1 installment: 30.000 % with payment term 0001"]
[null,null,"2 installment: 40.000 % with payment term 0001"]
[null,null,"3 installment: 30.000 % with payment term 0001"]
[null,"Y000","Payment due in 30 days"]
[null,"Y001","within 29 days 2 % cash discount"]
[null,null,"within 30 days Due net"]
[null,"Y002","within 30 days Due net"]
[null,"Y003","For incoming invoices until 15 of the month"]
[null,null,"  within 10 days 3 % cash discount"]
[null,null,"  within 29 days 1.5 % cash discount"]
[null,null,"  within 30 days Due net"]
[null,"Y004","within 10 days 1 % cash discount"]
[null,null,"within 30 days Due net"]
[null,"Y005","within 12 days 2 % cash discount"]
[null,null,"within 30 days Due net"]
[null,"Y010","Payment due in 10 days(Without discount)"]
[null,"Y020","Payment due in 20 days(Without discount)"]
[null,"Y100","Payment due in 30 days"]
[null,"Y101","within 29 days 2 % cash discount"]
[null,null,"within 30 days Due net"]
[null,"Y103","For incoming invoices until 15 of the month"]
[null,null,"  within 10 days 3 % cash discount"]
[null,null,"  within 29 days 1.5 % cash discount"]
[null,null,"  within 30 days Due net"]
[null,"Y104","within 7 days 0.5 % cash discount"]
[null,null,"within 30 days Due net"]
[null,"Y105","within 7 days 0.7 % cash discount"]
[null,null,"within 30 days Due net"]
[null,"Y106","within 10 days 1 % cash discount"]
[null,null,"within 30 days Due net"]
[null,"Y107","within 10 days 1.5 % cash discount"]
[null,null,"within 30 days Due net"]
[null,"Y108","within 10 days 2 % cash discount"]
[null,null,"within 30 days Due net"]
[null,"Y109","within 10 days 3 % cash discount"]
[null,null,"within 30 days Due net"]
[null,"Y110","within 15 days 0.5 % cash discount"]
[null,null,"within 30 days Due net"]
[null,"Y111","within 15 days 0.55 % cash discount"]
[null,null,"within 30 days Due net"]
[null,"Y112","within 15 days 0.6 % cash discount"]
[null,null,"within 30 days Due net"]
[null,"Y113","within 15 days 1 % cash discount"]
[null,null,"within 30 days Due net"]
[null,"Y114","within 15 days 2 % cash discount"]
[null,null,"within 30 days Due net"]
[null,"Z000","Up-front payment",{"$f":"B96&\" \"&C96","v":"Z000 Up-front payment"},{"$nulls":5},"abognar"]
[null,"Z002","(4) equal quarterly payments",{"$f":"B97&\" \"&C97","v":"Z002 (4) equal quarterly payments"},{"$nulls":5},"alingauer"]
[null,"Z003","Reimbursement of expenses","Z003 Reimbursement of expenses",{"$nulls":5},"ekovacs"]
[null,"Z004","(2) six-months payment","Z004 (2) six-months payment",{"$nulls":5},"dkerti"]
[null,"Z005","ECHO: (2) instalments","Z005 ECHO: (2) instalments",{"$nulls":5},"nzodor"]
[null,"Z006","ECHO (80% advance)","Z006 ECHO (80% advance)",{"$nulls":5},"rhadzsala"]
[null,"Z010","Automatic payment block;pay immediately - NY","Z010 Automatic payment block;pay immediately - NY",{"$nulls":5},"ssleigh"]
[null,"Z020","Within 30 days Due net - NY","Z020 Within 30 days Due net - NY",{"$nulls":5},"znagy"]
[null,"Z110","Automatic payment block;pay immediately - CPH","Z110 Automatic payment block;pay immediately - CPH",{"$nulls":5},"znemeth"]
[null,"Z120","Within 30 days Due net","Z120 Within 30 days Due net"]
[null,"Z121","3% 15 days, Within 30 days Due net","Z121 3% 15 days, Within 30 days Due net"]
[null,"Z122","Within 10 days 3 % cash discount","Z122 Within 10 days 3 % cash discount"]
[null,"Z123","Within 15 days 2.5% cash discount","Z123 Within 15 days 2.5% cash discount"]
[null,"Z124","Within 20 days 2% cash discount","Z124 Within 20 days 2% cash discount"]
[null,"Z125","10 days 3%, 15 days 2.5%, 30 days net","Z125 10 days 3%, 15 days 2.5%, 30 days net"]
[null,"Z126","15 days 2.5%, 20 days 2%, 30 days net","Z126 15 days 2.5%, 20 days 2%, 30 days net"]
[null,"Z127","10 days 3%, 20 days 2%, 30 days net","Z127 10 days 3%, 20 days 2%, 30 days net"]
[null,"Z910","30 days net (direct disbursement by partner)","Z910 30 days net (direct disbursement by partner)"]
[null,"Z911","Donations - Not for disbursement","Z911 Donations - Not for disbursement"]
[null,"Z913","Prepaid","Z913 Prepaid"]
[null,"Z914","For Pre-payments","Z914 For Pre-payments"]
[null,"Z915","30 days net (direct disbursement by KfW)","Z915 30 days net (direct disbursement by KfW)"]